{
  "data_features": {
    "feature": [
      {
        "data_type": "nominal",
        "index": "0",
        "is_ignore": "false",
        "is_row_identifier": "true",
        "is_target": "false",
        "name": "molecule_id",
        "nominal_value": [
          "CHEMBL10",
          "CHEMBL100391",
          "CHEMBL100664",
          "CHEMBL100675",
          "CHEMBL100811",
          "CHEMBL100945",
          "CHEMBL100979",
          "CHEMBL101019",
          "CHEMBL101052",
          "CHEMBL101119",
          "CHEMBL101156",
          "CHEMBL101253",
          "CHEMBL101311",
          "CHEMBL101468",
          "CHEMBL101473",
          "CHEMBL101557",
          "CHEMBL101558",
          "CHEMBL101679",
          "CHEMBL101779",
          "CHEMBL101810",
          "CHEMBL101868",
          "CHEMBL101887",
          "CHEMBL102008",
          "CHEMBL102047",
          "CHEMBL102136",
          "CHEMBL102622",
          "CHEMBL102926",
          "CHEMBL103355",
          "CHEMBL103633",
          "CHEMBL103667",
          "CHEMBL105442",
          "CHEMBL1083150",
          "CHEMBL1083151",
          "CHEMBL1083152",
          "CHEMBL1083484",
          "CHEMBL1083785",
          "CHEMBL1083786",
          "CHEMBL1084454",
          "CHEMBL1084629",
          "CHEMBL1084630",
          "CHEMBL1084715",
          "CHEMBL1084969",
          "CHEMBL1085626",
          "CHEMBL1086088",
          "CHEMBL1087397",
          "CHEMBL1090143",
          "CHEMBL115220",
          "CHEMBL1173655",
          "CHEMBL119385",
          "CHEMBL120077",
          "CHEMBL1208600",
          "CHEMBL1229717",
          "CHEMBL1230020",
          "CHEMBL1230170",
          "CHEMBL1236107",
          "CHEMBL1241566",
          "CHEMBL1241567",
          "CHEMBL1241662",
          "CHEMBL1241674",
          "CHEMBL1241849",
          "CHEMBL1242367",
          "CHEMBL1242833",
          "CHEMBL124660",
          "CHEMBL1271564",
          "CHEMBL1271898",
          "CHEMBL1272116",
          "CHEMBL1272171",
          "CHEMBL1287853",
          "CHEMBL1289926",
          "CHEMBL133498",
          "CHEMBL1336",
          "CHEMBL139653",
          "CHEMBL140584",
          "CHEMBL141247",
          "CHEMBL1421",
          "CHEMBL142425",
          "CHEMBL142788",
          "CHEMBL142789",
          "CHEMBL143570",
          "CHEMBL14762",
          "CHEMBL1614701",
          "CHEMBL162",
          "CHEMBL16484",
          "CHEMBL1721885",
          "CHEMBL177688",
          "CHEMBL178737",
          "CHEMBL1789941",
          "CHEMBL180022",
          "CHEMBL183158",
          "CHEMBL1834657",
          "CHEMBL183941",
          "CHEMBL184115",
          "CHEMBL184253",
          "CHEMBL184510",
          "CHEMBL185099",
          "CHEMBL185310",
          "CHEMBL185323",
          "CHEMBL185854",
          "CHEMBL185871",
          "CHEMBL185914",
          "CHEMBL185971",
          "CHEMBL186054",
          "CHEMBL186101",
          "CHEMBL186163",
          "CHEMBL186288",
          "CHEMBL186290",
          "CHEMBL186680",
          "CHEMBL186708",
          "CHEMBL186800",
          "CHEMBL186890",
          "CHEMBL187006",
          "CHEMBL187081",
          "CHEMBL187139",
          "CHEMBL188312",
          "CHEMBL188392",
          "CHEMBL188417",
          "CHEMBL188665",
          "CHEMBL188785",
          "CHEMBL188938",
          "CHEMBL189136",
          "CHEMBL189235",
          "CHEMBL189352",
          "CHEMBL189455",
          "CHEMBL189607",
          "CHEMBL189963",
          "CHEMBL190460",
          "CHEMBL1908391",
          "CHEMBL1908392",
          "CHEMBL1908393",
          "CHEMBL1908394",
          "CHEMBL1908395",
          "CHEMBL1908396",
          "CHEMBL1908397",
          "CHEMBL194721",
          "CHEMBL195029",
          "CHEMBL195641",
          "CHEMBL1980391",
          "CHEMBL201511",
          "CHEMBL210540",
          "CHEMBL211514",
          "CHEMBL212049",
          "CHEMBL213364",
          "CHEMBL213770",
          "CHEMBL213805",
          "CHEMBL214253",
          "CHEMBL214329",
          "CHEMBL214609",
          "CHEMBL214913",
          "CHEMBL215116",
          "CHEMBL215117",
          "CHEMBL215152",
          "CHEMBL215803",
          "CHEMBL219557",
          "CHEMBL221959",
          "CHEMBL223360",
          "CHEMBL230011",
          "CHEMBL2309006",
          "CHEMBL2309609",
          "CHEMBL2312181",
          "CHEMBL2322701",
          "CHEMBL23254",
          "CHEMBL23327",
          "CHEMBL235157",
          "CHEMBL235345",
          "CHEMBL24828",
          "CHEMBL248760",
          "CHEMBL249697",
          "CHEMBL254170",
          "CHEMBL254171",
          "CHEMBL254367",
          "CHEMBL254979",
          "CHEMBL255255",
          "CHEMBL255262",
          "CHEMBL255263",
          "CHEMBL255463",
          "CHEMBL255718",
          "CHEMBL255863",
          "CHEMBL255932",
          "CHEMBL256558",
          "CHEMBL257831",
          "CHEMBL258039",
          "CHEMBL258040",
          "CHEMBL258765",
          "CHEMBL258805",
          "CHEMBL259084",
          "CHEMBL260864",
          "CHEMBL261849",
          "CHEMBL264345",
          "CHEMBL271190",
          "CHEMBL280074",
          "CHEMBL281957",
          "CHEMBL288441",
          "CHEMBL289422",
          "CHEMBL290904",
          "CHEMBL291324",
          "CHEMBL295127",
          "CHEMBL295398",
          "CHEMBL295484",
          "CHEMBL296468",
          "CHEMBL296666",
          "CHEMBL297412",
          "CHEMBL297447",
          "CHEMBL297614",
          "CHEMBL298445",
          "CHEMBL299763",
          "CHEMBL300138",
          "CHEMBL301483",
          "CHEMBL316809",
          "CHEMBL316887",
          "CHEMBL317281",
          "CHEMBL317378",
          "CHEMBL317445",
          "CHEMBL317629",
          "CHEMBL318188",
          "CHEMBL318461",
          "CHEMBL318485",
          "CHEMBL319467",
          "CHEMBL31965",
          "CHEMBL322019",
          "CHEMBL322640",
          "CHEMBL328623",
          "CHEMBL336242",
          "CHEMBL359554",
          "CHEMBL359623",
          "CHEMBL359794",
          "CHEMBL359963",
          "CHEMBL359999",
          "CHEMBL360206",
          "CHEMBL360530",
          "CHEMBL360596",
          "CHEMBL361697",
          "CHEMBL361894",
          "CHEMBL362558",
          "CHEMBL362588",
          "CHEMBL362722",
          "CHEMBL362814",
          "CHEMBL363058",
          "CHEMBL364172",
          "CHEMBL364408",
          "CHEMBL364587",
          "CHEMBL364623",
          "CHEMBL364631",
          "CHEMBL364767",
          "CHEMBL364935",
          "CHEMBL365046",
          "CHEMBL365229",
          "CHEMBL365245",
          "CHEMBL365248",
          "CHEMBL365608",
          "CHEMBL372464",
          "CHEMBL373101",
          "CHEMBL377300",
          "CHEMBL379218",
          "CHEMBL383961",
          "CHEMBL384304",
          "CHEMBL385013",
          "CHEMBL385070",
          "CHEMBL385362",
          "CHEMBL385415",
          "CHEMBL385744",
          "CHEMBL385945",
          "CHEMBL386051",
          "CHEMBL386467",
          "CHEMBL386796",
          "CHEMBL38693",
          "CHEMBL38694",
          "CHEMBL387267",
          "CHEMBL388956",
          "CHEMBL391738",
          "CHEMBL393929",
          "CHEMBL396377",
          "CHEMBL402157",
          "CHEMBL402158",
          "CHEMBL402370",
          "CHEMBL402759",
          "CHEMBL40326",
          "CHEMBL403605",
          "CHEMBL40362",
          "CHEMBL404504",
          "CHEMBL407095",
          "CHEMBL409506",
          "CHEMBL409861",
          "CHEMBL410643",
          "CHEMBL415789",
          "CHEMBL418203",
          "CHEMBL418793",
          "CHEMBL419534",
          "CHEMBL419720",
          "CHEMBL421583",
          "CHEMBL424696",
          "CHEMBL424722",
          "CHEMBL425438",
          "CHEMBL427045",
          "CHEMBL428690",
          "CHEMBL430507",
          "CHEMBL430854",
          "CHEMBL431336",
          "CHEMBL432116",
          "CHEMBL433068",
          "CHEMBL434337",
          "CHEMBL43828",
          "CHEMBL44063",
          "CHEMBL44119",
          "CHEMBL442957",
          "CHEMBL443169",
          "CHEMBL445757",
          "CHEMBL445813",
          "CHEMBL446024",
          "CHEMBL44712",
          "CHEMBL447317",
          "CHEMBL447758",
          "CHEMBL449818",
          "CHEMBL45001",
          "CHEMBL450383",
          "CHEMBL450786",
          "CHEMBL451298",
          "CHEMBL452447",
          "CHEMBL452812",
          "CHEMBL45408",
          "CHEMBL45477",
          "CHEMBL455428",
          "CHEMBL455931",
          "CHEMBL456112",
          "CHEMBL456113",
          "CHEMBL456121",
          "CHEMBL456143",
          "CHEMBL456378",
          "CHEMBL456584",
          "CHEMBL456759",
          "CHEMBL456760",
          "CHEMBL456796",
          "CHEMBL456797",
          "CHEMBL456964",
          "CHEMBL456965",
          "CHEMBL456995",
          "CHEMBL457179",
          "CHEMBL457180",
          "CHEMBL457190",
          "CHEMBL457191",
          "CHEMBL457390",
          "CHEMBL457401",
          "CHEMBL457887",
          "CHEMBL457888",
          "CHEMBL457979",
          "CHEMBL458075",
          "CHEMBL458076",
          "CHEMBL45827",
          "CHEMBL458547",
          "CHEMBL46181",
          "CHEMBL463383",
          "CHEMBL463384",
          "CHEMBL46401",
          "CHEMBL46429",
          "CHEMBL464552",
          "CHEMBL46474",
          "CHEMBL46817",
          "CHEMBL468963",
          "CHEMBL47132",
          "CHEMBL47249",
          "CHEMBL47276",
          "CHEMBL47302",
          "CHEMBL475251",
          "CHEMBL47527",
          "CHEMBL47590",
          "CHEMBL47636",
          "CHEMBL47690",
          "CHEMBL476907",
          "CHEMBL477063",
          "CHEMBL477064",
          "CHEMBL477073",
          "CHEMBL477077",
          "CHEMBL477259",
          "CHEMBL477772",
          "CHEMBL477860",
          "CHEMBL477861",
          "CHEMBL477862",
          "CHEMBL477863",
          "CHEMBL477877",
          "CHEMBL478409",
          "CHEMBL478487",
          "CHEMBL478488",
          "CHEMBL48019",
          "CHEMBL48109",
          "CHEMBL482678",
          "CHEMBL482679",
          "CHEMBL482883",
          "CHEMBL482918",
          "CHEMBL482919",
          "CHEMBL482967",
          "CHEMBL483081",
          "CHEMBL483514",
          "CHEMBL483530",
          "CHEMBL483535",
          "CHEMBL483590",
          "CHEMBL48362",
          "CHEMBL483728",
          "CHEMBL484274",
          "CHEMBL484288",
          "CHEMBL484477",
          "CHEMBL485502",
          "CHEMBL485503",
          "CHEMBL485618",
          "CHEMBL485877",
          "CHEMBL485878",
          "CHEMBL485892",
          "CHEMBL486091",
          "CHEMBL48614",
          "CHEMBL486284",
          "CHEMBL486285",
          "CHEMBL486286",
          "CHEMBL486301",
          "CHEMBL486302",
          "CHEMBL486487",
          "CHEMBL486497",
          "CHEMBL486711",
          "CHEMBL486712",
          "CHEMBL487254",
          "CHEMBL487326",
          "CHEMBL487327",
          "CHEMBL487328",
          "CHEMBL487521",
          "CHEMBL487526",
          "CHEMBL487531",
          "CHEMBL487532",
          "CHEMBL487730",
          "CHEMBL487731",
          "CHEMBL487737",
          "CHEMBL488128",
          "CHEMBL488271",
          "CHEMBL488342",
          "CHEMBL488349",
          "CHEMBL488436",
          "CHEMBL488548",
          "CHEMBL488549",
          "CHEMBL488562",
          "CHEMBL488646",
          "CHEMBL488811",
          "CHEMBL488955",
          "CHEMBL489030",
          "CHEMBL489039",
          "CHEMBL489083",
          "CHEMBL489244",
          "CHEMBL489245",
          "CHEMBL489246",
          "CHEMBL489424",
          "CHEMBL489430",
          "CHEMBL489431",
          "CHEMBL489432",
          "CHEMBL489445",
          "CHEMBL489627",
          "CHEMBL489629",
          "CHEMBL489631",
          "CHEMBL489646",
          "CHEMBL489655",
          "CHEMBL489833",
          "CHEMBL489853",
          "CHEMBL489854",
          "CHEMBL490053",
          "CHEMBL490240",
          "CHEMBL490241",
          "CHEMBL490251",
          "CHEMBL490451",
          "CHEMBL491473",
          "CHEMBL491647",
          "CHEMBL491677",
          "CHEMBL492251",
          "CHEMBL494089",
          "CHEMBL495544",
          "CHEMBL495545",
          "CHEMBL495570",
          "CHEMBL495696",
          "CHEMBL495751",
          "CHEMBL495771",
          "CHEMBL496162",
          "CHEMBL496360",
          "CHEMBL496481",
          "CHEMBL496482",
          "CHEMBL496575",
          "CHEMBL496778",
          "CHEMBL496779",
          "CHEMBL497196",
          "CHEMBL497398",
          "CHEMBL497454",
          "CHEMBL497564",
          "CHEMBL497949",
          "CHEMBL498130",
          "CHEMBL498247",
          "CHEMBL498248",
          "CHEMBL498249",
          "CHEMBL498520",
          "CHEMBL498521",
          "CHEMBL498625",
          "CHEMBL498705",
          "CHEMBL498710",
          "CHEMBL502651",
          "CHEMBL502835",
          "CHEMBL503212",
          "CHEMBL504547",
          "CHEMBL50894",
          "CHEMBL509032",
          "CHEMBL509435",
          "CHEMBL509499",
          "CHEMBL513330",
          "CHEMBL513354",
          "CHEMBL513909",
          "CHEMBL514678",
          "CHEMBL515051",
          "CHEMBL515356",
          "CHEMBL515631",
          "CHEMBL515674",
          "CHEMBL515839",
          "CHEMBL515854",
          "CHEMBL515949",
          "CHEMBL51709",
          "CHEMBL517154",
          "CHEMBL520020",
          "CHEMBL520187",
          "CHEMBL520458",
          "CHEMBL520864",
          "CHEMBL521201",
          "CHEMBL521459",
          "CHEMBL521733",
          "CHEMBL521851",
          "CHEMBL521871",
          "CHEMBL521922",
          "CHEMBL522590",
          "CHEMBL522718",
          "CHEMBL522760",
          "CHEMBL522892",
          "CHEMBL523597",
          "CHEMBL523735",
          "CHEMBL523747",
          "CHEMBL523780",
          "CHEMBL524057",
          "CHEMBL524059",
          "CHEMBL524086",
          "CHEMBL524266",
          "CHEMBL524820",
          "CHEMBL524901",
          "CHEMBL525191",
          "CHEMBL525194",
          "CHEMBL525203",
          "CHEMBL525530",
          "CHEMBL525538",
          "CHEMBL525921",
          "CHEMBL526110",
          "CHEMBL527039",
          "CHEMBL529661",
          "CHEMBL530335",
          "CHEMBL535",
          "CHEMBL538828",
          "CHEMBL539855",
          "CHEMBL549303",
          "CHEMBL549792",
          "CHEMBL551936",
          "CHEMBL552136",
          "CHEMBL553",
          "CHEMBL554",
          "CHEMBL557050",
          "CHEMBL557321",
          "CHEMBL557456",
          "CHEMBL557525",
          "CHEMBL558601",
          "CHEMBL558752",
          "CHEMBL558849",
          "CHEMBL559683",
          "CHEMBL559882",
          "CHEMBL560278",
          "CHEMBL560393",
          "CHEMBL561136",
          "CHEMBL562198",
          "CHEMBL56236",
          "CHEMBL563948",
          "CHEMBL564829",
          "CHEMBL565061",
          "CHEMBL56983",
          "CHEMBL572878",
          "CHEMBL572881",
          "CHEMBL573339",
          "CHEMBL57347",
          "CHEMBL57366",
          "CHEMBL574738",
          "CHEMBL576982",
          "CHEMBL601719",
          "CHEMBL603097",
          "CHEMBL608154",
          "CHEMBL609040",
          "CHEMBL67655",
          "CHEMBL72461",
          "CHEMBL72510",
          "CHEMBL72548",
          "CHEMBL73243",
          "CHEMBL79049",
          "CHEMBL91829",
          "CHEMBL939",
          "CHEMBL941",
          "CHEMBL98335",
          "CHEMBL99647",
          "CHEMBL99687",
          "CHEMBL99689",
          "CHEMBL99699",
          "CHEMBL99842",
          "CHEMBL99948"
        ],
        "number_of_missing_values": "0"
      },
      {
        "data_type": "numeric",
        "index": "1",
        "is_ignore": "false",
        "is_row_identifier": "false",
        "is_target": "false",
        "name": "AMW",
        "number_of_missing_values": "0"
      },
      {
        "data_type": "numeric",
        "index": "2",
        "is_ignore": "false",
        "is_row_identifier": "false",
        "is_target": "false",
        "name": "C.",
        "number_of_missing_values": "0"
      },
      {
        "data_type": "numeric",
        "index": "3",
        "is_ignore": "false",
        "is_row_identifier": "false",
        "is_target": "false",
        "name": "H.",
        "number_of_missing_values": "0"
      },
      {
        "data_type": "numeric",
        "index": "4",
        "is_ignore": "false",
        "is_row_identifier": "false",
        "is_target": "false",
        "name": "Me",
        "number_of_missing_values": "0"
      },
      {
        "data_type": "numeric",
        "index": "5",
        "is_ignore": "false",
        "is_row_identifier": "false",
        "is_target": "false",
        "name": "Mi",
        "number_of_missing_values": "0"
      },
      {
        "data_type": "numeric",
        "index": "6",
        "is_ignore": "false",
        "is_row_identifier": "false",
        "is_target": "false",
        "name": "Mp",
        "number_of_missing_values": "0"
      },
      {
        "data_type": "numeric",
        "index": "7",
        "is_ignore": "false",
        "is_row_identifier": "false",
        "is_target": "false",
        "name": "Mv",
        "number_of_missing_values": "0"
      },
      {
        "data_type": "numeric",
        "index": "8",
        "is_ignore": "false",
        "is_row_identifier": "false",
        "is_target": "false",
        "name": "MW",
        "number_of_missing_values": "0"
      },
      {
        "data_type": "numeric",
        "index": "9",
        "is_ignore": "false",
        "is_row_identifier": "false",
        "is_target": "false",
        "name": "N.",
        "number_of_missing_values": "0"
      },
      {
        "data_type": "numeric",
        "index": "10",
        "is_ignore": "false",
        "is_row_identifier": "false",
        "is_target": "false",
        "name": "nAB",
        "number_of_missing_values": "0"
      },
      {
        "data_type": "numeric",
        "index": "11",
        "is_ignore": "false",
        "is_row_identifier": "false",
        "is_target": "false",
        "name": "nAT",
        "number_of_missing_values": "0"
      },
      {
        "data_type": "numeric",
        "index": "12",
        "is_ignore": "false",
        "is_row_identifier": "false",
        "is_target": "false",
        "name": "nB",
        "number_of_missing_values": "0"
      },
      {
        "data_type": "numeric",
        "index": "13",
        "is_ignore": "false",
        "is_row_identifier": "false",
        "is_target": "false",
        "name": "nBM",
        "number_of_missing_values": "0"
      },
      {
        "data_type": "numeric",
        "index": "14",
        "is_ignore": "false",
        "is_row_identifier": "false",
        "is_target": "false",
        "name": "nBO",
        "number_of_missing_values": "0"
      },
      {
        "data_type": "numeric",
        "index": "15",
        "is_ignore": "false",
        "is_row_identifier": "false",
        "is_target": "false",
        "name": "nBR",
        "number_of_missing_values": "0"
      },
      {
        "data_type": "numeric",
        "index": "16",
        "is_ignore": "false",
        "is_row_identifier": "false",
        "is_target": "false",
        "name": "nBT",
        "number_of_missing_values": "0"
      },
      {
        "data_type": "numeric",
        "index": "17",
        "is_ignore": "false",
        "is_row_identifier": "false",
        "is_target": "false",
        "name": "nC",
        "number_of_missing_values": "0"
      },
      {
        "data_type": "numeric",
        "index": "18",
        "is_ignore": "false",
        "is_row_identifier": "false",
        "is_target": "false",
        "name": "nCL",
        "number_of_missing_values": "0"
      },
      {
        "data_type": "numeric",
        "index": "19",
        "is_ignore": "false",
        "is_row_identifier": "false",
        "is_target": "false",
        "name": "nCsp",
        "number_of_missing_values": "0"
      },
      {
        "data_type": "numeric",
        "index": "20",
        "is_ignore": "false",
        "is_row_identifier": "false",
        "is_target": "false",
        "name": "nCsp2",
        "number_of_missing_values": "0"
      },
      {
        "data_type": "numeric",
        "index": "21",
        "is_ignore": "false",
        "is_row_identifier": "false",
        "is_target": "false",
        "name": "nCsp3",
        "number_of_missing_values": "0"
      },
      {
        "data_type": "numeric",
        "index": "22",
        "is_ignore": "false",
        "is_row_identifier": "false",
        "is_target": "false",
        "name": "nDB",
        "number_of_missing_values": "0"
      },
      {
        "data_type": "numeric",
        "index": "23",
        "is_ignore": "false",
        "is_row_identifier": "false",
        "is_target": "false",
        "name": "nF",
        "number_of_missing_values": "0"
      },
      {
        "data_type": "numeric",
        "index": "24",
        "is_ignore": "false",
        "is_row_identifier": "false",
        "is_target": "false",
        "name": "nH",
        "number_of_missing_values": "0"
      },
      {
        "data_type": "numeric",
        "index": "25",
        "is_ignore": "false",
        "is_row_identifier": "false",
        "is_target": "false",
        "name": "nHet",
        "number_of_missing_values": "0"
      },
      {
        "data_type": "numeric",
        "index": "26",
        "is_ignore": "false",
        "is_row_identifier": "false",
        "is_target": "false",
        "name": "nHM",
        "number_of_missing_values": "0"
      },
      {
        "data_type": "numeric",
        "index": "27",
        "is_ignore": "false",
        "is_row_identifier": "false",
        "is_target": "false",
        "name": "nI",
        "number_of_missing_values": "0"
      },
      {
        "data_type": "numeric",
        "index": "28",
        "is_ignore": "false",
        "is_row_identifier": "false",
        "is_target": "false",
        "name": "nN",
        "number_of_missing_values": "0"
      },
      {
        "data_type": "numeric",
        "index": "29",
        "is_ignore": "false",
        "is_row_identifier": "false",
        "is_target": "false",
        "name": "nO",
        "number_of_missing_values": "0"
      },
      {
        "data_type": "numeric",
        "index": "30",
        "is_ignore": "false",
        "is_row_identifier": "false",
        "is_target": "false",
        "name": "nP",
        "number_of_missing_values": "0"
      },
      {
        "data_type": "numeric",
        "index": "31",
        "is_ignore": "false",
        "is_row_identifier": "false",
        "is_target": "false",
        "name": "nS",
        "number_of_missing_values": "0"
      },
      {
        "data_type": "numeric",
        "index": "32",
        "is_ignore": "false",
        "is_row_identifier": "false",
        "is_target": "false",
        "name": "nSK",
        "number_of_missing_values": "0"
      },
      {
        "data_type": "numeric",
        "index": "33",
        "is_ignore": "false",
        "is_row_identifier": "false",
        "is_target": "false",
        "name": "nTB",
        "number_of_missing_values": "0"
      },
      {
        "data_type": "numeric",
        "index": "34",
        "is_ignore": "false",
        "is_row_identifier": "false",
        "is_target": "false",
        "name": "nX",
        "number_of_missing_values": "0"
      },
      {
        "data_type": "numeric",
        "index": "35",
        "is_ignore": "false",
        "is_row_identifier": "false",
        "is_target": "false",
        "name": "O.",
        "number_of_missing_values": "0"
      },
      {
        "data_type": "numeric",
        "index": "36",
        "is_ignore": "false",
        "is_row_identifier": "false",
        "is_target": "false",
        "name": "RBF",
        "number_of_missing_values": "0"
      },
      {
        "data_type": "numeric",
        "index": "37",
        "is_ignore": "false",
        "is_row_identifier": "false",
        "is_target": "false",
        "name": "RBN",
        "number_of_missing_values": "0"
      },
      {
        "data_type": "numeric",
        "index": "38",
        "is_ignore": "false",
        "is_row_identifier": "false",
        "is_target": "false",
        "name": "SCBO",
        "number_of_missing_values": "0"
      },
      {
        "data_type": "numeric",
        "index": "39",
        "is_ignore": "false",
        "is_row_identifier": "false",
        "is_target": "false",
        "name": "Se",
        "number_of_missing_values": "0"
      },
      {
        "data_type": "numeric",
        "index": "40",
        "is_ignore": "false",
        "is_row_identifier": "false",
        "is_target": "false",
        "name": "Si",
        "number_of_missing_values": "0"
      },
      {
        "data_type": "numeric",
        "index": "41",
        "is_ignore": "false",
        "is_row_identifier": "false",
        "is_target": "false",
        "name": "Sp",
        "number_of_missing_values": "0"
      },
      {
        "data_type": "numeric",
        "index": "42",
        "is_ignore": "false",
        "is_row_identifier": "false",
        "is_target": "false",
        "name": "Sv",
        "number_of_missing_values": "0"
      },
      {
        "data_type": "numeric",
        "index": "43",
        "is_ignore": "false",
        "is_row_identifier": "false",
        "is_target": "false",
        "name": "X.",
        "number_of_missing_values": "0"
      },
      {
        "data_type": "numeric",
        "index": "44",
        "is_ignore": "false",
        "is_row_identifier": "false",
        "is_target": "true",
        "name": "pXC50",
        "number_of_missing_values": "0"
      }
    ]
  }
}