{
  "data_features": {
    "feature": [
      {
        "data_type": "nominal",
        "index": "0",
        "is_ignore": "false",
        "is_row_identifier": "true",
        "is_target": "false",
        "name": "molecule_id",
        "nominal_value": [
          "CHEMBL127445",
          "CHEMBL128124",
          "CHEMBL128163",
          "CHEMBL128194",
          "CHEMBL128216",
          "CHEMBL128219",
          "CHEMBL128228",
          "CHEMBL128258",
          "CHEMBL128327",
          "CHEMBL128328",
          "CHEMBL128383",
          "CHEMBL128388",
          "CHEMBL128398",
          "CHEMBL128417",
          "CHEMBL128422",
          "CHEMBL128423",
          "CHEMBL128489",
          "CHEMBL128497",
          "CHEMBL128652",
          "CHEMBL128680",
          "CHEMBL128712",
          "CHEMBL128726",
          "CHEMBL128749",
          "CHEMBL128879",
          "CHEMBL129234",
          "CHEMBL129955",
          "CHEMBL129971",
          "CHEMBL129983",
          "CHEMBL130476",
          "CHEMBL130742",
          "CHEMBL130768",
          "CHEMBL130770",
          "CHEMBL130803",
          "CHEMBL130848",
          "CHEMBL130887",
          "CHEMBL130891",
          "CHEMBL130905",
          "CHEMBL130993",
          "CHEMBL131101",
          "CHEMBL131168",
          "CHEMBL131235",
          "CHEMBL131239",
          "CHEMBL131269",
          "CHEMBL131388",
          "CHEMBL131477",
          "CHEMBL131499",
          "CHEMBL131538",
          "CHEMBL131551",
          "CHEMBL131564",
          "CHEMBL131581",
          "CHEMBL131613",
          "CHEMBL131650",
          "CHEMBL132064",
          "CHEMBL132157",
          "CHEMBL132165",
          "CHEMBL132210",
          "CHEMBL132211",
          "CHEMBL132389",
          "CHEMBL132391",
          "CHEMBL132496",
          "CHEMBL157988",
          "CHEMBL175182",
          "CHEMBL175211",
          "CHEMBL175212",
          "CHEMBL175411",
          "CHEMBL175813",
          "CHEMBL175930",
          "CHEMBL176146",
          "CHEMBL176264",
          "CHEMBL177248",
          "CHEMBL177285",
          "CHEMBL177556",
          "CHEMBL177885",
          "CHEMBL1793955",
          "CHEMBL2110163",
          "CHEMBL2110297",
          "CHEMBL2111851",
          "CHEMBL2112663",
          "CHEMBL2112666",
          "CHEMBL217517",
          "CHEMBL262533",
          "CHEMBL263313",
          "CHEMBL263545",
          "CHEMBL263860",
          "CHEMBL264208",
          "CHEMBL264364",
          "CHEMBL264513",
          "CHEMBL265017",
          "CHEMBL265073",
          "CHEMBL265119",
          "CHEMBL265264",
          "CHEMBL266729",
          "CHEMBL267111",
          "CHEMBL267405",
          "CHEMBL267641",
          "CHEMBL269251",
          "CHEMBL269301",
          "CHEMBL269715",
          "CHEMBL274397",
          "CHEMBL274955",
          "CHEMBL275578",
          "CHEMBL276079",
          "CHEMBL276906",
          "CHEMBL279570",
          "CHEMBL292579",
          "CHEMBL292848",
          "CHEMBL297725",
          "CHEMBL299502",
          "CHEMBL300103",
          "CHEMBL300642",
          "CHEMBL300803",
          "CHEMBL300978",
          "CHEMBL301595",
          "CHEMBL301708",
          "CHEMBL330022",
          "CHEMBL334332",
          "CHEMBL334610",
          "CHEMBL334953",
          "CHEMBL335170",
          "CHEMBL335182",
          "CHEMBL335634",
          "CHEMBL335876",
          "CHEMBL335886",
          "CHEMBL335944",
          "CHEMBL336082",
          "CHEMBL336195",
          "CHEMBL336362",
          "CHEMBL336742",
          "CHEMBL336857",
          "CHEMBL336992",
          "CHEMBL337212",
          "CHEMBL337221",
          "CHEMBL337519",
          "CHEMBL337615",
          "CHEMBL337667",
          "CHEMBL337842",
          "CHEMBL337853",
          "CHEMBL337888",
          "CHEMBL337889",
          "CHEMBL338118",
          "CHEMBL338177",
          "CHEMBL338362",
          "CHEMBL338383",
          "CHEMBL338490",
          "CHEMBL338499",
          "CHEMBL338503",
          "CHEMBL338522",
          "CHEMBL338548",
          "CHEMBL338576",
          "CHEMBL338635",
          "CHEMBL338636",
          "CHEMBL338711",
          "CHEMBL338921",
          "CHEMBL338951",
          "CHEMBL338984",
          "CHEMBL339096",
          "CHEMBL339124",
          "CHEMBL339132",
          "CHEMBL339151",
          "CHEMBL339155",
          "CHEMBL339357",
          "CHEMBL339366",
          "CHEMBL339433",
          "CHEMBL339464",
          "CHEMBL339497",
          "CHEMBL339498",
          "CHEMBL339524",
          "CHEMBL339698",
          "CHEMBL339756",
          "CHEMBL339768",
          "CHEMBL339783",
          "CHEMBL339929",
          "CHEMBL340016",
          "CHEMBL340150",
          "CHEMBL340320",
          "CHEMBL340334",
          "CHEMBL340362",
          "CHEMBL340388",
          "CHEMBL340639",
          "CHEMBL340676",
          "CHEMBL340772",
          "CHEMBL340915",
          "CHEMBL340964",
          "CHEMBL341049",
          "CHEMBL341289",
          "CHEMBL341311",
          "CHEMBL341338",
          "CHEMBL341339",
          "CHEMBL341470",
          "CHEMBL341507",
          "CHEMBL360272",
          "CHEMBL366790",
          "CHEMBL366816",
          "CHEMBL367323",
          "CHEMBL368353",
          "CHEMBL368354",
          "CHEMBL368462",
          "CHEMBL368791",
          "CHEMBL368818",
          "CHEMBL369150",
          "CHEMBL369712",
          "CHEMBL369832",
          "CHEMBL373742",
          "CHEMBL384292",
          "CHEMBL384727",
          "CHEMBL384743",
          "CHEMBL387218",
          "CHEMBL387273",
          "CHEMBL405016",
          "CHEMBL405055",
          "CHEMBL405165",
          "CHEMBL405434",
          "CHEMBL406184",
          "CHEMBL406198",
          "CHEMBL406303",
          "CHEMBL407403",
          "CHEMBL408038",
          "CHEMBL409796",
          "CHEMBL410025",
          "CHEMBL410838",
          "CHEMBL411161",
          "CHEMBL411320",
          "CHEMBL411357",
          "CHEMBL411420",
          "CHEMBL411598",
          "CHEMBL411604",
          "CHEMBL412616",
          "CHEMBL413249",
          "CHEMBL413706",
          "CHEMBL413748",
          "CHEMBL414582",
          "CHEMBL414766",
          "CHEMBL415230",
          "CHEMBL415832",
          "CHEMBL419973",
          "CHEMBL420144",
          "CHEMBL420762",
          "CHEMBL421090",
          "CHEMBL421248",
          "CHEMBL422080",
          "CHEMBL422612",
          "CHEMBL423156",
          "CHEMBL427565",
          "CHEMBL427571",
          "CHEMBL428629",
          "CHEMBL429010",
          "CHEMBL429372",
          "CHEMBL430083",
          "CHEMBL430259",
          "CHEMBL432515",
          "CHEMBL433662",
          "CHEMBL434993",
          "CHEMBL435009",
          "CHEMBL435019",
          "CHEMBL435331",
          "CHEMBL435398",
          "CHEMBL435409",
          "CHEMBL435613",
          "CHEMBL435815",
          "CHEMBL436189",
          "CHEMBL437035",
          "CHEMBL437265",
          "CHEMBL437426",
          "CHEMBL437442",
          "CHEMBL437631",
          "CHEMBL438189",
          "CHEMBL438387",
          "CHEMBL438900",
          "CHEMBL440997",
          "CHEMBL441498",
          "CHEMBL449399",
          "CHEMBL52176",
          "CHEMBL52813",
          "CHEMBL53065",
          "CHEMBL54443",
          "CHEMBL87636"
        ],
        "number_of_missing_values": "0"
      },
      {
        "data_type": "numeric",
        "index": "1",
        "is_ignore": "false",
        "is_row_identifier": "false",
        "is_target": "false",
        "name": "FCFP4_1024b401",
        "number_of_missing_values": "0"
      },
      {
        "data_type": "numeric",
        "index": "2",
        "is_ignore": "false",
        "is_row_identifier": "false",
        "is_target": "false",
        "name": "FCFP4_1024b657",
        "number_of_missing_values": "0"
      },
      {
        "data_type": "numeric",
        "index": "3",
        "is_ignore": "false",
        "is_row_identifier": "false",
        "is_target": "false",
        "name": "FCFP4_1024b541",
        "number_of_missing_values": "0"
      },
      {
        "data_type": "numeric",
        "index": "4",
        "is_ignore": "false",
        "is_row_identifier": "false",
        "is_target": "false",
        "name": "FCFP4_1024b821",
        "number_of_missing_values": "0"
      },
      {
        "data_type": "numeric",
        "index": "5",
        "is_ignore": "false",
        "is_row_identifier": "false",
        "is_target": "false",
        "name": "FCFP4_1024b161",
        "number_of_missing_values": "0"
      },
      {
        "data_type": "numeric",
        "index": "6",
        "is_ignore": "false",
        "is_row_identifier": "false",
        "is_target": "false",
        "name": "FCFP4_1024b455",
        "number_of_missing_values": "0"
      },
      {
        "data_type": "numeric",
        "index": "7",
        "is_ignore": "false",
        "is_row_identifier": "false",
        "is_target": "false",
        "name": "FCFP4_1024b614",
        "number_of_missing_values": "0"
      },
      {
        "data_type": "numeric",
        "index": "8",
        "is_ignore": "false",
        "is_row_identifier": "false",
        "is_target": "false",
        "name": "FCFP4_1024b872",
        "number_of_missing_values": "0"
      },
      {
        "data_type": "numeric",
        "index": "9",
        "is_ignore": "false",
        "is_row_identifier": "false",
        "is_target": "false",
        "name": "FCFP4_1024b273",
        "number_of_missing_values": "0"
      },
      {
        "data_type": "numeric",
        "index": "10",
        "is_ignore": "false",
        "is_row_identifier": "false",
        "is_target": "false",
        "name": "FCFP4_1024b313",
        "number_of_missing_values": "0"
      },
      {
        "data_type": "numeric",
        "index": "11",
        "is_ignore": "false",
        "is_row_identifier": "false",
        "is_target": "false",
        "name": "FCFP4_1024b345",
        "number_of_missing_values": "0"
      },
      {
        "data_type": "numeric",
        "index": "12",
        "is_ignore": "false",
        "is_row_identifier": "false",
        "is_target": "false",
        "name": "FCFP4_1024b40",
        "number_of_missing_values": "0"
      },
      {
        "data_type": "numeric",
        "index": "13",
        "is_ignore": "false",
        "is_row_identifier": "false",
        "is_target": "false",
        "name": "FCFP4_1024b408",
        "number_of_missing_values": "0"
      },
      {
        "data_type": "numeric",
        "index": "14",
        "is_ignore": "false",
        "is_row_identifier": "false",
        "is_target": "false",
        "name": "FCFP4_1024b515",
        "number_of_missing_values": "0"
      },
      {
        "data_type": "numeric",
        "index": "15",
        "is_ignore": "false",
        "is_row_identifier": "false",
        "is_target": "false",
        "name": "FCFP4_1024b905",
        "number_of_missing_values": "0"
      },
      {
        "data_type": "numeric",
        "index": "16",
        "is_ignore": "false",
        "is_row_identifier": "false",
        "is_target": "false",
        "name": "FCFP4_1024b91",
        "number_of_missing_values": "0"
      },
      {
        "data_type": "numeric",
        "index": "17",
        "is_ignore": "false",
        "is_row_identifier": "false",
        "is_target": "false",
        "name": "FCFP4_1024b940",
        "number_of_missing_values": "0"
      },
      {
        "data_type": "numeric",
        "index": "18",
        "is_ignore": "false",
        "is_row_identifier": "false",
        "is_target": "false",
        "name": "FCFP4_1024b728",
        "number_of_missing_values": "0"
      },
      {
        "data_type": "numeric",
        "index": "19",
        "is_ignore": "false",
        "is_row_identifier": "false",
        "is_target": "false",
        "name": "FCFP4_1024b839",
        "number_of_missing_values": "0"
      },
      {
        "data_type": "numeric",
        "index": "20",
        "is_ignore": "false",
        "is_row_identifier": "false",
        "is_target": "false",
        "name": "FCFP4_1024b365",
        "number_of_missing_values": "0"
      },
      {
        "data_type": "numeric",
        "index": "21",
        "is_ignore": "false",
        "is_row_identifier": "false",
        "is_target": "false",
        "name": "FCFP4_1024b10",
        "number_of_missing_values": "0"
      },
      {
        "data_type": "numeric",
        "index": "22",
        "is_ignore": "false",
        "is_row_identifier": "false",
        "is_target": "false",
        "name": "FCFP4_1024b644",
        "number_of_missing_values": "0"
      },
      {
        "data_type": "numeric",
        "index": "23",
        "is_ignore": "false",
        "is_row_identifier": "false",
        "is_target": "false",
        "name": "FCFP4_1024b630",
        "number_of_missing_values": "0"
      },
      {
        "data_type": "numeric",
        "index": "24",
        "is_ignore": "false",
        "is_row_identifier": "false",
        "is_target": "false",
        "name": "FCFP4_1024b977",
        "number_of_missing_values": "0"
      },
      {
        "data_type": "numeric",
        "index": "25",
        "is_ignore": "false",
        "is_row_identifier": "false",
        "is_target": "false",
        "name": "FCFP4_1024b37",
        "number_of_missing_values": "0"
      },
      {
        "data_type": "numeric",
        "index": "26",
        "is_ignore": "false",
        "is_row_identifier": "false",
        "is_target": "false",
        "name": "FCFP4_1024b507",
        "number_of_missing_values": "0"
      },
      {
        "data_type": "numeric",
        "index": "27",
        "is_ignore": "false",
        "is_row_identifier": "false",
        "is_target": "false",
        "name": "FCFP4_1024b615",
        "number_of_missing_values": "0"
      },
      {
        "data_type": "numeric",
        "index": "28",
        "is_ignore": "false",
        "is_row_identifier": "false",
        "is_target": "false",
        "name": "FCFP4_1024b124",
        "number_of_missing_values": "0"
      },
      {
        "data_type": "numeric",
        "index": "29",
        "is_ignore": "false",
        "is_row_identifier": "false",
        "is_target": "false",
        "name": "FCFP4_1024b669",
        "number_of_missing_values": "0"
      },
      {
        "data_type": "numeric",
        "index": "30",
        "is_ignore": "false",
        "is_row_identifier": "false",
        "is_target": "false",
        "name": "FCFP4_1024b868",
        "number_of_missing_values": "0"
      },
      {
        "data_type": "numeric",
        "index": "31",
        "is_ignore": "false",
        "is_row_identifier": "false",
        "is_target": "false",
        "name": "FCFP4_1024b589",
        "number_of_missing_values": "0"
      },
      {
        "data_type": "numeric",
        "index": "32",
        "is_ignore": "false",
        "is_row_identifier": "false",
        "is_target": "false",
        "name": "FCFP4_1024b396",
        "number_of_missing_values": "0"
      },
      {
        "data_type": "numeric",
        "index": "33",
        "is_ignore": "false",
        "is_row_identifier": "false",
        "is_target": "false",
        "name": "FCFP4_1024b105",
        "number_of_missing_values": "0"
      },
      {
        "data_type": "numeric",
        "index": "34",
        "is_ignore": "false",
        "is_row_identifier": "false",
        "is_target": "false",
        "name": "FCFP4_1024b271",
        "number_of_missing_values": "0"
      },
      {
        "data_type": "numeric",
        "index": "35",
        "is_ignore": "false",
        "is_row_identifier": "false",
        "is_target": "false",
        "name": "FCFP4_1024b943",
        "number_of_missing_values": "0"
      },
      {
        "data_type": "numeric",
        "index": "36",
        "is_ignore": "false",
        "is_row_identifier": "false",
        "is_target": "false",
        "name": "FCFP4_1024b264",
        "number_of_missing_values": "0"
      },
      {
        "data_type": "numeric",
        "index": "37",
        "is_ignore": "false",
        "is_row_identifier": "false",
        "is_target": "false",
        "name": "FCFP4_1024b412",
        "number_of_missing_values": "0"
      },
      {
        "data_type": "numeric",
        "index": "38",
        "is_ignore": "false",
        "is_row_identifier": "false",
        "is_target": "false",
        "name": "FCFP4_1024b13",
        "number_of_missing_values": "0"
      },
      {
        "data_type": "numeric",
        "index": "39",
        "is_ignore": "false",
        "is_row_identifier": "false",
        "is_target": "false",
        "name": "FCFP4_1024b389",
        "number_of_missing_values": "0"
      },
      {
        "data_type": "numeric",
        "index": "40",
        "is_ignore": "false",
        "is_row_identifier": "false",
        "is_target": "false",
        "name": "FCFP4_1024b908",
        "number_of_missing_values": "0"
      },
      {
        "data_type": "numeric",
        "index": "41",
        "is_ignore": "false",
        "is_row_identifier": "false",
        "is_target": "false",
        "name": "FCFP4_1024b65",
        "number_of_missing_values": "0"
      },
      {
        "data_type": "numeric",
        "index": "42",
        "is_ignore": "false",
        "is_row_identifier": "false",
        "is_target": "false",
        "name": "FCFP4_1024b708",
        "number_of_missing_values": "0"
      },
      {
        "data_type": "numeric",
        "index": "43",
        "is_ignore": "false",
        "is_row_identifier": "false",
        "is_target": "false",
        "name": "FCFP4_1024b436",
        "number_of_missing_values": "0"
      },
      {
        "data_type": "numeric",
        "index": "44",
        "is_ignore": "false",
        "is_row_identifier": "false",
        "is_target": "false",
        "name": "FCFP4_1024b35",
        "number_of_missing_values": "0"
      },
      {
        "data_type": "numeric",
        "index": "45",
        "is_ignore": "false",
        "is_row_identifier": "false",
        "is_target": "false",
        "name": "FCFP4_1024b625",
        "number_of_missing_values": "0"
      },
      {
        "data_type": "numeric",
        "index": "46",
        "is_ignore": "false",
        "is_row_identifier": "false",
        "is_target": "false",
        "name": "FCFP4_1024b260",
        "number_of_missing_values": "0"
      },
      {
        "data_type": "numeric",
        "index": "47",
        "is_ignore": "false",
        "is_row_identifier": "false",
        "is_target": "false",
        "name": "FCFP4_1024b986",
        "number_of_missing_values": "0"
      },
      {
        "data_type": "numeric",
        "index": "48",
        "is_ignore": "false",
        "is_row_identifier": "false",
        "is_target": "false",
        "name": "FCFP4_1024b985",
        "number_of_missing_values": "0"
      },
      {
        "data_type": "numeric",
        "index": "49",
        "is_ignore": "false",
        "is_row_identifier": "false",
        "is_target": "false",
        "name": "FCFP4_1024b187",
        "number_of_missing_values": "0"
      },
      {
        "data_type": "numeric",
        "index": "50",
        "is_ignore": "false",
        "is_row_identifier": "false",
        "is_target": "false",
        "name": "FCFP4_1024b884",
        "number_of_missing_values": "0"
      },
      {
        "data_type": "numeric",
        "index": "51",
        "is_ignore": "false",
        "is_row_identifier": "false",
        "is_target": "false",
        "name": "FCFP4_1024b460",
        "number_of_missing_values": "0"
      },
      {
        "data_type": "numeric",
        "index": "52",
        "is_ignore": "false",
        "is_row_identifier": "false",
        "is_target": "true",
        "name": "pXC50",
        "number_of_missing_values": "0"
      }
    ]
  }
}