"molecule_id","FCFP4_1024b1002","FCFP4_1024b458","FCFP4_1024b985","FCFP4_1024b680","FCFP4_1024b815","FCFP4_1024b355","FCFP4_1024b283","FCFP4_1024b1","FCFP4_1024b10","FCFP4_1024b100","FCFP4_1024b1000","FCFP4_1024b1001","FCFP4_1024b1003","FCFP4_1024b1004","FCFP4_1024b1005","FCFP4_1024b1006","FCFP4_1024b1007","FCFP4_1024b1008","FCFP4_1024b1009","FCFP4_1024b101","FCFP4_1024b1010","FCFP4_1024b1011","FCFP4_1024b1012","FCFP4_1024b1013","FCFP4_1024b1014","FCFP4_1024b1015","FCFP4_1024b1016","FCFP4_1024b1017","FCFP4_1024b1018","FCFP4_1024b1019","FCFP4_1024b102","FCFP4_1024b1020","FCFP4_1024b1021","FCFP4_1024b1022","FCFP4_1024b1023","FCFP4_1024b1024","FCFP4_1024b103","FCFP4_1024b104","FCFP4_1024b105","FCFP4_1024b106","FCFP4_1024b107","FCFP4_1024b108","FCFP4_1024b109","FCFP4_1024b11","FCFP4_1024b110","FCFP4_1024b111","FCFP4_1024b112","FCFP4_1024b113","FCFP4_1024b114","FCFP4_1024b115","FCFP4_1024b116","pXC50"
{4 1,8 1,21 1,30 1,52 5}
{0 CHEMBL100986,8 1,21 1,30 1,52 5}
{0 CHEMBL101212,8 1,21 1,30 1,52 5}
{0 CHEMBL101302,4 1,8 1,21 1,30 1,52 5}
{0 CHEMBL101308,8 1,21 1,30 1,52 5}
{0 CHEMBL101609,8 1,21 1,30 1,52 5}
{0 CHEMBL101661,8 1,21 1,30 1,52 5}
{0 CHEMBL101666,8 1,21 1,30 1,52 5}
{0 CHEMBL101712,8 1,21 1,30 1,52 5}
{0 CHEMBL102039,8 1,21 1,30 1,52 5}
{0 CHEMBL1023,4 1,8 1,21 1,30 1,52 6}
{0 CHEMBL106527,2 1,4 1,7 1,8 1,21 1,30 1,41 1,52 7.027}
{0 CHEMBL107054,2 1,4 1,7 1,8 1,21 1,30 1,41 1,52 6.951}
{0 CHEMBL107430,2 1,4 1,7 1,8 1,21 1,30 1,41 1,52 6.699}
{0 CHEMBL109581,3 1,8 1,30 1,43 1,52 5.747}
{0 CHEMBL109847,3 1,8 1,30 1,43 1,52 5.588}
{0 CHEMBL111217,3 1,5 1,8 1,10 1,30 1,43 1,52 5.081}
{0 CHEMBL111589,8 1,30 1,43 1,52 6.514}
{0 CHEMBL1180,1 1,8 1,21 1,52 5.187}
{0 CHEMBL118754,3 1,8 1,21 1,30 1,52 6.377}
{0 CHEMBL120210,8 1,30 1,52 6.664}
{0 CHEMBL120759,3 1,8 1,21 1,30 1,52 5.638}
{0 CHEMBL1209109,5 1,8 1,21 1,52 5}
{0 CHEMBL1209170,5 1,8 1,21 1,30 1,52 5}
{0 CHEMBL1209173,5 1,8 1,21 1,52 5}
{0 CHEMBL125587,3 1,8 1,30 1,52 6.208}
{0 CHEMBL12585,8 1,21 1,30 1,52 7.959}
{0 CHEMBL1265,1 1,8 1,21 1,52 5.959}
{0 CHEMBL130231,3 1,5 1,8 1,30 1,43 1,52 5.181}
{0 CHEMBL130232,1 1,3 1,5 1,8 1,43 1,52 5}
{0 CHEMBL130374,1 1,3 1,5 1,8 1,43 1,52 5.342}
{0 CHEMBL131122,3 1,5 1,8 1,14 1,30 1,43 1,52 5}
{0 CHEMBL131810,8 1,21 1,52 6.886}
{0 CHEMBL131826,3 1,5 1,8 1,30 1,43 1,52 5.428}
{0 CHEMBL131850,8 1,21 1,52 8.62}
{0 CHEMBL131925,8 1,21 1,52 7.721}
{0 CHEMBL132033,8 1,21 1,52 7.495}
{0 CHEMBL132568,3 1,5 1,8 1,14 1,30 1,43 1,52 5.602}
{0 CHEMBL133725,2 1,8 1,21 1,27 1,52 8.658}
{0 CHEMBL133896,3 1,5 1,8 1,14 1,30 1,43 1,52 5}
{0 CHEMBL133915,1 1,3 1,5 1,8 1,43 1,52 5.342}
{0 CHEMBL134375,1 1,2 1,8 1,21 1,52 9.347}
{0 CHEMBL134834,8 1,13 1,14 1,21 1,30 1,52 5.796}
{0 CHEMBL139536,2 1,4 1,7 1,8 1,41 1,52 6.648}
{0 CHEMBL144058,1 1,8 1,52 4.553}
{0 CHEMBL145911,1 1,8 1,21 1,52 5}
{0 CHEMBL146092,1 1,8 1,10 1,21 1,52 5.187}
{0 CHEMBL146449,8 1,21 1,30 1,52 6.337}
{0 CHEMBL146636,1 1,8 1,21 1,52 5}
{0 CHEMBL146646,8 1,21 1,30 1,52 6.215}
{0 CHEMBL147335,8 1,14 1,21 1,45 1,52 5}
{0 CHEMBL147545,1 1,3 1,8 1,21 1,52 5.301}
{0 CHEMBL147845,1 1,8 1,30 1,52 5.301}
{0 CHEMBL147937,4 1,6 1,8 1,21 1,28 1,30 1,52 6.889}
{0 CHEMBL148231,1 1,8 1,21 1,52 5}
{0 CHEMBL148327,4 1,6 1,8 1,21 1,28 1,30 1,52 6.519}
{0 CHEMBL149366,1 1,3 1,8 1,21 1,52 5}
{0 CHEMBL150583,8 1,14 1,21 1,30 1,45 1,52 5}
{0 CHEMBL150691,8 1,14 1,21 1,45 1,52 5}
{0 CHEMBL151672,8 1,21 1,45 1,52 5}
{0 CHEMBL151870,8 1,14 1,21 1,45 1,52 6.362}
{0 CHEMBL152740,4 1,6 1,8 1,21 1,28 1,30 1,52 6.64}
{0 CHEMBL153974,4 1,6 1,8 1,21 1,28 1,30 1,52 6.559}
{0 CHEMBL155325,4 1,6 1,8 1,21 1,28 1,30 1,52 5.978}
{0 CHEMBL155421,4 1,6 1,8 1,21 1,28 1,30 1,52 7.046}
{0 CHEMBL155474,4 1,6 1,8 1,21 1,28 1,30 1,52 7.398}
{0 CHEMBL156903,4 1,6 1,8 1,21 1,28 1,30 1,52 6.833}
{0 CHEMBL156940,4 1,6 1,8 1,21 1,28 1,30 1,52 6.987}
{0 CHEMBL156997,4 1,5 1,6 1,8 1,21 1,28 1,30 1,52 7.357}
{0 CHEMBL157160,4 1,6 1,8 1,21 1,28 1,30 1,52 7.237}
{0 CHEMBL157272,4 1,6 1,8 1,21 1,28 1,30 1,52 7.071}
{0 CHEMBL162334,8 1,21 1,30 1,52 5}
{0 CHEMBL162345,8 1,21 1,52 7.854}
{0 CHEMBL162393,4 1,6 1,8 1,21 1,28 1,52 7.793}
{0 CHEMBL163223,8 1,21 1,52 7.886}
{0 CHEMBL163530,8 1,21 1,52 7.77}
{0 CHEMBL164176,8 1,10 1,13 1,14 1,21 1,52 6}
{0 CHEMBL165417,4 1,6 1,8 1,21 1,28 1,52 7.762}
{0 CHEMBL165629,8 1,21 1,52 8.542}
{0 CHEMBL1657,3 1,8 1,30 1,52 7.201}
{0 CHEMBL165843,8 1,21 1,30 1,42 1,52 7.484}
{0 CHEMBL1671971,5 1,8 1,9 1,30 1,52 5.081}
{0 CHEMBL198997,8 1,14 1,21 1,52 6.2}
{0 CHEMBL20066,2 1,8 1,21 1,52 7.506}
{0 CHEMBL2111534,8 1,30 1,43 1,52 6}
{0 CHEMBL2111535,8 1,30 1,43 1,52 6}
{0 CHEMBL2113736,8 1,9 1,30 1,33 1,52 5}
{0 CHEMBL2113737,8 1,30 1,35 1,52 5}
{0 CHEMBL21518,3 1,8 1,21 1,30 1,52 5.959}
{0 CHEMBL25202,2 1,4 1,7 1,8 1,21 1,41 1,52 7.228}
{0 CHEMBL25361,1 1,8 1,21 1,52 6.237}
{0 CHEMBL26129,8 1,21 1,45 1,52 5.301}
{0 CHEMBL265051,1 1,3 1,5 1,8 1,30 1,35 1,52 5}
{0 CHEMBL275311,8 1,21 1,30 1,52 7.484}
{0 CHEMBL284167,8 1,11 1,21 1,30 1,52 6.005}
{0 CHEMBL284264,8 1,21 1,45 1,52 6.62}
{0 CHEMBL284937,8 1,21 1,30 1,52 5.77}
{0 CHEMBL285179,8 1,21 1,30 1,52 7.526}
{0 CHEMBL288436,8 1,21 1,30 1,52 5.686}
{0 CHEMBL289057,1 1,3 1,8 1,30 1,35 1,52 5}
{0 CHEMBL290246,1 1,3 1,5 1,8 1,30 1,52 5}
{0 CHEMBL290399,1 1,3 1,5 1,8 1,30 1,35 1,52 5}
{0 CHEMBL290761,1 1,3 1,5 1,8 1,10 1,30 1,35 1,52 5.078}
{0 CHEMBL291034,1 1,3 1,8 1,10 1,30 1,35 1,52 5}
{0 CHEMBL294346,8 1,30 1,33 1,52 5}
{0 CHEMBL298373,8 1,14 1,21 1,52 5.886}
{0 CHEMBL305115,8 1,30 1,33 1,52 5}
{0 CHEMBL306999,8 1,21 1,41 1,52 6}
{0 CHEMBL308170,3 1,8 1,10 1,21 1,30 1,52 5.832}
{0 CHEMBL308377,8 1,30 1,43 1,52 5.24}
{0 CHEMBL308883,8 1,30 1,43 1,52 6}
{0 CHEMBL308967,8 1,21 1,30 1,52 6}
{0 CHEMBL309282,8 1,21 1,30 1,52 6.928}
{0 CHEMBL309469,8 1,21 1,30 1,52 4.959}
{0 CHEMBL310047,8 1,30 1,43 1,52 6}
{0 CHEMBL311113,8 1,30 1,43 1,52 6}
{0 CHEMBL311269,8 1,21 1,30 1,52 6.203}
{0 CHEMBL312233,8 1,30 1,43 1,52 6}
{0 CHEMBL312395,8 1,30 1,43 1,52 6}
{0 CHEMBL312737,8 1,30 1,43 1,45 1,52 6}
{0 CHEMBL317873,2 1,4 1,7 1,8 1,21 1,30 1,41 1,52 8.357}
{0 CHEMBL318916,8 1,21 1,30 1,52 5}
{0 CHEMBL32505,8 1,21 1,30 1,52 6.332}
{0 CHEMBL326911,2 1,4 1,7 1,8 1,21 1,30 1,41 1,52 8.398}
{0 CHEMBL328419,8 1,21 1,30 1,52 5}
{0 CHEMBL330593,8 1,21 1,30 1,52 5}
{0 CHEMBL330998,3 1,8 1,30 1,43 1,52 6}
{0 CHEMBL331642,8 1,30 1,52 6.099}
{0 CHEMBL334428,8 1,14 1,21 1,30 1,52 5.699}
{0 CHEMBL334534,8 1,14 1,21 1,30 1,52 6.009}
{0 CHEMBL335242,3 1,5 1,8 1,10 1,30 1,43 1,52 5.331}
{0 CHEMBL336311,8 1,21 1,52 7.081}
{0 CHEMBL337393,1 1,3 1,5 1,8 1,43 1,52 5}
{0 CHEMBL337859,8 1,14 1,21 1,30 1,52 6.046}
{0 CHEMBL340495,3 1,8 1,30 1,43 1,52 6.097}
{0 CHEMBL341704,3 1,6 1,8 1,30 1,45 1,52 5}
{0 CHEMBL342051,1 1,3 1,8 1,21 1,52 5.071}
{0 CHEMBL34292,3 1,8 1,30 1,43 1,52 5.854}
{0 CHEMBL344122,1 1,8 1,30 1,52 5.046}
{0 CHEMBL34464,3 1,8 1,30 1,52 5.959}
{0 CHEMBL344973,2 1,4 1,6 1,7 1,8 1,21 1,28 1,30 1,41 1,52 7.027}
{0 CHEMBL345022,8 1,21 1,30 1,52 5.976}
{0 CHEMBL345298,1 1,8 1,21 1,52 5.951}
{0 CHEMBL346202,4 1,6 1,8 1,21 1,28 1,30 1,52 7.222}
{0 CHEMBL346429,4 1,6 1,8 1,21 1,28 1,30 1,52 6.037}
{0 CHEMBL346703,4 1,6 1,8 1,9 1,21 1,28 1,30 1,52 7.42}
{0 CHEMBL348449,8 1,10 1,21 1,30 1,52 6.079}
{0 CHEMBL349018,8 1,14 1,21 1,52 6.754}
{0 CHEMBL349935,8 1,14 1,21 1,52 6.762}
{0 CHEMBL350485,8 1,13 1,14 1,21 1,52 6.769}
{0 CHEMBL35136,3 1,8 1,30 1,43 1,52 6.131}
{0 CHEMBL356326,8 1,21 1,30 1,52 6.377}
{0 CHEMBL357015,8 1,30 1,52 6}
{0 CHEMBL357603,1 1,8 1,21 1,52 5}
{0 CHEMBL357917,1 1,8 1,21 1,52 6.158}
{0 CHEMBL358145,4 1,6 1,8 1,21 1,28 1,30 1,52 7.77}
{0 CHEMBL36464,8 1,11 1,21 1,30 1,52 6}
{0 CHEMBL36718,8 1,21 1,45 1,52 6.26}
{0 CHEMBL36768,8 1,21 1,52 8.276}
{0 CHEMBL37708,8 1,14 1,21 1,52 5.854}
{0 CHEMBL38,8 1,43 1,45 1,52 7.796}
{0 CHEMBL387639,8 1,43 1,52 4}
{0 CHEMBL388283,8 1,43 1,45 1,52 4.699}
{0 CHEMBL39344,3 1,8 1,21 1,30 1,52 7.569}
{0 CHEMBL41146,1 1,3 1,5 1,8 1,10 1,30 1,35 1,52 5.138}
{0 CHEMBL41260,1 1,3 1,5 1,8 1,10 1,30 1,35 1,52 5}
{0 CHEMBL41422,1 1,3 1,5 1,8 1,30 1,52 5}
{0 CHEMBL415449,3 1,8 1,21 1,30 1,52 5.638}
{0 CHEMBL41675,1 1,3 1,8 1,30 1,35 1,52 5.071}
{0 CHEMBL41676,1 1,3 1,8 1,10 1,30 1,35 1,52 5}
{0 CHEMBL41742,1 1,3 1,8 1,30 1,35 1,52 5.161}
{0 CHEMBL417520,1 1,3 1,8 1,30 1,35 1,52 5.22}
{0 CHEMBL41890,1 1,3 1,8 1,30 1,35 1,52 5}
{0 CHEMBL419166,8 1,21 1,30 1,52 5.544}
{0 CHEMBL421773,8 1,21 1,30 1,52 5.942}
{0 CHEMBL422088,1 1,3 1,5 1,8 1,43 1,52 5.17}
{0 CHEMBL422490,1 1,8 1,21 1,52 5}
{0 CHEMBL422607,8 1,30 1,52 5.948}
{0 CHEMBL42314,3 1,5 1,8 1,10 1,30 1,43 1,52 6}
{0 CHEMBL423465,8 1,13 1,21 1,30 1,32 1,52 5}
{0 CHEMBL423954,4 1,6 1,8 1,10 1,21 1,28 1,30 1,52 6.75}
{0 CHEMBL424190,8 1,10 1,14 1,21 1,52 6.257}
{0 CHEMBL424269,3 1,5 1,8 1,14 1,30 1,43 1,52 5.561}
{0 CHEMBL424636,8 1,21 1,30 1,52 5}
{0 CHEMBL424639,1 1,3 1,5 1,8 1,30 1,43 1,52 5.332}
{0 CHEMBL425027,8 1,21 1,52 5.6}
{0 CHEMBL430616,8 1,21 1,52 7.237}
{0 CHEMBL432140,8 1,30 1,33 1,52 5}
{0 CHEMBL43238,1 1,3 1,5 1,8 1,10 1,30 1,35 1,52 5}
{0 CHEMBL432592,2 1,4 1,7 1,8 1,21 1,41 1,52 7.398}
{0 CHEMBL439780,2 1,4 1,7 1,8 1,21 1,30 1,41 1,52 8.237}
{0 CHEMBL441231,8 1,21 1,30 1,52 7.824}
{0 CHEMBL44420,1 1,8 1,10 1,30 1,35 1,52 5.748}
{0 CHEMBL44478,8 1,43 1,45 1,52 6.991}
{0 CHEMBL451835,8 1,21 1,30 1,52 9.222}
{0 CHEMBL457775,8 1,10 1,21 1,52 6}
{0 CHEMBL467748,4 1,8 1,13 1,30 1,32 1,38 1,52 6}
{0 CHEMBL468607,4 1,8 1,10 1,13 1,30 1,32 1,38 1,52 6}
{0 CHEMBL468608,4 1,8 1,13 1,30 1,32 1,38 1,52 6}
{0 CHEMBL468623,2 1,4 1,7 1,8 1,13 1,30 1,32 1,38 1,41 1,52 6.284}
{0 CHEMBL469281,3 1,8 1,21 1,52 5}
{0 CHEMBL470588,3 1,8 1,21 1,52 5}
{0 CHEMBL471422,8 1,14 1,21 1,52 5}
{0 CHEMBL472476,3 1,8 1,14 1,21 1,52 5}
{0 CHEMBL511855,4 1,8 1,10 1,13 1,32 1,38 1,52 6}
{0 CHEMBL513760,3 1,8 1,14 1,21 1,52 5.8}
{0 CHEMBL524687,8 1,21 1,52 5.7}
{0 CHEMBL550796,8 1,30 1,43 1,52 7.824}
{0 CHEMBL57765,8 1,43 1,52 4.699}
{0 CHEMBL60089,8 1,30 1,52 6}
{0 CHEMBL60090,8 1,30 1,52 5}
{0 CHEMBL62047,1 1,8 1,33 1,52 7.032}
{0 CHEMBL62258,8 1,30 1,33 1,52 6}
{0 CHEMBL62537,8 1,30 1,33 1,52 5}
{0 CHEMBL62880,8 1,30 1,33 1,52 5}
{0 CHEMBL63048,8 1,30 1,33 1,52 6}
{0 CHEMBL64222,8 1,30 1,52 5}
{0 CHEMBL64771,3 1,8 1,30 1,33 1,52 6}
{0 CHEMBL69091,8 1,30 1,43 1,52 6}
{0 CHEMBL69367,2 1,4 1,7 1,8 1,21 1,30 1,41 1,52 7.387}
{0 CHEMBL705,8 1,43 1,45 1,52 7.638}
{0 CHEMBL73321,3 1,8 1,21 1,30 1,52 7.347}
{0 CHEMBL73973,8 1,43 1,52 5.398}
{0 CHEMBL74218,1 1,8 1,10 1,21 1,52 5.262}
{0 CHEMBL74331,8 1,43 1,52 8.509}
{0 CHEMBL74826,8 1,10 1,21 1,30 1,52 6.886}
{0 CHEMBL75048,3 1,8 1,21 1,30 1,52 6.086}
{0 CHEMBL75133,8 1,30 1,43 1,52 7.523}
{0 CHEMBL75311,3 1,8 1,10 1,21 1,30 1,52 5.523}
{0 CHEMBL75527,3 1,8 1,21 1,30 1,52 5.238}
{0 CHEMBL75732,3 1,8 1,21 1,30 1,52 6.117}
{0 CHEMBL75814,8 1,30 1,43 1,52 6}
{0 CHEMBL75848,3 1,8 1,21 1,30 1,52 6.312}
{0 CHEMBL76313,8 1,21 1,30 1,52 6.866}
{0 CHEMBL77961,8 1,21 1,30 1,52 6.155}
{0 CHEMBL78587,5 1,8 1,21 1,30 1,52 7.137}
{0 CHEMBL78835,8 1,21 1,30 1,52 5.187}
{0 CHEMBL79234,8 1,30 1,43 1,45 1,52 6}
{0 CHEMBL80236,8 1,30 1,43 1,52 6}
{0 CHEMBL80271,8 1,21 1,52 7.527}
{0 CHEMBL80424,8 1,30 1,43 1,52 6}
{0 CHEMBL80820,8 1,21 1,30 1,41 1,52 5.461}
{0 CHEMBL80934,8 1,21 1,30 1,41 1,52 6}
{0 CHEMBL80992,8 1,21 1,30 1,52 5.125}
{0 CHEMBL81273,8 1,21 1,30 1,52 4.783}
{0 CHEMBL82089,8 1,21 1,30 1,52 5.125}
{0 CHEMBL82609,8 1,21 1,28 1,30 1,52 5.658}
{0 CHEMBL82716,8 1,21 1,30 1,52 7.167}
{0 CHEMBL86663,8 1,21 1,30 1,52 6}
{0 CHEMBL87147,3 1,8 1,21 1,30 1,52 5.678}
{0 CHEMBL88216,6 1,8 1,10 1,30 1,43 1,52 6}
{0 CHEMBL89058,6 1,8 1,30 1,43 1,52 6}
{0 CHEMBL89241,8 1,10 1,30 1,43 1,52 7.192}
{0 CHEMBL89331,6 1,8 1,30 1,43 1,52 6.191}
{0 CHEMBL89581,6 1,8 1,10 1,30 1,43 1,52 6.068}
{0 CHEMBL90674,6 1,8 1,30 1,43 1,52 6}
{0 CHEMBL92096,8 1,30 1,52 5.222}
{0 CHEMBL92284,8 1,30 1,43 1,52 6}
{0 CHEMBL92394,8 1,30 1,43 1,52 6}
{0 CHEMBL92926,8 1,21 1,30 1,33 1,52 5.57}
{0 CHEMBL93518,8 1,30 1,43 1,52 6}
{0 CHEMBL93538,8 1,30 1,33 1,52 6.161}
{0 CHEMBL93577,8 1,30 1,52 6.678}
{0 CHEMBL93848,8 1,30 1,43 1,52 6}
{0 CHEMBL96184,8 1,21 1,30 1,52 6.025}
{0 CHEMBL97910,8 1,21 1,30 1,52 5}
{0 CHEMBL98142,8 1,21 1,30 1,52 5}
{0 CHEMBL98172,8 1,21 1,30 1,52 5}
{0 CHEMBL99325,4 1,8 1,21 1,30 1,52 5}
