"molecule_id","AMW","C.","H.","Me","Mi","Mp","Mv","MW","N.","nAB","nAT","nB","nBM","nBO","nBR","nBT","nC","nCL","nCsp","nCsp2","nCsp3","nDB","nF","nH","nHet","nHM","nI","nN","nO","nP","nS","nSK","nTB","nX","O.","RBF","RBN","SCBO","Se","Si","Sp","Sv","X.","pXC50"
{1 8.145,2 36.4,3 40.9,4 1.028,5 1.144,6 0.646,7 0.64,8 537.6,9 13.6,10 16,11 66,13 19,14 44,16 71,17 24,20 14,21 10,22 3,24 27,25 15,28 9,29 6,32 39,35 9.1,36 0.07,37 5,38 55,39 67.832,40 75.478,41 42.631,42 42.223,44 7.347}
{0 CHEMBL123797,1 8.429,2 51.6,3 35.5,4 1.005,5 1.109,6 0.726,7 0.706,8 261.3,9 9.7,10 17,11 31,13 18,14 22,16 33,17 16,19 1,20 14,21 1,24 11,25 4,28 3,29 1,32 20,33 1,35 3.2,36 0.03,37 1,38 32.5,39 31.167,40 34.365,41 22.517,42 21.886,44 6.569}
{0 CHEMBL123798,1 9.42,2 47.1,3 32.4,4 1.05,5 1.145,6 0.685,7 0.7,8 320.29,9 5.9,10 17,11 34,13 17,14 25,16 36,17 16,20 14,21 2,23 3,24 11,25 7,28 2,29 2,32 23,34 3,35 5.9,36 0.056,37 2,38 33.5,39 35.698,40 38.926,41 23.301,42 23.783,43 8.8,44 4.409}
{0 CHEMBL123904,1 8.39,2 42.9,3 38.1,4 1.024,5 1.127,6 0.676,7 0.669,8 176.19,9 9.5,10 6,11 21,13 8,14 14,16 22,17 9,20 8,21 1,22 2,24 8,25 4,28 2,29 2,32 13,35 9.5,38 19,39 21.509,40 23.661,41 14.205,42 14.053,44 6.398}
{0 CHEMBL124749,1 7.876,2 50,3 40,4 0.998,5 1.109,6 0.709,7 0.68,8 236.29,9 6.7,10 17,11 30,13 17,14 20,16 32,17 15,20 14,21 1,24 12,25 3,28 2,29 1,32 18,35 3.3,36 0.031,37 1,38 28.5,39 29.949,40 33.282,41 21.273,42 20.392,44 6.06}
{0 CHEMBL125154,1 9.009,2 45.5,3 33.3,4 1.035,5 1.121,6 0.693,7 0.698,8 297.29,9 9.1,10 17,11 33,13 19,14 24,16 35,17 15,20 14,21 1,22 2,24 11,25 7,28 3,29 4,32 22,35 12.1,36 0.086,37 3,38 34.5,39 34.149,40 36.993,41 22.881,42 23.031,44 6.071}
{0 CHEMBL125200,1 7.01,2 43.5,3 47.8,4 0.993,5 1.121,6 0.664,7 0.625,8 161.22,9 4.3,10 6,11 23,13 7,14 13,16 24,17 10,20 7,21 3,22 1,24 11,25 2,28 1,29 1,32 12,35 4.3,38 17,39 22.847,40 25.784,41 15.267,42 14.37,44 6.357}
{0 CHEMBL125244,1 8.138,2 48.4,3 38.7,4 1.009,5 1.113,6 0.701,7 0.681,8 252.29,9 6.5,10 17,11 31,13 17,14 21,16 33,17 15,20 14,21 1,24 12,25 4,28 2,29 2,32 19,35 6.5,36 0.03,37 1,38 29.5,39 31.276,40 34.491,41 21.727,42 21.106,44 6.658}
{0 CHEMBL126167,1 8.443,2 46.7,3 36.7,4 1.016,5 1.119,6 0.699,7 0.687,8 253.28,9 10,10 17,11 30,13 17,14 21,16 32,17 14,20 14,24 11,25 5,28 3,29 2,32 19,35 6.7,36 0.031,37 1,38 29.5,39 30.494,40 33.575,41 20.972,42 20.601,44 6.284}
{0 CHEMBL126871,1 8.138,2 48.4,3 38.7,4 1.009,5 1.113,6 0.701,7 0.681,8 252.29,9 6.5,10 17,11 31,13 17,14 21,16 33,17 15,20 14,21 1,24 12,25 4,28 2,29 2,32 19,35 6.5,36 0.061,37 2,38 29.5,39 31.276,40 34.491,41 21.727,42 21.106,44 5.377}
{0 CHEMBL127101,1 7.833,2 47.1,3 41.2,4 1.005,5 1.115,6 0.691,7 0.666,8 266.32,9 5.9,10 17,11 34,13 17,14 22,16 36,17 16,20 14,21 2,24 14,25 4,28 2,29 2,32 20,35 5.9,36 0.056,37 2,38 30.5,39 34.16,40 37.907,41 23.489,42 22.633,44 6.721}
{0 CHEMBL127335,1 8.768,2 48.3,3 34.5,4 1.025,5 1.113,6 0.704,7 0.7,8 254.26,9 6.9,10 17,11 29,13 17,14 21,16 31,17 14,20 14,24 10,25 5,28 2,29 3,32 19,35 10.3,36 0.032,37 1,38 29.5,39 29.72,40 32.286,41 20.421,42 20.294,44 6.538}
{0 CHEMBL127396,1 8.79,2 46.9,3 34.4,4 1.026,5 1.118,6 0.701,7 0.697,8 281.29,9 9.4,10 17,11 32,13 19,14 23,16 34,17 15,20 14,21 1,22 2,24 11,25 6,28 3,29 3,32 21,35 9.4,36 0.059,37 2,38 33.5,39 32.822,40 35.784,41 22.426,42 22.316,44 6.886}
{0 CHEMBL147359,1 8.888,2 45.5,3 33.3,4 1.025,5 1.126,6 0.704,7 0.701,8 293.31,9 15.2,10 17,11 33,13 19,14 24,16 35,17 15,20 14,21 1,22 2,24 11,25 7,28 5,29 2,32 22,35 6.1,36 0.086,37 3,38 34.5,39 33.814,40 37.156,41 23.222,42 23.117,44 5.714}
{0 CHEMBL150423,1 7.565,2 40.7,3 44.4,4 1.01,5 1.129,6 0.657,7 0.634,8 204.25,9 7.4,10 6,11 27,13 8,14 16,16 28,17 11,20 8,21 3,22 2,24 12,25 4,28 2,29 2,32 15,35 7.4,36 0.036,37 1,38 21,39 27.276,40 30.491,41 17.727,42 17.106,44 4}
{0 CHEMBL151549,1 7.575,2 43.5,3 43.5,4 1.003,5 1.125,6 0.674,7 0.646,8 174.22,9 8.7,10 11,11 23,13 11,14 14,16 24,17 10,20 8,21 2,24 10,25 3,28 2,29 1,32 13,35 4.3,38 19.5,39 23.065,40 25.867,41 15.511,42 14.865,44 6.409}
{0 CHEMBL151728,1 8.1,2 45.5,3 39.4,4 1.011,5 1.121,6 0.689,7 0.671,8 267.31,9 9.1,10 17,11 33,13 17,14 22,16 35,17 15,20 14,21 1,24 13,25 5,28 3,29 2,32 20,35 6.1,36 0.057,37 2,38 30.5,39 33.378,40 36.99,41 22.733,42 22.128,44 6.523}
{0 CHEMBL166286,1 7.561,2 37.9,3 44.8,4 1.013,5 1.138,6 0.646,7 0.625,8 219.27,9 10.3,10 6,11 29,13 8,14 17,16 30,17 11,20 8,21 3,22 2,24 13,25 5,28 3,29 2,32 16,35 6.9,36 0.1,37 3,38 22,39 29.378,40 32.99,41 18.733,42 18.128,44 4.523}
{0 CHEMBL168212,1 7.475,2 44.2,3 44.2,4 1.001,5 1.122,6 0.675,7 0.644,8 321.41,9 7,10 12,11 43,13 14,14 27,16 46,17 19,20 14,21 5,22 2,24 19,25 5,28 3,29 2,32 24,35 4.7,36 0.065,37 3,38 35,39 43.029,40 48.235,41 29.017,42 27.708,44 4.523}
{0 CHEMBL169140,1 7.799,2 42.1,3 42.1,4 1.01,5 1.129,6 0.671,7 0.649,8 148.18,9 10.5,10 6,11 19,13 7,14 12,16 20,17 8,20 7,21 1,22 1,24 8,25 3,28 2,29 1,32 11,35 5.3,38 16,39 19.182,40 21.452,41 12.75,42 12.338,44 4.523}
{0 CHEMBL169806,1 7.442,2 37.8,3 45.9,4 1.013,5 1.136,6 0.641,7 0.619,8 275.34,9 8.1,10 6,11 37,13 8,14 22,16 39,17 14,20 8,21 6,22 2,24 17,25 6,28 3,29 3,32 20,35 8.1,36 0.077,37 3,38 27,39 37.473,40 42.03,41 23.71,42 22.896,44 4.523}
{0 CHEMBL170272,1 6.456,2 36.2,3 53.2,4 0.993,5 1.138,6 0.623,7 0.581,8 303.45,9 6.4,10 6,11 47,13 8,14 23,16 48,17 17,20 8,21 9,22 2,24 25,25 5,28 3,29 2,32 22,35 4.3,36 0.188,37 9,38 28,39 46.68,40 53.481,41 29.302,42 27.289,44 4.523}
{0 CHEMBL171082,1 6.878,2 36.8,3 50,4 1.001,5 1.138,6 0.632,7 0.598,8 261.36,9 7.9,10 6,11 38,13 8,14 20,16 39,17 14,20 8,21 6,22 2,24 19,25 5,28 3,29 2,32 19,35 5.3,36 0.128,37 5,38 25,39 38.029,40 43.235,41 24.017,42 22.708,44 4.523}
{0 CHEMBL171083,1 7.034,2 36.6,3 48.8,4 1.003,5 1.14,6 0.635,7 0.603,8 288.39,9 9.8,10 6,11 41,13 8,14 23,16 43,17 15,20 8,21 7,22 2,24 20,25 6,28 4,29 2,32 21,35 4.9,36 0.07,37 3,38 28,39 41.131,40 46.734,41 26.023,42 24.73,44 4.523}
{0 CHEMBL171978,1 6.873,2 36.4,3 50,4 1,5 1.14,6 0.631,7 0.597,8 302.42,9 9.1,10 6,11 44,13 8,14 24,16 46,17 16,20 8,21 8,22 2,24 22,25 6,28 4,29 2,32 22,35 4.5,36 0.087,37 4,38 29,39 44.014,40 50.149,41 27.784,42 26.256,44 4.523}
{0 CHEMBL172743,1 8.434,2 40,3 37.5,4 1.023,5 1.139,6 0.675,7 0.667,8 337.38,9 17.5,10 16,11 40,13 18,14 28,16 43,17 16,20 13,21 3,22 2,24 15,25 9,28 7,29 2,32 25,35 5,36 0.093,37 4,38 38,39 40.902,40 45.568,41 26.995,42 26.687,44 5.523}
{0 CHEMBL266608,1 7.926,2 41.7,3 41.7,4 1.016,5 1.128,6 0.665,7 0.649,8 190.22,9 8.3,10 6,11 24,13 8,14 15,16 25,17 10,20 8,21 2,22 2,24 10,25 4,28 2,29 2,32 14,35 8.3,38 20,39 24.393,40 27.076,41 15.966,42 15.58,44 4}
{0 CHEMBL338088,1 9.442,2 46.7,3 30,4 1.042,5 1.119,6 0.704,7 0.717,8 283.26,9 10,10 17,11 30,13 19,14 23,16 32,17 14,20 14,22 2,24 9,25 7,28 3,29 4,32 21,35 13.3,36 0.063,37 2,38 33.5,39 31.265,40 33.578,41 21.119,42 21.504,44 6.638}
{0 CHEMBL339631,1 8.666,2 50,3 34.4,4 1.015,5 1.112,6 0.718,7 0.706,8 277.3,9 9.4,10 17,11 32,13 18,14 23,16 34,17 16,19 1,20 14,21 1,24 11,25 5,28 3,29 2,32 21,33 1,35 6.3,36 0.059,37 2,38 33.5,39 32.494,40 35.575,41 22.972,42 22.601,44 5.873}
{0 CHEMBL339695,1 8.065,2 50,3 38.9,4 1.004,5 1.109,6 0.708,7 0.684,8 145.17,9 5.6,10 11,11 18,13 11,14 12,16 19,17 9,20 9,24 7,25 2,28 1,29 1,32 11,35 5.6,38 17.5,39 18.08,40 19.953,41 12.744,42 12.317,44 4.801}
{0 CHEMBL340481,1 8.066,2 45.7,3 40,4 1.014,5 1.118,6 0.684,7 0.667,8 282.32,9 5.7,10 17,11 35,13 17,14 23,16 37,17 16,20 14,21 2,24 14,25 5,28 2,29 3,32 21,35 8.6,36 0.081,37 3,38 31.5,39 35.487,40 39.116,41 23.943,42 23.348,44 5.699}
{0 CHEMBL340620,1 8.176,2 47.2,3 38.9,4 1.014,5 1.114,6 0.693,7 0.676,8 294.33,9 5.6,10 17,11 36,13 18,14 24,16 38,17 17,20 15,21 2,22 1,24 14,25 5,28 2,29 3,32 22,35 8.3,36 0.079,37 3,38 33.5,39 36.487,40 40.116,41 24.943,42 24.348,44 5.319}
{0 CHEMBL341142,1 8.509,2 50,3 35.7,4 1.014,5 1.11,6 0.713,7 0.699,8 238.26,9 7.1,10 17,11 28,13 17,14 20,16 30,17 14,20 14,24 10,25 4,28 2,29 2,32 18,35 7.1,36 0.033,37 1,38 28.5,39 28.393,40 31.076,41 19.966,42 19.58,44 5.975}
{0 CHEMBL346886,1 9.221,2 48.5,3 33.3,4 1.042,5 1.143,6 0.692,7 0.699,8 304.29,9 6.1,10 17,11 33,13 17,14 24,16 35,17 16,20 14,21 2,23 3,24 11,25 6,28 2,29 1,32 22,34 3,35 3,36 0.029,37 1,38 32.5,39 34.371,40 37.716,41 22.847,42 23.068,43 9.1,44 5}
{0 CHEMBL352926,1 8.743,2 53.3,3 33.3,4 1.013,5 1.103,6 0.732,7 0.719,8 131.14,9 6.7,10 6,11 15,13 8,14 11,16 16,17 8,20 8,22 2,24 5,25 2,28 1,29 1,32 10,35 6.7,38 16,39 15.196,40 16.538,41 10.983,42 10.79,44 4.523}
{0 CHEMBL353789,1 8.212,2 35.6,3 40.7,4 1.031,5 1.145,6 0.642,7 0.639,8 484.53,9 13.6,10 16,11 59,13 19,14 38,16 62,17 21,20 14,21 7,22 3,24 24,25 14,28 8,29 6,32 35,35 10.2,36 0.129,37 8,38 49,39 60.847,40 67.564,41 37.864,42 37.674,44 4.125}
{0 CHEMBL355633,1 7.291,2 37.5,3 46.9,4 1.008,5 1.138,6 0.64,7 0.614,8 233.3,9 9.4,10 6,11 32,13 8,14 18,16 33,17 12,20 8,21 4,22 2,24 15,25 5,28 3,29 2,32 17,35 6.3,36 0.121,37 4,38 23,39 32.262,40 36.405,41 20.495,42 19.655,44 4.745}
{0 CHEMBL355675,1 8.28,2 45.9,3 37.8,4 1.013,5 1.121,6 0.696,7 0.68,8 306.35,9 10.8,10 16,11 37,13 18,14 26,16 40,17 17,20 15,21 2,22 2,24 14,25 6,28 4,29 2,32 23,35 5.4,36 0.075,37 3,38 36,39 37.48,40 41.488,41 25.739,42 25.149,44 5.523}
{0 CHEMBL419424,1 8.068,2 41.2,3 41.2,4 1.024,5 1.127,6 0.659,7 0.649,8 137.15,9 5.9,10 6,11 17,13 7,14 10,16 17,17 7,20 7,22 1,24 7,25 3,28 1,29 2,32 10,35 11.8,36 0.059,37 1,38 14,39 17.407,40 19.163,41 11.199,42 11.031,44 5.097}
{0 CHEMBL424399,1 7.963,2 40,3 41.5,4 1.018,5 1.134,6 0.66,7 0.646,8 517.6,9 10.8,10 22,11 65,13 24,14 42,16 69,17 26,20 19,21 7,22 2,24 27,25 12,28 7,29 5,32 38,35 7.7,36 0.116,37 8,38 55,39 66.185,40 73.687,41 42.926,42 41.992,44 5.301}
{0 CHEMBL435871,1 7.926,2 41.7,3 41.7,4 1.016,5 1.128,6 0.665,7 0.649,8 190.22,9 8.3,10 11,11 24,13 11,14 15,16 25,17 10,20 8,21 2,24 10,25 4,28 2,29 2,32 14,35 8.3,36 0.04,37 1,38 20.5,39 24.393,40 27.076,41 15.966,42 15.58,44 6.108}
{0 CHEMBL537836,1 7.22,2 36.8,3 47.4,4 1.007,5 1.14,6 0.638,7 0.611,8 274.36,9 10.5,10 6,11 38,13 8,14 22,16 40,17 14,20 8,21 6,22 2,24 18,25 6,28 4,29 2,32 20,35 5.3,36 0.075,37 3,38 27,39 38.247,40 43.318,41 24.262,42 23.203,44 4.745}
{0 CHEMBL541203,1 7.853,2 46.9,3 40.6,4 1.002,5 1.118,6 0.696,7 0.669,8 251.31,9 9.4,10 17,11 32,13 17,14 21,16 34,17 15,20 14,21 1,24 13,25 4,28 3,29 1,32 19,35 3.1,36 0.029,37 1,38 29.5,39 32.051,40 35.78,41 22.279,42 21.413,44 6.357}
{0 CHEMBL607633,1 7.676,2 36.1,3 44.4,4 1.019,5 1.142,6 0.638,7 0.622,8 552.66,9 11.1,10 16,11 72,13 19,14 44,16 76,17 26,20 14,21 12,22 3,24 32,25 14,28 8,29 6,32 40,35 8.3,36 0.145,37 11,38 55,39 73.381,40 82.225,41 45.909,42 44.782,44 6.155}
{0 CHEMBL607634,1 7.806,2 36.2,3 43.5,4 1.022,5 1.142,6 0.64,7 0.627,8 538.63,9 11.6,10 16,11 69,13 19,14 43,16 73,17 25,20 14,21 11,22 3,24 30,25 14,28 8,29 6,32 39,35 8.7,36 0.137,37 10,38 54,39 70.498,40 78.81,41 44.148,42 43.255,44 5.523}
{0 CHEMBL607648,1 8.104,2 36.5,3 41.3,4 1.027,5 1.143,6 0.645,7 0.638,8 510.57,9 12.7,10 16,11 63,13 19,14 41,16 67,17 23,20 14,21 9,22 3,24 26,25 14,28 8,29 6,32 37,35 9.5,36 0.119,37 8,38 52,39 64.731,40 71.98,41 40.625,42 40.201,44 6.347}
{0 CHEMBL607649,1 8.276,2 36.7,3 40,4 1.031,5 1.143,6 0.648,7 0.645,8 496.54,9 13.3,10 16,11 60,13 19,14 40,16 64,17 22,20 14,21 8,22 3,24 24,25 14,28 8,29 6,32 36,35 10,36 0.109,37 7,38 51,39 61.847,40 68.564,41 38.864,42 38.674,44 7}
{0 CHEMBL607650,1 8.465,2 36.8,3 38.6,4 1.034,5 1.143,6 0.651,7 0.652,8 482.51,9 14,10 16,11 57,13 19,14 39,16 61,17 21,20 14,21 7,22 3,24 22,25 14,28 8,29 6,32 35,35 10.5,36 0.098,37 6,38 50,39 58.963,40 65.149,41 37.102,42 37.148,44 5.721}
{0 CHEMBL607657,1 8.391,2 41.2,3 38.2,4 1.025,5 1.132,6 0.671,7 0.665,8 570.62,9 11.8,10 22,11 68,13 26,14 47,16 73,17 28,20 22,21 6,22 4,24 26,25 14,28 8,29 6,32 42,35 8.8,36 0.096,37 7,38 62,39 69.731,40 76.98,41 45.625,42 45.201,44 5}
{0 CHEMBL607928,1 8.465,2 36.8,3 38.6,4 1.034,5 1.143,6 0.651,7 0.652,8 482.51,9 14,10 16,11 57,13 19,14 39,16 61,17 21,20 14,21 7,22 3,24 22,25 14,28 8,29 6,32 35,35 10.5,36 0.098,37 6,38 50,39 58.963,40 65.149,41 37.102,42 37.148,44 6.155}
{0 CHEMBL608232,1 7.948,2 36.4,3 42.4,4 1.024,5 1.142,6 0.642,7 0.632,8 524.6,9 12.1,10 16,11 66,13 19,14 42,16 70,17 24,20 14,21 10,22 3,24 28,25 14,28 8,29 6,32 38,35 9.1,36 0.129,37 9,38 53,39 67.614,40 75.395,41 42.387,42 41.728,44 6.046}
{0 CHEMBL608508,1 7.798,2 36.6,3 43.7,4 1.023,5 1.14,6 0.639,7 0.626,8 553.64,9 9.9,10 16,11 71,13 19,14 44,16 75,17 26,20 14,21 12,22 3,24 31,25 14,28 7,29 7,32 40,35 9.9,36 0.147,37 11,38 55,39 72.607,40 80.936,41 45.358,42 44.475,44 4.167}
{0 CHEMBL608783,1 7.445,2 35.9,3 46.2,4 1.015,5 1.142,6 0.634,7 0.613,8 580.72,9 10.3,10 16,11 78,13 19,14 46,16 82,17 28,20 14,21 14,22 3,24 36,25 14,28 8,29 6,32 42,35 7.7,36 0.159,37 13,38 57,39 79.149,40 89.056,41 49.432,42 47.835,44 5.523}
{0 CHEMBL608784,1 7.556,2 36,3 45.3,4 1.017,5 1.142,6 0.636,7 0.617,8 566.69,9 10.7,10 16,11 75,13 19,14 45,16 79,17 27,20 14,21 13,22 3,24 34,25 14,28 8,29 6,32 41,35 8,36 0.152,37 12,38 56,39 76.265,40 85.64,41 47.671,42 46.308,44 5.699}
{0 CHEMBL608792,1 8.276,2 36.7,3 40,4 1.031,5 1.143,6 0.648,7 0.645,8 496.54,9 13.3,10 16,11 60,13 19,14 40,16 64,17 22,20 14,21 8,22 3,24 24,25 14,28 8,29 6,32 36,35 10,36 0.094,37 6,38 51,39 61.847,40 68.564,41 38.864,42 38.674,44 6.602}
{0 CHEMBL81977,1 7.565,2 38.9,3 44.4,4 1.01,5 1.136,6 0.653,7 0.63,8 136.17,9 11.1,10 6,11 18,13 7,14 10,16 18,17 7,20 7,22 1,24 8,25 3,28 2,29 1,32 10,35 5.6,36 0.056,37 1,38 14,39 18.182,40 20.452,41 11.75,42 11.338,44 4.719}
