"molecule_id","FCFP4_1024b937","FCFP4_1024b553","FCFP4_1024b787","FCFP4_1024b10","FCFP4_1024b971","FCFP4_1024b521","FCFP4_1024b137","FCFP4_1024b472","FCFP4_1024b120","FCFP4_1024b18","FCFP4_1024b419","FCFP4_1024b876","FCFP4_1024b504","FCFP4_1024b395","FCFP4_1024b299","FCFP4_1024b1002","FCFP4_1024b294","FCFP4_1024b247","FCFP4_1024b46","FCFP4_1024b881","FCFP4_1024b826","FCFP4_1024b173","FCFP4_1024b487","FCFP4_1024b847","FCFP4_1024b943","FCFP4_1024b556","FCFP4_1024b446","FCFP4_1024b832","FCFP4_1024b986","FCFP4_1024b178","FCFP4_1024b35","FCFP4_1024b843","FCFP4_1024b952","FCFP4_1024b714","FCFP4_1024b167","FCFP4_1024b348","FCFP4_1024b799","FCFP4_1024b573","FCFP4_1024b378","FCFP4_1024b4","FCFP4_1024b152","FCFP4_1024b631","FCFP4_1024b441","FCFP4_1024b1009","FCFP4_1024b784","FCFP4_1024b366","FCFP4_1024b365","FCFP4_1024b466","FCFP4_1024b351","FCFP4_1024b888","FCFP4_1024b983","pXC50"
{1 1,19 1,20 1,24 1,34 1,37 1,40 1,41 1,47 1,52 6.62}
{0 CHEMBL103575,4 1,16 1,19 1,20 1,34 1,40 1,48 1,51 1,52 8.301}
{0 CHEMBL108161,1 1,2 1,3 1,5 1,6 1,10 1,14 1,16 1,22 1,34 1,40 1,43 1,49 1,52 10}
{0 CHEMBL109303,1 1,4 1,5 1,6 1,7 1,8 1,9 1,10 1,11 1,12 1,13 1,17 1,18 1,21 1,40 1,49 1,52 9}
{0 CHEMBL109418,1 1,4 1,5 1,6 1,7 1,8 1,10 1,11 1,13 1,18 1,21 1,40 1,49 1,52 7.032}
{0 CHEMBL109426,6 1,10 1,21 1,40 1,52 4}
{0 CHEMBL110046,6 1,10 1,21 1,22 1,30 1,47 1,52 5.495}
{0 CHEMBL112079,1 1,4 1,5 1,6 1,7 1,8 1,9 1,10 1,11 1,12 1,13 1,17 1,18 1,21 1,22 1,24 1,52 7.377}
{0 CHEMBL112190,1 1,4 1,5 1,6 1,7 1,8 1,10 1,12 1,13 1,17 1,18 1,21 1,22 1,24 1,52 4}
{0 CHEMBL112324,1 1,4 1,5 1,6 1,7 1,8 1,10 1,11 1,13 1,18 1,21 1,22 1,49 1,52 8.097}
{0 CHEMBL112490,1 1,4 1,5 1,6 1,7 1,8 1,9 1,10 1,11 1,12 1,13 1,17 1,18 1,21 1,40 1,52 5.886}
{0 CHEMBL112883,6 1,10 1,21 1,22 1,52 7.721}
{0 CHEMBL112940,1 1,4 1,5 1,6 1,7 1,8 1,9 1,10 1,11 1,12 1,13 1,17 1,18 1,21 1,40 1,52 9.155}
{0 CHEMBL112956,1 1,4 1,5 1,6 1,7 1,8 1,9 1,10 1,11 1,12 1,13 1,17 1,18 1,21 1,22 1,52 8.097}
{0 CHEMBL113096,6 1,10 1,21 1,22 1,24 1,52 4}
{0 CHEMBL113226,19 1,20 1,34 1,40 1,52 9.398}
{0 CHEMBL114025,1 1,4 1,5 1,6 1,7 1,8 1,10 1,11 1,13 1,18 1,21 1,22 1,29 1,49 1,52 6.635}
{0 CHEMBL114086,1 1,4 1,5 1,6 1,7 1,8 1,10 1,11 1,13 1,18 1,21 1,40 1,49 1,52 9.347}
{0 CHEMBL121759,1 1,2 1,3 1,5 1,6 1,10 1,14 1,16 1,18 1,22 1,29 1,34 1,40 1,43 1,47 1,49 1,52 7.409}
{0 CHEMBL121863,1 1,2 1,3 1,5 1,6 1,10 1,14 1,16 1,22 1,24 1,34 1,40 1,43 1,49 1,52 8.699}
{0 CHEMBL121921,1 1,2 1,3 1,4 1,5 1,6 1,9 1,10 1,11 1,12 1,14 1,16 1,21 1,34 1,40 1,43 1,49 1,52 9.398}
{0 CHEMBL122086,1 1,2 1,3 1,5 1,6 1,10 1,14 1,16 1,22 1,34 1,40 1,43 1,49 1,52 9}
{0 CHEMBL122103,1 1,2 1,3 1,5 1,6 1,10 1,14 1,16 1,22 1,34 1,40 1,43 1,44 1,49 1,52 6.292}
{0 CHEMBL122362,1 1,2 1,3 1,5 1,6 1,10 1,14 1,16 1,22 1,24 1,34 1,40 1,43 1,49 1,52 8.523}
{0 CHEMBL122678,1 1,2 1,3 1,4 1,5 1,6 1,9 1,10 1,11 1,12 1,14 1,16 1,21 1,34 1,40 1,43 1,49 1,52 9.699}
{0 CHEMBL122794,1 1,2 1,3 1,4 1,5 1,6 1,9 1,10 1,11 1,12 1,14 1,16 1,21 1,34 1,40 1,43 1,49 1,52 7.796}
{0 CHEMBL122829,1 1,2 1,3 1,5 1,6 1,10 1,14 1,16 1,22 1,34 1,40 1,43 1,44 1,49 1,52 6.432}
{0 CHEMBL122882,1 1,2 1,3 1,5 1,6 1,10 1,14 1,16 1,22 1,34 1,40 1,43 1,49 1,52 9.097}
{0 CHEMBL123019,1 1,2 1,3 1,5 1,6 1,10 1,14 1,16 1,22 1,34 1,40 1,43 1,49 1,52 10}
{0 CHEMBL123339,1 1,2 1,3 1,5 1,6 1,9 1,10 1,12 1,14 1,16 1,22 1,34 1,40 1,43 1,49 1,52 9.398}
{0 CHEMBL124229,1 1,2 1,3 1,5 1,6 1,10 1,14 1,16 1,34 1,40 1,43 1,49 1,52 9.388}
{0 CHEMBL124403,1 1,2 1,3 1,5 1,6 1,10 1,14 1,16 1,22 1,34 1,40 1,43 1,44 1,49 1,52 7.022}
{0 CHEMBL127610,19 1,20 1,24 1,25 1,34 1,40 1,41 1,52 5.699}
{0 CHEMBL128448,19 1,20 1,24 1,25 1,31 1,34 1,37 1,40 1,41 1,47 1,52 6.432}
{0 CHEMBL128611,19 1,20 1,24 1,25 1,31 1,34 1,40 1,41 1,52 6.18}
{0 CHEMBL128898,15 1,19 1,20 1,24 1,25 1,34 1,37 1,40 1,41 1,47 1,50 1,52 5.046}
{0 CHEMBL128937,19 1,20 1,24 1,25 1,34 1,40 1,41 1,52 6.222}
{0 CHEMBL128967,19 1,20 1,24 1,25 1,31 1,34 1,40 1,41 1,52 7.638}
{0 CHEMBL129109,19 1,20 1,24 1,25 1,31 1,34 1,40 1,41 1,52 5.553}
{0 CHEMBL129110,19 1,20 1,24 1,25 1,34 1,40 1,41 1,52 5.959}
{0 CHEMBL129116,24 1,25 1,31 1,34 1,40 1,41 1,47 1,50 1,52 5}
{0 CHEMBL129140,19 1,20 1,24 1,31 1,34 1,40 1,41 1,49 1,52 7.337}
{0 CHEMBL129175,19 1,20 1,24 1,25 1,31 1,34 1,40 1,41 1,49 1,52 6}
{0 CHEMBL129589,19 1,20 1,24 1,25 1,31 1,34 1,40 1,41 1,49 1,52 6.921}
{0 CHEMBL129603,19 1,20 1,24 1,25 1,31 1,34 1,40 1,41 1,52 7.013}
{0 CHEMBL129718,19 1,20 1,24 1,31 1,34 1,40 1,41 1,52 7.155}
{0 CHEMBL129723,19 1,20 1,24 1,25 1,31 1,34 1,40 1,41 1,52 6.398}
{0 CHEMBL130769,19 1,20 1,24 1,25 1,31 1,34 1,40 1,41 1,47 1,50 1,52 6.151}
{0 CHEMBL131001,19 1,20 1,24 1,34 1,40 1,47 1,50 1,52 5.222}
{0 CHEMBL131058,15 1,19 1,20 1,24 1,25 1,31 1,34 1,37 1,40 1,41 1,47 1,50 1,52 6}
{0 CHEMBL132155,19 1,20 1,24 1,31 1,34 1,40 1,41 1,49 1,52 7.398}
{0 CHEMBL132547,1 1,2 1,3 1,5 1,6 1,10 1,14 1,34 1,40 1,43 1,49 1,52 8.824}
{0 CHEMBL132588,1 1,2 1,3 1,5 1,6 1,10 1,14 1,16 1,22 1,34 1,40 1,52 8}
{0 CHEMBL132645,1 1,2 1,3 1,5 1,6 1,10 1,14 1,16 1,22 1,34 1,40 1,45 1,52 9.301}
{0 CHEMBL133370,1 1,2 1,3 1,5 1,6 1,10 1,14 1,22 1,34 1,40 1,52 8.18}
{0 CHEMBL134396,1 1,2 1,3 1,5 1,6 1,10 1,14 1,16 1,22 1,24 1,34 1,40 1,52 9.456}
{0 CHEMBL134726,1 1,2 1,3 1,5 1,6 1,10 1,14 1,16 1,22 1,34 1,40 1,52 9.215}
{0 CHEMBL135385,1 1,2 1,3 1,5 1,6 1,10 1,14 1,16 1,22 1,24 1,34 1,40 1,52 6}
{0 CHEMBL135446,1 1,2 1,3 1,5 1,6 1,10 1,14 1,16 1,22 1,34 1,40 1,49 1,52 8.268}
{0 CHEMBL135544,1 1,2 1,3 1,5 1,6 1,10 1,14 1,16 1,34 1,40 1,52 8.167}
{0 CHEMBL135559,1 1,2 1,3 1,5 1,6 1,10 1,14 1,16 1,34 1,40 1,52 6.854}
{0 CHEMBL135711,1 1,2 1,3 1,5 1,6 1,10 1,14 1,34 1,40 1,43 1,49 1,52 8.796}
{0 CHEMBL135720,1 1,2 1,3 1,5 1,6 1,10 1,14 1,16 1,22 1,34 1,40 1,52 6.638}
{0 CHEMBL135933,1 1,2 1,3 1,5 1,6 1,10 1,14 1,16 1,22 1,34 1,40 1,49 1,52 6.444}
{0 CHEMBL136023,1 1,2 1,3 1,5 1,6 1,10 1,14 1,16 1,22 1,34 1,40 1,52 7.921}
{0 CHEMBL137088,1 1,2 1,3 1,5 1,6 1,7 1,10 1,14 1,21 1,34 1,40 1,52 6}
{0 CHEMBL137529,1 1,2 1,3 1,5 1,6 1,10 1,14 1,34 1,40 1,52 6}
{0 CHEMBL138436,1 1,2 1,3 1,5 1,6 1,10 1,14 1,16 1,22 1,34 1,40 1,52 6}
{0 CHEMBL138485,2 1,3 1,5 1,6 1,10 1,14 1,16 1,40 1,52 6.796}
{0 CHEMBL162323,1 1,19 1,20 1,24 1,25 1,31 1,34 1,37 1,39 1,40 1,41 1,52 6.26}
{0 CHEMBL162328,1 1,15 1,19 1,20 1,24 1,25 1,30 1,31 1,34 1,37 1,40 1,41 1,52 6.824}
{0 CHEMBL162573,1 1,19 1,24 1,25 1,31 1,34 1,37 1,40 1,41 1,47 1,52 7.301}
{0 CHEMBL162944,1 1,19 1,20 1,24 1,25 1,31 1,34 1,37 1,40 1,41 1,47 1,52 7.745}
{0 CHEMBL164529,1 1,19 1,20 1,24 1,25 1,34 1,37 1,40 1,41 1,47 1,52 8.319}
{0 CHEMBL166022,1 1,19 1,20 1,24 1,25 1,31 1,34 1,37 1,40 1,41 1,47 1,52 6.854}
{0 CHEMBL166373,1 1,19 1,24 1,25 1,31 1,34 1,37 1,39 1,40 1,41 1,52 7.538}
{0 CHEMBL1788122,4 1,6 1,10 1,13 1,24 1,34 1,40 1,47 1,52 8.699}
{0 CHEMBL1790477,1 1,15 1,19 1,20 1,24 1,25 1,31 1,34 1,37 1,39 1,40 1,41 1,52 6.783}
{0 CHEMBL1790752,1 1,19 1,20 1,24 1,25 1,30 1,34 1,37 1,40 1,41 1,47 1,52 7.585}
{0 CHEMBL1790753,1 1,19 1,20 1,24 1,25 1,30 1,34 1,37 1,40 1,41 1,52 7.569}
{0 CHEMBL1790754,1 1,4 1,19 1,20 1,24 1,30 1,34 1,37 1,40 1,41 1,52 7.081}
{0 CHEMBL1790758,19 1,20 1,24 1,25 1,29 1,31 1,34 1,37 1,40 1,41 1,52 6.553}
{0 CHEMBL1793799,1 1,4 1,19 1,20 1,34 1,37 1,40 1,41 1,52 6.347}
{0 CHEMBL179857,1 1,2 1,3 1,4 1,5 1,6 1,7 1,8 1,9 1,10 1,11 1,12 1,13 1,14 1,16 1,17 1,21 1,22 1,23 1,26 1,27 1,28 1,32 1,33 1,35 1,38 1,42 1,45 1,52 8.046}
{0 CHEMBL179902,1 1,2 1,3 1,4 1,5 1,6 1,7 1,8 1,9 1,10 1,11 1,12 1,13 1,14 1,16 1,17 1,21 1,22 1,23 1,26 1,27 1,28 1,32 1,33 1,35 1,38 1,42 1,45 1,52 8.886}
{0 CHEMBL180139,1 1,2 1,3 1,4 1,5 1,6 1,7 1,8 1,9 1,10 1,11 1,12 1,13 1,14 1,16 1,17 1,21 1,22 1,26 1,27 1,28 1,32 1,33 1,35 1,38 1,42 1,43 1,49 1,52 7.796}
{0 CHEMBL180255,1 1,2 1,3 1,4 1,5 1,6 1,7 1,8 1,9 1,10 1,11 1,12 1,13 1,14 1,16 1,17 1,21 1,22 1,24 1,26 1,27 1,28 1,32 1,33 1,35 1,38 1,42 1,43 1,49 1,52 7.292}
{0 CHEMBL180390,1 1,2 1,3 1,4 1,5 1,6 1,7 1,8 1,9 1,10 1,11 1,12 1,13 1,14 1,16 1,17 1,21 1,22 1,24 1,26 1,27 1,28 1,32 1,33 1,35 1,38 1,42 1,43 1,49 1,52 7.42}
{0 CHEMBL180536,1 1,2 1,3 1,4 1,5 1,6 1,7 1,8 1,9 1,10 1,11 1,12 1,13 1,14 1,16 1,17 1,21 1,22 1,26 1,27 1,28 1,32 1,33 1,35 1,38 1,42 1,43 1,49 1,52 7.699}
{0 CHEMBL180547,1 1,2 1,3 1,4 1,5 1,6 1,7 1,8 1,9 1,10 1,11 1,12 1,13 1,14 1,16 1,17 1,21 1,22 1,26 1,27 1,28 1,32 1,33 1,35 1,38 1,42 1,43 1,49 1,52 7.268}
{0 CHEMBL180550,1 1,2 1,3 1,4 1,5 1,6 1,7 1,8 1,9 1,10 1,11 1,12 1,13 1,14 1,16 1,17 1,21 1,22 1,26 1,27 1,28 1,32 1,33 1,35 1,38 1,42 1,43 1,49 1,52 8.081}
{0 CHEMBL180754,1 1,2 1,3 1,4 1,5 1,6 1,7 1,8 1,9 1,10 1,11 1,12 1,13 1,14 1,16 1,17 1,21 1,22 1,26 1,27 1,28 1,32 1,33 1,35 1,38 1,42 1,43 1,49 1,52 7.921}
{0 CHEMBL180801,1 1,2 1,3 1,4 1,5 1,6 1,7 1,8 1,9 1,10 1,11 1,12 1,13 1,14 1,16 1,17 1,21 1,22 1,24 1,26 1,27 1,28 1,32 1,33 1,35 1,38 1,42 1,43 1,49 1,52 7.06}
{0 CHEMBL181318,1 1,2 1,3 1,4 1,5 1,6 1,7 1,8 1,9 1,10 1,11 1,12 1,13 1,14 1,16 1,17 1,21 1,22 1,23 1,26 1,27 1,28 1,32 1,33 1,35 1,38 1,42 1,45 1,52 8.569}
{0 CHEMBL181442,1 1,2 1,3 1,4 1,5 1,6 1,7 1,8 1,9 1,10 1,11 1,12 1,13 1,14 1,16 1,17 1,18 1,21 1,22 1,23 1,41 1,48 1,51 1,52 9.018}
{0 CHEMBL181444,1 1,2 1,3 1,4 1,5 1,6 1,7 1,8 1,9 1,10 1,11 1,12 1,13 1,14 1,16 1,17 1,21 1,22 1,26 1,27 1,28 1,32 1,33 1,35 1,38 1,42 1,43 1,49 1,52 7.215}
{0 CHEMBL181649,1 1,2 1,3 1,4 1,5 1,6 1,7 1,8 1,9 1,10 1,11 1,12 1,13 1,14 1,16 1,17 1,18 1,21 1,22 1,23 1,24 1,44 1,52 5}
{0 CHEMBL181748,1 1,2 1,3 1,4 1,5 1,6 1,7 1,8 1,9 1,10 1,11 1,12 1,13 1,14 1,16 1,17 1,18 1,21 1,22 1,23 1,44 1,52 9.31}
{0 CHEMBL181901,1 1,2 1,3 1,4 1,5 1,6 1,7 1,8 1,9 1,10 1,11 1,12 1,13 1,14 1,16 1,17 1,18 1,21 1,22 1,26 1,27 1,28 1,32 1,33 1,35 1,38 1,42 1,43 1,49 1,52 7.745}
{0 CHEMBL182171,1 1,2 1,3 1,4 1,5 1,6 1,7 1,8 1,9 1,10 1,11 1,12 1,13 1,14 1,16 1,17 1,18 1,21 1,22 1,23 1,44 1,49 1,52 9.222}
{0 CHEMBL182180,1 1,2 1,3 1,4 1,5 1,6 1,7 1,8 1,9 1,10 1,11 1,12 1,13 1,14 1,16 1,17 1,21 1,22 1,23 1,26 1,27 1,28 1,32 1,33 1,35 1,38 1,40 1,42 1,45 1,52 8}
{0 CHEMBL182330,1 1,2 1,3 1,4 1,5 1,6 1,7 1,8 1,9 1,10 1,11 1,12 1,13 1,14 1,16 1,17 1,18 1,21 1,22 1,26 1,27 1,28 1,32 1,33 1,35 1,38 1,42 1,52 8.721}
{0 CHEMBL182347,1 1,2 1,3 1,4 1,5 1,6 1,7 1,8 1,9 1,10 1,11 1,12 1,13 1,14 1,16 1,17 1,21 1,22 1,26 1,27 1,28 1,32 1,33 1,35 1,38 1,42 1,43 1,49 1,52 7.215}
{0 CHEMBL182389,1 1,2 1,3 1,4 1,5 1,6 1,7 1,8 1,9 1,10 1,11 1,12 1,13 1,14 1,16 1,17 1,21 1,22 1,26 1,27 1,28 1,32 1,33 1,35 1,38 1,42 1,43 1,48 1,49 1,51 1,52 7.77}
{0 CHEMBL182512,1 1,2 1,3 1,4 1,5 1,6 1,7 1,8 1,9 1,10 1,11 1,12 1,13 1,14 1,16 1,17 1,21 1,22 1,26 1,27 1,28 1,32 1,33 1,35 1,38 1,42 1,43 1,49 1,52 7.721}
{0 CHEMBL182679,1 1,2 1,3 1,4 1,5 1,6 1,7 1,8 1,9 1,10 1,11 1,12 1,13 1,14 1,16 1,17 1,18 1,21 1,22 1,26 1,27 1,28 1,32 1,33 1,35 1,38 1,42 1,49 1,52 8.678}
{0 CHEMBL182810,1 1,2 1,3 1,4 1,5 1,6 1,7 1,8 1,9 1,10 1,11 1,12 1,13 1,14 1,16 1,17 1,18 1,21 1,22 1,23 1,44 1,52 8.367}
{0 CHEMBL182812,1 1,2 1,3 1,4 1,5 1,6 1,7 1,8 1,9 1,10 1,11 1,12 1,13 1,14 1,16 1,17 1,21 1,22 1,26 1,27 1,28 1,32 1,33 1,35 1,38 1,42 1,45 1,52 8.215}
{0 CHEMBL182816,1 1,2 1,3 1,4 1,5 1,6 1,7 1,8 1,9 1,10 1,11 1,12 1,13 1,17 1,18 1,21 1,22 1,52 8.398}
{0 CHEMBL182925,1 1,2 1,3 1,4 1,5 1,6 1,7 1,8 1,9 1,10 1,11 1,12 1,13 1,14 1,16 1,17 1,21 1,22 1,26 1,27 1,28 1,32 1,33 1,35 1,38 1,42 1,43 1,49 1,52 8.215}
{0 CHEMBL182944,1 1,2 1,3 1,4 1,5 1,6 1,7 1,8 1,9 1,10 1,11 1,12 1,13 1,14 1,16 1,17 1,21 1,22 1,26 1,27 1,28 1,32 1,33 1,35 1,38 1,42 1,43 1,49 1,52 7.092}
{0 CHEMBL182978,1 1,2 1,3 1,4 1,5 1,6 1,7 1,8 1,9 1,10 1,11 1,12 1,13 1,14 1,16 1,17 1,18 1,21 1,22 1,26 1,27 1,28 1,32 1,33 1,35 1,38 1,42 1,43 1,49 1,52 8.359}
{0 CHEMBL183097,1 1,2 1,3 1,4 1,5 1,6 1,7 1,8 1,9 1,10 1,11 1,12 1,13 1,14 1,16 1,17 1,21 1,22 1,26 1,27 1,28 1,32 1,33 1,35 1,38 1,42 1,45 1,52 8.77}
{0 CHEMBL183140,1 1,2 1,3 1,4 1,5 1,6 1,7 1,8 1,9 1,10 1,11 1,12 1,13 1,14 1,16 1,17 1,21 1,22 1,26 1,27 1,28 1,32 1,33 1,35 1,38 1,42 1,43 1,49 1,52 7.921}
{0 CHEMBL183224,1 1,2 1,3 1,4 1,5 1,6 1,7 1,8 1,9 1,10 1,11 1,12 1,13 1,14 1,16 1,17 1,21 1,22 1,23 1,24 1,26 1,27 1,28 1,29 1,32 1,33 1,35 1,38 1,42 1,45 1,52 8.585}
{0 CHEMBL183246,1 1,2 1,3 1,4 1,5 1,6 1,7 1,8 1,9 1,10 1,11 1,12 1,13 1,14 1,16 1,17 1,18 1,21 1,22 1,26 1,27 1,28 1,32 1,33 1,35 1,38 1,42 1,52 7.328}
{0 CHEMBL183276,1 1,2 1,3 1,4 1,5 1,6 1,7 1,8 1,9 1,10 1,11 1,12 1,13 1,14 1,16 1,17 1,18 1,21 1,22 1,26 1,27 1,28 1,32 1,33 1,35 1,38 1,42 1,52 8.824}
{0 CHEMBL183290,1 1,2 1,3 1,4 1,5 1,6 1,7 1,8 1,9 1,10 1,11 1,12 1,13 1,14 1,16 1,17 1,21 1,22 1,26 1,27 1,28 1,32 1,33 1,35 1,38 1,42 1,43 1,49 1,52 8.092}
{0 CHEMBL183291,1 1,2 1,3 1,4 1,5 1,6 1,7 1,8 1,9 1,10 1,11 1,12 1,13 1,14 1,16 1,17 1,21 1,22 1,26 1,27 1,28 1,32 1,33 1,35 1,38 1,42 1,43 1,49 1,52 7.886}
{0 CHEMBL183313,1 1,2 1,3 1,4 1,5 1,6 1,7 1,8 1,9 1,10 1,11 1,12 1,13 1,14 1,16 1,17 1,18 1,21 1,22 1,23 1,44 1,52 8.081}
{0 CHEMBL183356,1 1,2 1,3 1,4 1,5 1,6 1,7 1,8 1,9 1,10 1,11 1,12 1,13 1,14 1,16 1,17 1,21 1,22 1,23 1,26 1,27 1,28 1,32 1,33 1,35 1,38 1,40 1,42 1,45 1,52 8.745}
{0 CHEMBL183372,1 1,2 1,3 1,4 1,5 1,6 1,7 1,8 1,9 1,10 1,11 1,12 1,13 1,14 1,16 1,17 1,21 1,22 1,23 1,26 1,27 1,28 1,32 1,33 1,35 1,38 1,40 1,42 1,45 1,52 8.125}
{0 CHEMBL183480,1 1,2 1,3 1,4 1,5 1,6 1,7 1,8 1,9 1,10 1,11 1,12 1,13 1,14 1,16 1,17 1,21 1,22 1,26 1,27 1,28 1,32 1,33 1,35 1,38 1,42 1,43 1,49 1,52 7.886}
{0 CHEMBL183523,1 1,2 1,3 1,4 1,5 1,6 1,7 1,8 1,9 1,10 1,11 1,12 1,13 1,14 1,16 1,17 1,21 1,22 1,23 1,26 1,27 1,28 1,32 1,33 1,35 1,38 1,42 1,45 1,52 8.444}
{0 CHEMBL183548,1 1,2 1,3 1,4 1,5 1,6 1,7 1,8 1,9 1,10 1,11 1,12 1,13 1,14 1,16 1,17 1,18 1,21 1,22 1,26 1,27 1,28 1,32 1,33 1,35 1,38 1,42 1,52 7.854}
{0 CHEMBL183666,1 1,2 1,3 1,4 1,5 1,6 1,7 1,8 1,9 1,10 1,11 1,12 1,13 1,14 1,16 1,17 1,21 1,22 1,26 1,27 1,28 1,30 1,32 1,33 1,35 1,38 1,42 1,43 1,47 1,49 1,52 8.125}
{0 CHEMBL183719,1 1,2 1,3 1,4 1,5 1,6 1,7 1,8 1,9 1,10 1,11 1,12 1,13 1,14 1,16 1,17 1,21 1,22 1,23 1,26 1,27 1,28 1,32 1,33 1,35 1,38 1,40 1,42 1,45 1,52 8.886}
{0 CHEMBL183725,1 1,2 1,3 1,4 1,5 1,6 1,7 1,8 1,9 1,10 1,11 1,12 1,13 1,14 1,16 1,17 1,18 1,21 1,22 1,26 1,27 1,28 1,32 1,33 1,35 1,38 1,40 1,42 1,52 8.26}
{0 CHEMBL183759,1 1,2 1,3 1,4 1,5 1,6 1,7 1,8 1,9 1,10 1,11 1,12 1,13 1,14 1,16 1,17 1,21 1,22 1,26 1,27 1,28 1,32 1,33 1,35 1,38 1,42 1,43 1,49 1,51 1,52 7.229}
{0 CHEMBL183794,1 1,2 1,3 1,4 1,5 1,6 1,7 1,8 1,9 1,10 1,11 1,12 1,13 1,14 1,16 1,17 1,21 1,22 1,26 1,27 1,28 1,32 1,33 1,35 1,38 1,42 1,43 1,49 1,52 7.187}
{0 CHEMBL183832,1 1,2 1,3 1,4 1,5 1,6 1,7 1,8 1,9 1,10 1,11 1,12 1,13 1,14 1,16 1,17 1,21 1,22 1,23 1,26 1,27 1,28 1,32 1,33 1,34 1,35 1,38 1,40 1,42 1,45 1,52 8.886}
{0 CHEMBL183902,1 1,2 1,3 1,4 1,5 1,6 1,7 1,8 1,9 1,10 1,11 1,12 1,13 1,14 1,16 1,17 1,21 1,22 1,23 1,26 1,27 1,28 1,32 1,33 1,34 1,35 1,38 1,40 1,42 1,45 1,52 8.456}
{0 CHEMBL183953,1 1,2 1,3 1,4 1,5 1,6 1,7 1,8 1,9 1,10 1,11 1,12 1,13 1,14 1,16 1,17 1,18 1,21 1,22 1,23 1,24 1,26 1,44 1,46 1,52 9.237}
{0 CHEMBL184044,1 1,2 1,3 1,4 1,5 1,6 1,7 1,8 1,9 1,10 1,11 1,12 1,13 1,14 1,16 1,17 1,18 1,21 1,38 1,40 1,41 1,48 1,51 1,52 9.187}
{0 CHEMBL184113,1 1,4 1,5 1,6 1,7 1,8 1,9 1,10 1,11 1,12 1,13 1,17 1,18 1,21 1,24 1,52 6.796}
{0 CHEMBL184330,1 1,2 1,3 1,4 1,5 1,6 1,7 1,8 1,9 1,10 1,11 1,12 1,13 1,14 1,16 1,17 1,18 1,21 1,22 1,23 1,24 1,44 1,52 9.357}
{0 CHEMBL184425,1 1,2 1,3 1,4 1,5 1,6 1,7 1,8 1,9 1,10 1,11 1,12 1,13 1,14 1,16 1,17 1,18 1,21 1,22 1,23 1,26 1,44 1,46 1,52 8.523}
{0 CHEMBL184488,1 1,4 1,5 1,6 1,7 1,8 1,9 1,10 1,11 1,12 1,13 1,17 1,18 1,21 1,40 1,52 8.102}
{0 CHEMBL184537,1 1,2 1,3 1,4 1,5 1,6 1,7 1,8 1,9 1,10 1,11 1,12 1,13 1,14 1,16 1,17 1,18 1,21 1,22 1,23 1,44 1,48 1,51 1,52 9.036}
{0 CHEMBL184568,1 1,2 1,3 1,4 1,5 1,6 1,7 1,8 1,9 1,10 1,11 1,12 1,13 1,14 1,16 1,17 1,18 1,21 1,22 1,23 1,24 1,44 1,52 8.921}
{0 CHEMBL184916,1 1,2 1,3 1,4 1,5 1,6 1,7 1,8 1,9 1,10 1,11 1,12 1,13 1,14 1,16 1,17 1,21 1,22 1,38 1,41 1,48 1,51 1,52 9.046}
{0 CHEMBL185053,1 1,2 1,3 1,4 1,5 1,6 1,7 1,8 1,9 1,10 1,11 1,12 1,13 1,14 1,16 1,17 1,18 1,21 1,22 1,23 1,44 1,52 8.119}
{0 CHEMBL185058,1 1,2 1,3 1,4 1,5 1,6 1,7 1,8 1,9 1,10 1,11 1,12 1,13 1,14 1,16 1,17 1,18 1,21 1,22 1,23 1,26 1,44 1,46 1,52 8.523}
{0 CHEMBL185416,1 1,2 1,3 1,4 1,5 1,6 1,7 1,8 1,9 1,10 1,11 1,12 1,13 1,14 1,16 1,17 1,18 1,21 1,22 1,23 1,44 1,52 8.357}
{0 CHEMBL186617,1 1,2 1,3 1,4 1,5 1,6 1,7 1,8 1,9 1,10 1,11 1,12 1,13 1,14 1,16 1,17 1,18 1,21 1,22 1,38 1,41 1,48 1,51 1,52 9.495}
{0 CHEMBL186641,1 1,2 1,3 1,4 1,5 1,6 1,7 1,8 1,9 1,10 1,11 1,12 1,13 1,14 1,16 1,17 1,18 1,21 1,22 1,23 1,38 1,41 1,48 1,51 1,52 8.319}
{0 CHEMBL186714,1 1,4 1,5 1,6 1,7 1,8 1,9 1,10 1,11 1,12 1,13 1,17 1,18 1,21 1,27 1,28 1,29 1,40 1,41 1,52 6.164}
{0 CHEMBL186715,1 1,2 1,3 1,4 1,5 1,6 1,7 1,8 1,9 1,10 1,11 1,12 1,13 1,14 1,16 1,17 1,18 1,21 1,22 1,23 1,26 1,44 1,46 1,52 8.824}
{0 CHEMBL186906,1 1,2 1,3 1,4 1,5 1,6 1,7 1,8 1,9 1,10 1,11 1,12 1,13 1,14 1,16 1,17 1,18 1,21 1,22 1,23 1,44 1,52 9.432}
{0 CHEMBL186927,1 1,2 1,3 1,4 1,5 1,6 1,7 1,8 1,9 1,10 1,11 1,12 1,13 1,14 1,17 1,18 1,21 1,22 1,23 1,44 1,52 9.208}
{0 CHEMBL187037,1 1,2 1,3 1,4 1,5 1,6 1,7 1,8 1,9 1,10 1,11 1,12 1,13 1,14 1,16 1,17 1,18 1,21 1,22 1,23 1,44 1,52 8.328}
{0 CHEMBL187128,1 1,2 1,3 1,4 1,5 1,6 1,7 1,8 1,9 1,10 1,11 1,12 1,13 1,14 1,17 1,18 1,21 1,22 1,38 1,41 1,48 1,51 1,52 9.42}
{0 CHEMBL187146,4 1,5 1,6 1,8 1,9 1,10 1,11 1,12 1,13 1,14 1,17 1,21 1,27 1,28 1,40 1,52 7.921}
{0 CHEMBL187244,1 1,2 1,3 1,4 1,5 1,6 1,7 1,8 1,9 1,10 1,11 1,12 1,13 1,14 1,16 1,17 1,18 1,21 1,22 1,23 1,24 1,44 1,52 7.018}
{0 CHEMBL187254,1 1,2 1,3 1,4 1,5 1,6 1,7 1,8 1,9 1,10 1,11 1,12 1,13 1,14 1,16 1,17 1,18 1,21 1,22 1,23 1,44 1,52 8}
{0 CHEMBL187374,1 1,4 1,5 1,6 1,7 1,8 1,9 1,10 1,11 1,12 1,13 1,17 1,18 1,21 1,29 1,40 1,52 7.77}
{0 CHEMBL187807,1 1,2 1,3 1,4 1,5 1,6 1,7 1,8 1,9 1,10 1,11 1,12 1,13 1,14 1,16 1,17 1,18 1,21 1,22 1,23 1,44 1,52 9.432}
{0 CHEMBL188127,1 1,2 1,3 1,4 1,5 1,6 1,7 1,8 1,9 1,10 1,11 1,12 1,13 1,14 1,17 1,18 1,21 1,22 1,23 1,26 1,46 1,52 8.367}
{0 CHEMBL193340,1 1,2 1,3 1,4 1,5 1,6 1,7 1,8 1,9 1,10 1,11 1,12 1,13 1,17 1,21 1,41 1,48 1,51 1,52 8.215}
{0 CHEMBL193881,1 1,4 1,5 1,6 1,7 1,8 1,9 1,10 1,11 1,12 1,13 1,17 1,18 1,21 1,22 1,23 1,29 1,52 6}
{0 CHEMBL194041,1 1,4 1,5 1,6 1,7 1,8 1,9 1,10 1,11 1,12 1,13 1,17 1,18 1,21 1,29 1,40 1,52 8.42}
{0 CHEMBL194072,1 1,4 1,5 1,6 1,7 1,8 1,9 1,10 1,11 1,12 1,13 1,17 1,18 1,21 1,29 1,52 8}
{0 CHEMBL194073,1 1,2 1,3 1,4 1,5 1,6 1,7 1,8 1,9 1,10 1,11 1,12 1,13 1,17 1,18 1,21 1,41 1,48 1,51 1,52 9.032}
{0 CHEMBL194143,1 1,4 1,5 1,6 1,7 1,8 1,9 1,10 1,11 1,12 1,13 1,17 1,18 1,21 1,29 1,52 8.236}
{0 CHEMBL194172,1 1,4 1,5 1,6 1,7 1,8 1,9 1,10 1,11 1,12 1,13 1,17 1,18 1,21 1,29 1,52 7.538}
{0 CHEMBL194382,1 1,4 1,5 1,6 1,7 1,8 1,9 1,10 1,11 1,12 1,13 1,17 1,18 1,21 1,22 1,29 1,52 6}
{0 CHEMBL195553,1 1,4 1,5 1,6 1,7 1,8 1,9 1,10 1,11 1,12 1,13 1,17 1,18 1,21 1,22 1,23 1,29 1,52 7.051}
{0 CHEMBL195730,5 1,6 1,9 1,10 1,11 1,12 1,13 1,17 1,21 1,22 1,29 1,31 1,52 6}
{0 CHEMBL195843,5 1,6 1,9 1,10 1,11 1,12 1,13 1,17 1,21 1,29 1,52 6}
{0 CHEMBL2052018,1 1,19 1,20 1,24 1,25 1,30 1,31 1,34 1,37 1,40 1,41 1,52 7.722}
{0 CHEMBL2092731,1 1,4 1,19 1,20 1,34 1,37 1,40 1,41 1,52 5.481}
{0 CHEMBL2092855,1 1,4 1,19 1,20 1,34 1,37 1,40 1,41 1,52 7.244}
{0 CHEMBL22675,2 1,3 1,4 1,5 1,6 1,9 1,10 1,11 1,12 1,13 1,17 1,21 1,29 1,52 6.407}
{0 CHEMBL23135,2 1,3 1,4 1,5 1,6 1,9 1,10 1,11 1,12 1,13 1,17 1,21 1,29 1,52 5.796}
{0 CHEMBL23155,1 1,4 1,5 1,6 1,7 1,8 1,9 1,10 1,11 1,12 1,13 1,17 1,21 1,29 1,48 1,51 1,52 9.662}
{0 CHEMBL23163,2 1,3 1,4 1,5 1,6 1,9 1,10 1,11 1,12 1,13 1,17 1,21 1,29 1,52 6.799}
{0 CHEMBL23217,2 1,3 1,4 1,5 1,6 1,9 1,10 1,11 1,12 1,13 1,17 1,21 1,29 1,52 6.24}
{0 CHEMBL23218,2 1,3 1,4 1,5 1,6 1,9 1,10 1,11 1,12 1,13 1,17 1,21 1,29 1,52 6.714}
{0 CHEMBL23219,2 1,3 1,4 1,5 1,6 1,9 1,10 1,11 1,12 1,13 1,17 1,21 1,29 1,52 7.284}
{0 CHEMBL23239,2 1,3 1,4 1,5 1,6 1,9 1,10 1,11 1,12 1,13 1,17 1,21 1,29 1,52 6.602}
{0 CHEMBL23248,2 1,3 1,4 1,5 1,6 1,9 1,10 1,11 1,12 1,13 1,17 1,21 1,29 1,48 1,51 1,52 8.819}
{0 CHEMBL23405,1 1,4 1,5 1,6 1,7 1,8 1,9 1,10 1,11 1,12 1,13 1,17 1,18 1,21 1,22 1,35 1,52 8.699}
{0 CHEMBL23411,4 1,5 1,6 1,9 1,10 1,11 1,12 1,13 1,17 1,21 1,29 1,48 1,51 1,52 8.81}
{0 CHEMBL23460,2 1,3 1,4 1,5 1,6 1,9 1,10 1,11 1,12 1,13 1,17 1,21 1,29 1,52 8.921}
{0 CHEMBL23490,2 1,3 1,4 1,5 1,6 1,9 1,10 1,11 1,12 1,13 1,17 1,21 1,29 1,52 6.222}
{0 CHEMBL23650,4 1,5 1,6 1,9 1,10 1,11 1,12 1,13 1,17 1,21 1,29 1,48 1,51 1,52 8.509}
{0 CHEMBL23939,2 1,3 1,4 1,5 1,6 1,9 1,10 1,11 1,12 1,13 1,17 1,21 1,29 1,52 7.538}
{0 CHEMBL24377,1 1,24 1,34 1,37 1,40 1,41 1,47 1,52 4.432}
{0 CHEMBL25734,19 1,20 1,34 1,40 1,52 6.602}
{0 CHEMBL25978,19 1,20 1,34 1,40 1,52 5.42}
{0 CHEMBL26031,15 1,19 1,20 1,34 1,40 1,41 1,52 4}
{0 CHEMBL26134,15 1,19 1,20 1,34 1,40 1,41 1,52 4}
{0 CHEMBL26149,19 1,20 1,34 1,40 1,52 6.187}
{0 CHEMBL26177,1 1,24 1,34 1,37 1,40 1,41 1,47 1,52 5}
{0 CHEMBL26180,24 1,34 1,40 1,52 6.387}
{0 CHEMBL26235,5 1,24 1,29 1,30 1,34 1,36 1,37 1,40 1,41 1,47 1,52 4}
{0 CHEMBL26236,1 1,5 1,24 1,34 1,37 1,40 1,41 1,47 1,52 7.089}
{0 CHEMBL26255,19 1,20 1,34 1,40 1,52 6.337}
{0 CHEMBL262819,1 1,2 1,3 1,4 1,5 1,6 1,7 1,8 1,9 1,10 1,11 1,12 1,13 1,14 1,16 1,17 1,21 1,22 1,26 1,27 1,28 1,32 1,33 1,35 1,38 1,42 1,43 1,49 1,52 7.959}
{0 CHEMBL26314,19 1,20 1,34 1,40 1,52 6.475}
{0 CHEMBL26371,19 1,20 1,34 1,40 1,52 5.502}
{0 CHEMBL265002,1 1,4 1,5 1,6 1,7 1,8 1,9 1,10 1,11 1,12 1,13 1,17 1,18 1,21 1,22 1,52 7.699}
{0 CHEMBL26682,19 1,20 1,34 1,40 1,49 1,52 6.481}
{0 CHEMBL26785,15 1,19 1,20 1,34 1,40 1,41 1,52 4}
{0 CHEMBL27078,15 1,19 1,20 1,34 1,40 1,41 1,52 4.347}
{0 CHEMBL27181,19 1,20 1,34 1,40 1,49 1,52 6.211}
{0 CHEMBL27319,19 1,20 1,34 1,40 1,52 5.638}
{0 CHEMBL27407,15 1,19 1,20 1,34 1,40 1,41 1,52 5.161}
{0 CHEMBL274122,1 1,2 1,3 1,5 1,6 1,10 1,14 1,16 1,22 1,34 1,40 1,43 1,49 1,52 9.398}
{0 CHEMBL27476,15 1,19 1,20 1,34 1,40 1,41 1,52 4.347}
{0 CHEMBL277413,2 1,3 1,4 1,5 1,6 1,9 1,10 1,11 1,12 1,13 1,17 1,21 1,29 1,52 7.921}
{0 CHEMBL27750,1 1,2 1,3 1,4 1,5 1,6 1,7 1,8 1,9 1,10 1,11 1,12 1,13 1,14 1,17 1,21 1,27 1,28 1,38 1,40 1,43 1,49 1,52 6}
{0 CHEMBL27843,1 1,2 1,3 1,4 1,5 1,6 1,7 1,8 1,9 1,10 1,11 1,12 1,13 1,14 1,17 1,18 1,21 1,22 1,27 1,28 1,38 1,41 1,48 1,51 1,52 9.409}
{0 CHEMBL279433,1 1,4 1,5 1,6 1,7 1,8 1,9 1,10 1,11 1,12 1,13 1,17 1,18 1,21 1,29 1,52 7.022}
{0 CHEMBL280181,4 1,5 1,6 1,9 1,10 1,11 1,12 1,13 1,17 1,21 1,29 1,48 1,51 1,52 8.097}
{0 CHEMBL280737,1 1,24 1,34 1,37 1,40 1,41 1,47 1,52 6.77}
{0 CHEMBL282011,2 1,3 1,4 1,5 1,6 1,9 1,10 1,11 1,12 1,13 1,16 1,17 1,21 1,29 1,52 5.456}
{0 CHEMBL282368,1 1,2 1,3 1,4 1,6 1,7 1,8 1,10 1,14 1,21 1,22 1,38 1,43 1,49 1,52 7.076}
{0 CHEMBL28252,1 1,2 1,3 1,4 1,5 1,6 1,7 1,8 1,9 1,10 1,11 1,12 1,13 1,14 1,17 1,21 1,22 1,27 1,28 1,38 1,41 1,48 1,51 1,52 7.42}
{0 CHEMBL282959,1 1,2 1,3 1,4 1,5 1,6 1,7 1,8 1,9 1,10 1,11 1,12 1,13 1,14 1,17 1,21 1,22 1,26 1,27 1,28 1,38 1,41 1,46 1,48 1,51 1,52 9.432}
{0 CHEMBL283369,4 1,5 1,6 1,9 1,10 1,11 1,12 1,13 1,17 1,21 1,29 1,48 1,51 1,52 8.215}
{0 CHEMBL283380,2 1,3 1,4 1,5 1,6 1,9 1,10 1,11 1,12 1,13 1,16 1,17 1,21 1,29 1,52 6.283}
{0 CHEMBL283441,15 1,19 1,20 1,34 1,40 1,41 1,52 4.796}
{0 CHEMBL283542,2 1,3 1,4 1,5 1,6 1,9 1,10 1,11 1,12 1,13 1,17 1,21 1,29 1,52 6.36}
{0 CHEMBL283793,4 1,5 1,6 1,9 1,10 1,11 1,12 1,13 1,17 1,21 1,24 1,29 1,48 1,51 1,52 7.987}
{0 CHEMBL284240,5 1,24 1,40 1,41 1,47 1,50 1,52 4.886}
{0 CHEMBL284448,1 1,2 1,3 1,4 1,5 1,6 1,7 1,8 1,9 1,10 1,11 1,12 1,13 1,14 1,17 1,18 1,21 1,22 1,27 1,28 1,38 1,43 1,49 1,52 8}
{0 CHEMBL284508,5 1,6 1,10 1,21 1,22 1,35 1,52 6.222}
{0 CHEMBL284835,1 1,4 1,5 1,6 1,7 1,8 1,9 1,10 1,11 1,12 1,13 1,17 1,18 1,21 1,22 1,52 8.699}
{0 CHEMBL28490,1 1,2 1,3 1,4 1,5 1,6 1,7 1,8 1,9 1,10 1,11 1,12 1,13 1,14 1,17 1,21 1,22 1,27 1,28 1,35 1,38 1,41 1,48 1,51 1,52 7.745}
{0 CHEMBL285362,1 1,5 1,24 1,34 1,37 1,40 1,41 1,47 1,52 6.009}
{0 CHEMBL285550,1 1,4 1,5 1,6 1,7 1,8 1,9 1,10 1,11 1,12 1,13 1,17 1,18 1,21 1,24 1,25 1,34 1,37 1,40 1,41 1,47 1,52 7.041}
{0 CHEMBL285827,19 1,20 1,34 1,40 1,52 6.395}
{0 CHEMBL28588,1 1,2 1,3 1,4 1,5 1,6 1,7 1,8 1,9 1,10 1,11 1,12 1,13 1,14 1,17 1,21 1,22 1,27 1,28 1,38 1,41 1,48 1,51 1,52 7.854}
{0 CHEMBL286196,6 1,10 1,21 1,22 1,35 1,40 1,52 6.222}
{0 CHEMBL28659,1 1,2 1,3 1,4 1,5 1,6 1,7 1,8 1,9 1,10 1,11 1,12 1,13 1,14 1,17 1,21 1,22 1,27 1,28 1,38 1,43 1,49 1,52 7.959}
{0 CHEMBL286760,10 1,24 1,40 1,52 4.097}
{0 CHEMBL286779,1 1,4 1,5 1,6 1,7 1,8 1,9 1,10 1,11 1,12 1,13 1,17 1,18 1,21 1,22 1,52 8.699}
{0 CHEMBL286876,6 1,10 1,21 1,22 1,34 1,35 1,40 1,52 6}
{0 CHEMBL286899,6 1,10 1,21 1,22 1,35 1,40 1,47 1,50 1,52 7}
{0 CHEMBL28707,1 1,2 1,3 1,4 1,5 1,6 1,7 1,8 1,9 1,10 1,11 1,12 1,13 1,14 1,17 1,18 1,21 1,22 1,27 1,28 1,38 1,43 1,49 1,52 9.013}
{0 CHEMBL28770,1 1,2 1,3 1,4 1,5 1,6 1,7 1,8 1,9 1,10 1,11 1,12 1,13 1,14 1,17 1,18 1,21 1,22 1,27 1,28 1,38 1,41 1,48 1,51 1,52 8.824}
{0 CHEMBL287729,1 1,2 1,3 1,4 1,5 1,6 1,7 1,8 1,9 1,10 1,11 1,12 1,13 1,14 1,16 1,17 1,18 1,21 1,22 1,26 1,27 1,28 1,32 1,33 1,35 1,41 1,44 1,46 1,48 1,51 1,52 8.77}
{0 CHEMBL288005,15 1,19 1,20 1,24 1,25 1,29 1,30 1,31 1,34 1,37 1,39 1,40 1,41 1,49 1,52 6.036}
{0 CHEMBL288046,1 1,2 1,3 1,4 1,5 1,6 1,7 1,8 1,9 1,10 1,11 1,12 1,13 1,16 1,17 1,18 1,21 1,22 1,23 1,26 1,27 1,28 1,32 1,33 1,35 1,42 1,52 9.046}
{0 CHEMBL288449,1 1,2 1,3 1,4 1,5 1,6 1,7 1,8 1,9 1,10 1,11 1,12 1,13 1,14 1,16 1,17 1,18 1,21 1,22 1,26 1,27 1,28 1,32 1,33 1,35 1,44 1,46 1,52 9.076}
{0 CHEMBL288523,1 1,2 1,3 1,4 1,5 1,6 1,7 1,8 1,9 1,10 1,11 1,12 1,13 1,17 1,18 1,21 1,22 1,23 1,26 1,27 1,28 1,32 1,33 1,35 1,42 1,52 7.921}
{0 CHEMBL288838,1 1,2 1,3 1,4 1,5 1,6 1,7 1,8 1,9 1,10 1,11 1,12 1,13 1,17 1,18 1,21 1,22 1,26 1,27 1,28 1,32 1,33 1,35 1,42 1,44 1,46 1,52 8.745}
{0 CHEMBL288901,1 1,2 1,3 1,4 1,5 1,6 1,7 1,8 1,9 1,10 1,11 1,12 1,13 1,16 1,17 1,18 1,21 1,22 1,23 1,26 1,27 1,28 1,32 1,33 1,35 1,40 1,41 1,42 1,52 9.137}
{0 CHEMBL289228,5 1,6 1,9 1,10 1,11 1,12 1,13 1,17 1,21 1,27 1,28 1,29 1,40 1,52 9.216}
{0 CHEMBL289302,1 1,15 1,19 1,20 1,24 1,25 1,31 1,34 1,37 1,39 1,40 1,41 1,47 1,52 7.244}
{0 CHEMBL289341,15 1,19 1,20 1,24 1,25 1,29 1,30 1,31 1,34 1,37 1,39 1,40 1,41 1,47 1,52 5.237}
{0 CHEMBL28937,1 1,2 1,3 1,4 1,5 1,6 1,7 1,8 1,9 1,10 1,11 1,12 1,13 1,14 1,16 1,17 1,21 1,22 1,26 1,27 1,28 1,32 1,33 1,35 1,38 1,42 1,43 1,49 1,52 7.132}
{0 CHEMBL28970,1 1,2 1,3 1,4 1,5 1,6 1,7 1,8 1,9 1,10 1,11 1,12 1,13 1,14 1,17 1,21 1,22 1,27 1,28 1,38 1,41 1,48 1,51 1,52 8.721}
{0 CHEMBL289844,1 1,2 1,4 1,5 1,6 1,7 1,8 1,9 1,10 1,11 1,12 1,13 1,14 1,16 1,17 1,18 1,21 1,22 1,26 1,27 1,28 1,32 1,33 1,35 1,44 1,46 1,52 9.194}
{0 CHEMBL290161,1 1,4 1,5 1,6 1,7 1,8 1,9 1,10 1,11 1,12 1,13 1,17 1,18 1,21 1,22 1,26 1,27 1,28 1,32 1,33 1,35 1,42 1,46 1,52 8.721}
{0 CHEMBL290315,1 1,2 1,3 1,4 1,5 1,6 1,7 1,8 1,9 1,10 1,11 1,12 1,13 1,16 1,17 1,18 1,21 1,22 1,23 1,26 1,27 1,28 1,32 1,33 1,35 1,42 1,52 7.167}
{0 CHEMBL29064,1 1,2 1,3 1,4 1,5 1,6 1,7 1,8 1,9 1,10 1,11 1,12 1,13 1,14 1,17 1,21 1,27 1,28 1,38 1,40 1,41 1,48 1,51 1,52 7.509}
{0 CHEMBL290760,1 1,2 1,3 1,4 1,5 1,6 1,7 1,8 1,9 1,10 1,11 1,12 1,13 1,16 1,17 1,18 1,21 1,22 1,23 1,26 1,27 1,28 1,32 1,33 1,35 1,42 1,52 9.244}
{0 CHEMBL29645,1 1,2 1,3 1,4 1,5 1,6 1,7 1,8 1,9 1,10 1,11 1,12 1,13 1,14 1,17 1,21 1,22 1,27 1,28 1,38 1,41 1,48 1,51 1,52 7.959}
{0 CHEMBL298734,5 1,6 1,7 1,10 1,21 1,29 1,40 1,52 8.095}
{0 CHEMBL29982,1 1,2 1,3 1,4 1,10 1,14 1,16 1,24 1,34 1,40 1,43 1,49 1,52 8.959}
{0 CHEMBL303414,1 1,4 1,19 1,20 1,34 1,37 1,40 1,41 1,52 6.959}
{0 CHEMBL303509,1 1,4 1,10 1,19 1,20 1,34 1,37 1,40 1,41 1,52 7.699}
{0 CHEMBL305536,1 1,19 1,20 1,24 1,29 1,34 1,37 1,40 1,41 1,52 7.745}
{0 CHEMBL305584,1 1,4 1,19 1,20 1,24 1,34 1,37 1,40 1,41 1,52 6.678}
{0 CHEMBL306018,1 1,4 1,19 1,20 1,34 1,37 1,40 1,41 1,52 7.699}
{0 CHEMBL307974,1 1,4 1,19 1,20 1,24 1,34 1,37 1,40 1,41 1,47 1,52 7.06}
{0 CHEMBL309317,5 1,6 1,10 1,22 1,29 1,30 1,50 1,52 5.959}
{0 CHEMBL310450,5 1,6 1,10 1,22 1,29 1,30 1,50 1,52 7.43}
{0 CHEMBL310541,5 1,6 1,10 1,22 1,29 1,30 1,50 1,52 5.432}
{0 CHEMBL310850,5 1,6 1,10 1,22 1,29 1,30 1,50 1,52 5.432}
{0 CHEMBL312056,5 1,6 1,10 1,22 1,29 1,30 1,49 1,50 1,52 6.387}
{0 CHEMBL312473,4 1,5 1,6 1,10 1,30 1,50 1,52 8.162}
{0 CHEMBL318783,24 1,29 1,40 1,49 1,50 1,52 5.658}
{0 CHEMBL318853,14 1,50 1,52 5.921}
{0 CHEMBL321195,6 1,10 1,21 1,22 1,30 1,47 1,52 6}
{0 CHEMBL321241,6 1,10 1,21 1,22 1,52 8.585}
{0 CHEMBL32217,1 1,4 1,5 1,6 1,7 1,8 1,9 1,10 1,11 1,12 1,13 1,17 1,18 1,21 1,22 1,52 8.699}
{0 CHEMBL325995,1 1,4 1,5 1,6 1,7 1,8 1,10 1,11 1,13 1,18 1,21 1,22 1,49 1,52 7.092}
{0 CHEMBL32600,1 1,4 1,5 1,6 1,9 1,10 1,11 1,12 1,13 1,17 1,21 1,24 1,27 1,28 1,34 1,37 1,40 1,41 1,47 1,52 6.328}
{0 CHEMBL326434,1 1,4 1,5 1,6 1,7 1,8 1,9 1,10 1,11 1,12 1,13 1,17 1,18 1,21 1,22 1,24 1,52 6.854}
{0 CHEMBL32705,1 1,4 1,5 1,6 1,7 1,8 1,9 1,10 1,11 1,12 1,13 1,17 1,18 1,21 1,24 1,25 1,34 1,40 1,41 1,52 8.222}
{0 CHEMBL32725,6 1,10 1,21 1,22 1,24 1,35 1,40 1,52 8.222}
{0 CHEMBL327674,1 1,19 1,20 1,24 1,25 1,31 1,34 1,37 1,39 1,40 1,41 1,47 1,52 7.638}
{0 CHEMBL32817,6 1,10 1,21 1,22 1,35 1,40 1,52 6.222}
{0 CHEMBL32863,1 1,4 1,5 1,6 1,7 1,8 1,9 1,10 1,11 1,12 1,13 1,17 1,18 1,21 1,22 1,24 1,29 1,52 6.699}
{0 CHEMBL32927,4 1,5 1,6 1,9 1,10 1,11 1,12 1,13 1,17 1,21 1,24 1,27 1,28 1,40 1,41 1,52 6.174}
{0 CHEMBL32973,5 1,6 1,9 1,10 1,11 1,12 1,13 1,17 1,21 1,22 1,24 1,27 1,28 1,29 1,52 6.155}
{0 CHEMBL330822,1 1,2 1,3 1,5 1,6 1,10 1,14 1,16 1,22 1,34 1,40 1,43 1,49 1,52 8.854}
{0 CHEMBL331521,1 1,2 1,3 1,5 1,6 1,10 1,14 1,16 1,22 1,34 1,40 1,43 1,47 1,49 1,52 9.301}
{0 CHEMBL331766,1 1,2 1,3 1,5 1,6 1,10 1,14 1,16 1,22 1,34 1,40 1,43 1,49 1,52 7.276}
{0 CHEMBL332149,1 1,2 1,3 1,14 1,16 1,22 1,34 1,40 1,43 1,49 1,52 8.854}
{0 CHEMBL332495,1 1,4 1,5 1,6 1,7 1,8 1,9 1,10 1,11 1,12 1,13 1,17 1,18 1,21 1,40 1,52 9.097}
{0 CHEMBL333525,1 1,2 1,3 1,5 1,6 1,10 1,14 1,16 1,22 1,24 1,34 1,40 1,43 1,49 1,52 7.538}
{0 CHEMBL333575,1 1,2 1,3 1,5 1,6 1,10 1,14 1,16 1,22 1,34 1,40 1,43 1,49 1,52 10}
{0 CHEMBL335064,1 1,2 1,3 1,5 1,6 1,10 1,14 1,16 1,22 1,34 1,40 1,52 8.481}
{0 CHEMBL335130,1 1,2 1,3 1,5 1,6 1,10 1,14 1,16 1,24 1,34 1,40 1,52 7.77}
{0 CHEMBL335885,1 1,2 1,3 1,5 1,6 1,10 1,14 1,16 1,34 1,40 1,47 1,52 6.26}
{0 CHEMBL336327,1 1,2 1,3 1,5 1,6 1,10 1,14 1,16 1,22 1,34 1,40 1,52 8.367}
{0 CHEMBL336615,1 1,2 1,3 1,5 1,6 1,10 1,14 1,16 1,22 1,34 1,40 1,43 1,49 1,52 9.161}
{0 CHEMBL33704,6 1,10 1,21 1,22 1,35 1,40 1,52 7.222}
{0 CHEMBL337477,19 1,24 1,25 1,31 1,34 1,37 1,40 1,41 1,47 1,50 1,52 5}
{0 CHEMBL337847,1 1,2 1,3 1,5 1,6 1,10 1,14 1,16 1,22 1,34 1,40 1,41 1,52 7.319}
{0 CHEMBL338527,19 1,20 1,24 1,25 1,31 1,34 1,40 1,41 1,52 6.347}
{0 CHEMBL339731,19 1,20 1,22 1,24 1,29 1,34 1,40 1,52 6.025}
{0 CHEMBL339824,19 1,20 1,22 1,24 1,29 1,34 1,40 1,52 5.886}
{0 CHEMBL340735,19 1,20 1,24 1,31 1,34 1,40 1,41 1,49 1,52 7.222}
{0 CHEMBL340960,10 1,19 1,20 1,24 1,25 1,34 1,40 1,41 1,52 6.046}
{0 CHEMBL34143,1 1,4 1,5 1,6 1,7 1,8 1,9 1,10 1,11 1,12 1,13 1,17 1,18 1,21 1,22 1,52 8.699}
{0 CHEMBL343987,1 1,2 1,3 1,5 1,6 1,10 1,14 1,34 1,40 1,52 7.699}
{0 CHEMBL346966,1 1,19 1,20 1,24 1,25 1,30 1,31 1,34 1,37 1,40 1,41 1,52 7.377}
{0 CHEMBL34828,1 1,4 1,5 1,6 1,7 1,8 1,9 1,10 1,11 1,12 1,13 1,17 1,18 1,21 1,22 1,52 8.699}
{0 CHEMBL348915,1 1,19 1,24 1,25 1,34 1,37 1,40 1,41 1,47 1,52 6.398}
{0 CHEMBL349928,1 1,19 1,20 1,24 1,25 1,31 1,34 1,37 1,39 1,40 1,41 1,52 8.155}
{0 CHEMBL350195,1 1,15 1,19 1,20 1,24 1,25 1,31 1,34 1,37 1,39 1,40 1,41 1,52 4.777}
{0 CHEMBL351739,1 1,15 1,19 1,20 1,24 1,25 1,31 1,34 1,37 1,40 1,41 1,47 1,52 7.569}
{0 CHEMBL35224,5 1,6 1,9 1,10 1,11 1,12 1,13 1,17 1,21 1,24 1,25 1,27 1,28 1,34 1,40 1,41 1,52 5}
{0 CHEMBL35383,1 1,4 1,5 1,6 1,7 1,8 1,9 1,10 1,11 1,12 1,13 1,17 1,18 1,21 1,22 1,52 8.699}
{0 CHEMBL35677,6 1,10 1,21 1,22 1,35 1,40 1,52 7.523}
{0 CHEMBL35706,1 1,4 1,5 1,6 1,7 1,8 1,9 1,10 1,11 1,12 1,13 1,17 1,18 1,21 1,22 1,52 8.699}
{0 CHEMBL35732,8 1,14 1,29 1,30 1,40 1,50 1,52 6}
{0 CHEMBL359517,1 1,2 1,3 1,4 1,5 1,6 1,7 1,8 1,9 1,10 1,11 1,12 1,13 1,14 1,16 1,17 1,21 1,22 1,26 1,27 1,28 1,32 1,33 1,35 1,38 1,42 1,43 1,49 1,52 7.229}
{0 CHEMBL359540,1 1,2 1,3 1,4 1,5 1,6 1,7 1,8 1,9 1,10 1,11 1,12 1,13 1,14 1,16 1,17 1,21 1,22 1,26 1,27 1,28 1,32 1,33 1,35 1,38 1,42 1,43 1,49 1,52 7.208}
{0 CHEMBL359950,1 1,2 1,3 1,4 1,5 1,6 1,7 1,8 1,9 1,10 1,11 1,12 1,13 1,14 1,16 1,17 1,21 1,22 1,23 1,26 1,27 1,28 1,32 1,33 1,35 1,38 1,40 1,42 1,45 1,47 1,50 1,52 8.041}
{0 CHEMBL359959,1 1,2 1,3 1,4 1,5 1,6 1,7 1,8 1,9 1,10 1,11 1,12 1,13 1,14 1,16 1,17 1,21 1,22 1,23 1,26 1,27 1,28 1,32 1,33 1,35 1,38 1,42 1,45 1,52 8.921}
{0 CHEMBL360084,1 1,2 1,3 1,4 1,5 1,6 1,7 1,8 1,9 1,10 1,11 1,12 1,13 1,14 1,16 1,17 1,21 1,22 1,26 1,27 1,28 1,32 1,33 1,35 1,38 1,42 1,43 1,49 1,52 7.319}
{0 CHEMBL360229,1 1,2 1,3 1,4 1,5 1,6 1,7 1,8 1,9 1,10 1,11 1,12 1,13 1,14 1,16 1,17 1,21 1,22 1,26 1,27 1,28 1,32 1,33 1,35 1,38 1,42 1,43 1,49 1,52 7.268}
{0 CHEMBL360525,1 1,2 1,3 1,4 1,5 1,6 1,7 1,8 1,9 1,10 1,11 1,12 1,13 1,14 1,16 1,17 1,18 1,21 1,22 1,26 1,27 1,28 1,32 1,33 1,35 1,38 1,42 1,45 1,52 9.097}
{0 CHEMBL360574,1 1,2 1,3 1,4 1,5 1,6 1,7 1,8 1,9 1,10 1,11 1,12 1,13 1,14 1,16 1,17 1,21 1,22 1,26 1,27 1,28 1,32 1,33 1,35 1,38 1,42 1,43 1,49 1,52 7.824}
{0 CHEMBL360694,1 1,2 1,3 1,4 1,5 1,6 1,7 1,8 1,9 1,10 1,11 1,12 1,13 1,14 1,16 1,17 1,21 1,22 1,23 1,26 1,27 1,28 1,32 1,33 1,35 1,38 1,40 1,42 1,45 1,52 8.114}
{0 CHEMBL361353,1 1,2 1,3 1,4 1,5 1,6 1,7 1,8 1,9 1,10 1,11 1,12 1,13 1,14 1,16 1,17 1,21 1,22 1,23 1,24 1,26 1,27 1,28 1,32 1,33 1,34 1,35 1,37 1,38 1,40 1,41 1,42 1,45 1,52 8.77}
{0 CHEMBL361357,1 1,2 1,3 1,4 1,5 1,6 1,7 1,8 1,9 1,10 1,11 1,12 1,13 1,14 1,16 1,17 1,21 1,22 1,26 1,27 1,28 1,32 1,33 1,35 1,38 1,42 1,45 1,52 8.387}
{0 CHEMBL361616,1 1,2 1,3 1,4 1,5 1,6 1,7 1,8 1,9 1,10 1,11 1,12 1,13 1,14 1,16 1,17 1,21 1,22 1,26 1,27 1,28 1,32 1,33 1,35 1,38 1,42 1,43 1,49 1,52 7.886}
{0 CHEMBL361734,1 1,2 1,3 1,4 1,5 1,6 1,7 1,8 1,9 1,10 1,11 1,12 1,13 1,14 1,16 1,17 1,21 1,22 1,26 1,27 1,28 1,32 1,33 1,35 1,38 1,42 1,43 1,49 1,52 7.42}
{0 CHEMBL36192,1 1,4 1,5 1,6 1,7 1,8 1,9 1,10 1,11 1,12 1,13 1,17 1,18 1,21 1,40 1,52 7.155}
{0 CHEMBL362044,1 1,2 1,3 1,4 1,5 1,6 1,7 1,8 1,9 1,10 1,11 1,12 1,13 1,14 1,16 1,17 1,21 1,22 1,26 1,27 1,28 1,32 1,33 1,35 1,38 1,42 1,43 1,49 1,52 7.495}
{0 CHEMBL362174,1 1,2 1,3 1,4 1,5 1,6 1,7 1,8 1,9 1,10 1,11 1,12 1,13 1,14 1,16 1,17 1,21 1,22 1,26 1,27 1,28 1,32 1,33 1,35 1,38 1,42 1,43 1,49 1,52 7.721}
{0 CHEMBL362338,1 1,2 1,3 1,4 1,5 1,6 1,7 1,8 1,9 1,10 1,11 1,12 1,13 1,14 1,16 1,17 1,18 1,21 1,22 1,23 1,44 1,52 8.77}
{0 CHEMBL362381,1 1,2 1,3 1,4 1,5 1,6 1,7 1,8 1,9 1,10 1,11 1,12 1,13 1,14 1,16 1,17 1,21 1,22 1,26 1,27 1,28 1,32 1,33 1,35 1,38 1,42 1,43 1,49 1,52 7.886}
{0 CHEMBL362519,1 1,2 1,3 1,4 1,5 1,6 1,7 1,8 1,9 1,10 1,11 1,12 1,13 1,14 1,16 1,17 1,18 1,21 1,22 1,23 1,41 1,44 1,48 1,51 1,52 8.886}
{0 CHEMBL362750,1 1,2 1,3 1,4 1,5 1,6 1,7 1,8 1,9 1,10 1,11 1,12 1,13 1,14 1,16 1,17 1,18 1,21 1,22 1,23 1,24 1,44 1,52 8.854}
{0 CHEMBL362881,1 1,2 1,3 1,4 1,5 1,6 1,7 1,8 1,9 1,10 1,11 1,12 1,13 1,14 1,16 1,17 1,18 1,21 1,22 1,23 1,44 1,52 9.187}
{0 CHEMBL363041,1 1,2 1,3 1,4 1,5 1,6 1,7 1,8 1,9 1,10 1,11 1,12 1,13 1,14 1,16 1,17 1,18 1,21 1,22 1,23 1,44 1,52 9.092}
{0 CHEMBL363524,1 1,2 1,3 1,4 1,5 1,6 1,7 1,8 1,9 1,10 1,11 1,12 1,13 1,14 1,16 1,17 1,18 1,21 1,22 1,23 1,41 1,44 1,48 1,51 1,52 8.167}
{0 CHEMBL36361,6 1,10 1,21 1,22 1,34 1,35 1,40 1,52 7.699}
{0 CHEMBL363751,1 1,2 1,3 1,4 1,5 1,6 1,7 1,8 1,9 1,10 1,11 1,12 1,13 1,14 1,16 1,17 1,18 1,21 1,22 1,23 1,44 1,52 6.469}
{0 CHEMBL364067,1 1,4 1,5 1,6 1,7 1,8 1,9 1,10 1,11 1,12 1,13 1,17 1,18 1,21 1,22 1,26 1,27 1,28 1,29 1,32 1,33 1,35 1,42 1,52 7.097}
{0 CHEMBL365289,1 1,2 1,3 1,4 1,5 1,6 1,7 1,8 1,9 1,10 1,11 1,12 1,13 1,14 1,16 1,17 1,18 1,21 1,22 1,23 1,24 1,44 1,52 8.886}
{0 CHEMBL36529,1 1,4 1,5 1,6 1,7 1,8 1,9 1,10 1,11 1,12 1,13 1,17 1,18 1,21 1,22 1,52 7.155}
{0 CHEMBL365362,1 1,4 1,5 1,6 1,7 1,8 1,9 1,10 1,11 1,12 1,13 1,17 1,18 1,21 1,29 1,40 1,52 8.678}
{0 CHEMBL365427,1 1,2 1,3 1,4 1,5 1,6 1,7 1,8 1,9 1,10 1,11 1,12 1,13 1,14 1,16 1,17 1,18 1,21 1,22 1,23 1,44 1,52 8.658}
{0 CHEMBL366324,1 1,4 1,5 1,6 1,7 1,8 1,9 1,10 1,11 1,12 1,13 1,17 1,18 1,21 1,26 1,27 1,28 1,32 1,33 1,42 1,52 7.921}
{0 CHEMBL368218,1 1,2 1,4 1,5 1,6 1,7 1,8 1,9 1,10 1,11 1,12 1,13 1,16 1,17 1,18 1,21 1,22 1,26 1,27 1,28 1,32 1,33 1,35 1,38 1,42 1,51 1,52 6.796}
{0 CHEMBL368903,1 1,2 1,3 1,4 1,5 1,6 1,7 1,8 1,9 1,10 1,11 1,12 1,13 1,14 1,16 1,17 1,21 1,22 1,26 1,27 1,28 1,30 1,32 1,33 1,35 1,38 1,42 1,43 1,47 1,49 1,52 7.481}
{0 CHEMBL368904,1 1,2 1,3 1,4 1,5 1,6 1,7 1,8 1,9 1,10 1,11 1,12 1,13 1,14 1,16 1,17 1,21 1,22 1,23 1,26 1,27 1,28 1,32 1,33 1,35 1,38 1,40 1,42 1,45 1,52 8.699}
{0 CHEMBL369304,1 1,2 1,3 1,4 1,5 1,6 1,7 1,8 1,9 1,10 1,11 1,12 1,13 1,14 1,16 1,17 1,21 1,22 1,26 1,27 1,28 1,32 1,33 1,35 1,38 1,42 1,43 1,49 1,52 7.569}
{0 CHEMBL370049,1 1,4 1,5 1,6 1,7 1,8 1,9 1,10 1,11 1,12 1,13 1,17 1,21 1,29 1,52 6.252}
{0 CHEMBL371818,1 1,4 1,5 1,6 1,7 1,8 1,9 1,10 1,11 1,12 1,13 1,17 1,18 1,21 1,29 1,40 1,52 8.328}
{0 CHEMBL37194,1 1,2 1,3 1,4 1,5 1,6 1,7 1,8 1,9 1,10 1,11 1,12 1,13 1,17 1,18 1,21 1,22 1,26 1,27 1,28 1,32 1,33 1,35 1,42 1,46 1,52 9.745}
{0 CHEMBL373267,1 1,4 1,5 1,6 1,7 1,8 1,9 1,10 1,11 1,12 1,13 1,17 1,18 1,21 1,29 1,40 1,52 7.357}
{0 CHEMBL380554,1 1,2 1,3 1,4 1,5 1,6 1,7 1,8 1,9 1,10 1,11 1,12 1,13 1,17 1,18 1,21 1,41 1,48 1,51 1,52 9.237}
{0 CHEMBL38438,1 1,2 1,3 1,4 1,5 1,6 1,7 1,8 1,9 1,10 1,11 1,12 1,13 1,17 1,18 1,21 1,22 1,26 1,27 1,28 1,32 1,33 1,35 1,42 1,46 1,52 9.086}
{0 CHEMBL38567,1 1,2 1,3 1,4 1,5 1,6 1,7 1,8 1,9 1,10 1,11 1,12 1,13 1,17 1,18 1,21 1,22 1,23 1,26 1,27 1,28 1,32 1,33 1,35 1,42 1,52 8.071}
{0 CHEMBL38595,1 1,2 1,3 1,4 1,5 1,6 1,7 1,8 1,9 1,10 1,11 1,12 1,13 1,14 1,16 1,17 1,18 1,21 1,22 1,26 1,27 1,28 1,32 1,33 1,35 1,38 1,42 1,51 1,52 8.699}
{0 CHEMBL38615,1 1,2 1,3 1,4 1,5 1,6 1,7 1,8 1,9 1,10 1,11 1,12 1,13 1,14 1,16 1,17 1,18 1,21 1,22 1,26 1,27 1,28 1,32 1,33 1,35 1,44 1,46 1,52 9.398}
{0 CHEMBL38616,1 1,2 1,3 1,4 1,5 1,6 1,7 1,8 1,9 1,10 1,11 1,12 1,13 1,14 1,16 1,17 1,18 1,21 1,22 1,26 1,27 1,28 1,32 1,33 1,35 1,44 1,46 1,52 9.125}
{0 CHEMBL38781,15 1,19 1,20 1,24 1,25 1,29 1,30 1,31 1,34 1,36 1,37 1,39 1,40 1,41 1,47 1,52 4.77}
{0 CHEMBL38802,1 1,4 1,5 1,6 1,7 1,8 1,9 1,10 1,11 1,12 1,13 1,17 1,18 1,21 1,22 1,23 1,26 1,27 1,28 1,32 1,33 1,35 1,42 1,52 7.237}
{0 CHEMBL38941,1 1,2 1,3 1,4 1,5 1,6 1,7 1,8 1,9 1,10 1,11 1,12 1,13 1,16 1,17 1,18 1,21 1,22 1,23 1,26 1,27 1,28 1,32 1,33 1,34 1,35 1,40 1,42 1,52 9.292}
{0 CHEMBL38974,1 1,2 1,3 1,4 1,5 1,6 1,7 1,8 1,9 1,10 1,11 1,12 1,13 1,17 1,18 1,21 1,22 1,23 1,26 1,27 1,28 1,32 1,33 1,35 1,42 1,48 1,51 1,52 8.086}
{0 CHEMBL39096,1 1,2 1,3 1,4 1,5 1,6 1,7 1,8 1,9 1,10 1,11 1,12 1,13 1,17 1,18 1,21 1,22 1,26 1,27 1,28 1,32 1,33 1,35 1,42 1,46 1,52 9.292}
{0 CHEMBL39117,1 1,2 1,3 1,4 1,5 1,6 1,7 1,8 1,9 1,10 1,11 1,12 1,13 1,16 1,17 1,18 1,21 1,22 1,23 1,26 1,27 1,28 1,32 1,33 1,35 1,42 1,52 9.036}
{0 CHEMBL39805,1 1,2 1,3 1,4 1,5 1,6 1,7 1,8 1,9 1,10 1,11 1,12 1,13 1,16 1,17 1,18 1,21 1,22 1,23 1,24 1,26 1,27 1,28 1,29 1,32 1,33 1,35 1,42 1,52 9.009}
{0 CHEMBL40256,15 1,19 1,20 1,24 1,25 1,29 1,30 1,31 1,34 1,36 1,37 1,39 1,40 1,41 1,47 1,52 6.086}
{0 CHEMBL40437,10 1,15 1,19 1,20 1,24 1,25 1,29 1,30 1,31 1,34 1,36 1,37 1,39 1,40 1,41 1,47 1,52 5.125}
{0 CHEMBL40483,15 1,19 1,20 1,24 1,25 1,29 1,30 1,31 1,34 1,36 1,37 1,39 1,40 1,41 1,47 1,52 4.921}
{0 CHEMBL40886,15 1,19 1,20 1,24 1,25 1,29 1,30 1,31 1,34 1,36 1,37 1,39 1,40 1,41 1,47 1,52 4.367}
{0 CHEMBL40938,15 1,19 1,20 1,24 1,25 1,29 1,30 1,31 1,34 1,36 1,37 1,39 1,40 1,41 1,47 1,52 4.699}
{0 CHEMBL40990,10 1,15 1,19 1,20 1,24 1,25 1,29 1,30 1,31 1,34 1,36 1,37 1,39 1,40 1,41 1,47 1,52 4.658}
{0 CHEMBL41039,10 1,15 1,19 1,20 1,24 1,25 1,29 1,30 1,31 1,34 1,36 1,37 1,39 1,40 1,41 1,47 1,52 5.092}
{0 CHEMBL41054,15 1,19 1,20 1,24 1,25 1,29 1,30 1,31 1,34 1,37 1,39 1,40 1,41 1,52 5.745}
{0 CHEMBL41082,15 1,19 1,20 1,24 1,25 1,29 1,30 1,31 1,34 1,37 1,39 1,40 1,41 1,52 6.086}
{0 CHEMBL41268,1 1,2 1,4 1,5 1,6 1,7 1,8 1,9 1,10 1,11 1,12 1,13 1,17 1,18 1,21 1,22 1,26 1,27 1,28 1,32 1,33 1,35 1,42 1,46 1,52 9.347}
{0 CHEMBL41380,15 1,19 1,20 1,24 1,25 1,29 1,30 1,31 1,34 1,36 1,37 1,39 1,40 1,41 1,47 1,52 6.301}
{0 CHEMBL414457,1 1,15 1,19 1,20 1,24 1,25 1,30 1,31 1,34 1,37 1,40 1,41 1,52 6.481}
{0 CHEMBL41454,1 1,2 1,4 1,5 1,6 1,7 1,8 1,9 1,10 1,11 1,12 1,13 1,14 1,16 1,17 1,18 1,21 1,22 1,26 1,27 1,28 1,32 1,33 1,35 1,44 1,46 1,52 8.699}
{0 CHEMBL414819,1 1,2 1,3 1,5 1,6 1,10 1,14 1,16 1,22 1,34 1,40 1,43 1,49 1,52 7.921}
{0 CHEMBL41515,1 1,2 1,3 1,4 1,5 1,6 1,7 1,8 1,9 1,10 1,11 1,12 1,13 1,17 1,18 1,21 1,22 1,26 1,27 1,28 1,32 1,33 1,35 1,42 1,46 1,48 1,51 1,52 9.796}
{0 CHEMBL41518,1 1,4 1,5 1,6 1,7 1,8 1,9 1,10 1,11 1,12 1,13 1,17 1,18 1,21 1,22 1,24 1,26 1,27 1,28 1,32 1,33 1,35 1,42 1,46 1,52 7.357}
{0 CHEMBL41540,1 1,2 1,3 1,4 1,5 1,6 1,7 1,8 1,9 1,10 1,11 1,12 1,13 1,17 1,18 1,21 1,22 1,26 1,27 1,28 1,32 1,33 1,35 1,42 1,46 1,52 8.409}
{0 CHEMBL416226,1 1,4 1,5 1,6 1,7 1,8 1,9 1,10 1,11 1,12 1,13 1,17 1,18 1,21 1,24 1,40 1,41 1,52 7.398}
{0 CHEMBL416247,15 1,19 1,20 1,24 1,25 1,29 1,30 1,31 1,34 1,36 1,37 1,39 1,40 1,41 1,47 1,52 4.319}
{0 CHEMBL416619,15 1,19 1,20 1,24 1,25 1,29 1,30 1,31 1,34 1,36 1,37 1,39 1,40 1,41 1,47 1,52 5}
{0 CHEMBL41682,1 1,2 1,3 1,4 1,5 1,6 1,7 1,8 1,9 1,10 1,11 1,12 1,13 1,14 1,16 1,17 1,18 1,21 1,22 1,26 1,27 1,28 1,32 1,33 1,35 1,44 1,46 1,52 9}
{0 CHEMBL41748,1 1,2 1,3 1,4 1,5 1,6 1,7 1,8 1,9 1,10 1,11 1,12 1,13 1,14 1,16 1,17 1,18 1,21 1,22 1,26 1,27 1,28 1,32 1,33 1,35 1,38 1,41 1,42 1,48 1,51 1,52 9.699}
{0 CHEMBL418059,1 1,2 1,3 1,4 1,5 1,6 1,7 1,8 1,9 1,10 1,11 1,12 1,13 1,17 1,18 1,21 1,22 1,23 1,26 1,27 1,28 1,32 1,33 1,35 1,42 1,52 7.602}
{0 CHEMBL418195,1 1,24 1,34 1,37 1,40 1,41 1,47 1,52 6.328}
{0 CHEMBL418200,15 1,19 1,20 1,34 1,40 1,41 1,52 4.409}
{0 CHEMBL41936,1 1,2 1,3 1,4 1,5 1,6 1,7 1,8 1,9 1,10 1,11 1,12 1,13 1,16 1,17 1,18 1,21 1,22 1,23 1,24 1,26 1,27 1,28 1,32 1,33 1,35 1,42 1,52 9.004}
{0 CHEMBL419473,5 1,6 1,10 1,22 1,29 1,30 1,40 1,50 1,52 7.013}
{0 CHEMBL41951,1 1,2 1,3 1,4 1,5 1,6 1,7 1,8 1,9 1,10 1,11 1,12 1,13 1,17 1,18 1,21 1,22 1,26 1,27 1,28 1,32 1,33 1,35 1,42 1,46 1,52 9.745}
{0 CHEMBL420025,5 1,6 1,10 1,22 1,29 1,30 1,52 5.921}
{0 CHEMBL420336,1 1,2 1,3 1,4 1,5 1,6 1,10 1,14 1,16 1,34 1,40 1,43 1,49 1,52 8.155}
{0 CHEMBL42107,15 1,19 1,20 1,24 1,25 1,29 1,30 1,31 1,34 1,37 1,39 1,40 1,41 1,52 6.046}
{0 CHEMBL421253,1 1,2 1,3 1,5 1,6 1,10 1,14 1,16 1,22 1,34 1,35 1,40 1,43 1,49 1,52 8.155}
{0 CHEMBL421269,1 1,2 1,3 1,14 1,16 1,22 1,34 1,40 1,43 1,49 1,52 9.398}
{0 CHEMBL42262,15 1,19 1,20 1,24 1,25 1,29 1,30 1,31 1,34 1,36 1,37 1,39 1,40 1,41 1,47 1,52 5.076}
{0 CHEMBL424279,1 1,2 1,3 1,5 1,6 1,10 1,14 1,16 1,17 1,22 1,34 1,40 1,52 6}
{0 CHEMBL425337,1 1,2 1,3 1,4 1,5 1,6 1,7 1,8 1,9 1,10 1,11 1,12 1,13 1,14 1,16 1,17 1,21 1,22 1,26 1,27 1,28 1,32 1,33 1,35 1,38 1,42 1,43 1,49 1,52 7.155}
{0 CHEMBL425561,1 1,4 1,5 1,6 1,7 1,8 1,9 1,10 1,11 1,12 1,13 1,17 1,18 1,21 1,24 1,26 1,29 1,32 1,33 1,42 1,52 6}
{0 CHEMBL426961,1 1,2 1,3 1,4 1,5 1,6 1,7 1,8 1,9 1,10 1,11 1,12 1,13 1,14 1,16 1,17 1,21 1,22 1,23 1,26 1,27 1,28 1,32 1,33 1,35 1,38 1,42 1,43 1,49 1,52 7.538}
{0 CHEMBL43082,1 1,2 1,4 1,5 1,6 1,7 1,8 1,9 1,10 1,11 1,12 1,13 1,17 1,18 1,21 1,22 1,26 1,27 1,28 1,32 1,33 1,35 1,42 1,46 1,52 9.149}
{0 CHEMBL430929,6 1,10 1,21 1,22 1,35 1,40 1,52 6}
{0 CHEMBL431884,1 1,2 1,3 1,4 1,5 1,6 1,7 1,8 1,9 1,10 1,11 1,12 1,13 1,14 1,17 1,21 1,22 1,27 1,28 1,38 1,41 1,48 1,51 1,52 9.347}
{0 CHEMBL432412,1 1,2 1,3 1,5 1,6 1,10 1,14 1,16 1,22 1,24 1,34 1,40 1,43 1,49 1,52 7.959}
{0 CHEMBL432477,1 1,2 1,3 1,4 1,5 1,6 1,7 1,8 1,9 1,10 1,11 1,12 1,13 1,14 1,16 1,17 1,18 1,21 1,22 1,26 1,27 1,28 1,32 1,33 1,35 1,44 1,46 1,52 9.056}
{0 CHEMBL432538,1 1,2 1,3 1,4 1,19 1,20 1,34 1,37 1,40 1,41 1,52 7.456}
{0 CHEMBL432934,5 1,6 1,10 1,22 1,29 1,30 1,50 1,52 6.438}
{0 CHEMBL433139,5 1,6 1,10 1,22 1,29 1,34 1,40 1,50 1,52 5.432}
{0 CHEMBL433854,19 1,20 1,24 1,25 1,31 1,34 1,40 1,41 1,47 1,52 6.456}
{0 CHEMBL434146,1 1,2 1,3 1,4 1,5 1,6 1,7 1,8 1,9 1,10 1,11 1,12 1,13 1,14 1,16 1,17 1,18 1,21 1,22 1,23 1,24 1,40 1,41 1,44 1,52 7.886}
{0 CHEMBL434396,1 1,2 1,3 1,4 1,5 1,6 1,7 1,8 1,9 1,10 1,11 1,12 1,13 1,16 1,17 1,18 1,21 1,22 1,23 1,26 1,27 1,28 1,32 1,33 1,35 1,42 1,52 9.602}
{0 CHEMBL43455,1 1,2 1,3 1,4 1,5 1,6 1,7 1,8 1,9 1,10 1,11 1,12 1,13 1,14 1,16 1,17 1,18 1,21 1,22 1,26 1,27 1,28 1,32 1,33 1,35 1,42 1,44 1,52 9.208}
{0 CHEMBL43631,1 1,2 1,3 1,4 1,5 1,6 1,7 1,8 1,9 1,10 1,11 1,12 1,13 1,14 1,16 1,17 1,21 1,22 1,23 1,26 1,27 1,28 1,32 1,33 1,35 1,38 1,41 1,42 1,48 1,51 1,52 9.367}
{0 CHEMBL440564,1 1,2 1,3 1,4 1,5 1,6 1,7 1,8 1,9 1,10 1,11 1,12 1,13 1,14 1,17 1,18 1,21 1,41 1,48 1,51 1,52 9.824}
{0 CHEMBL44091,15 1,19 1,20 1,24 1,25 1,29 1,30 1,31 1,34 1,36 1,37 1,39 1,40 1,41 1,47 1,52 5.959}
{0 CHEMBL441623,1 1,4 1,19 1,20 1,34 1,37 1,40 1,41 1,48 1,51 1,52 7}
{0 CHEMBL54044,1 1,2 1,3 1,14 1,19 1,20 1,34 1,40 1,52 9.301}
{0 CHEMBL555621,1 1,2 1,3 1,5 1,6 1,10 1,14 1,34 1,40 1,52 7.155}
{0 CHEMBL62387,1 1,19 1,20 1,24 1,34 1,37 1,40 1,41 1,47 1,52 7.585}
{0 CHEMBL63366,1 1,4 1,19 1,20 1,34 1,37 1,40 1,41 1,52 7.328}
{0 CHEMBL63663,1 1,4 1,19 1,20 1,34 1,37 1,40 1,41 1,52 5.398}
{0 CHEMBL65257,1 1,10 1,19 1,20 1,29 1,34 1,37 1,40 1,41 1,52 8.699}
{0 CHEMBL67174,1 1,4 1,19 1,20 1,24 1,34 1,37 1,40 1,41 1,52 7.086}
{0 CHEMBL67663,1 1,4 1,19 1,20 1,24 1,34 1,37 1,40 1,41 1,52 7.77}
{0 CHEMBL79412,5 1,6 1,10 1,22 1,29 1,30 1,50 1,52 6.495}
{0 CHEMBL81061,5 1,6 1,10 1,22 1,29 1,30 1,40 1,50 1,52 5.921}
{0 CHEMBL81267,5 1,6 1,10 1,22 1,29 1,30 1,50 1,52 6.417}
{0 CHEMBL81275,5 1,6 1,10 1,22 1,29 1,34 1,40 1,50 1,52 5.432}
{0 CHEMBL81532,4 1,5 1,6 1,10 1,30 1,50 1,52 8.577}
{0 CHEMBL82402,5 1,6 1,10 1,22 1,30 1,50 1,52 7.886}
{0 CHEMBL82466,22 1,29 1,30 1,50 1,52 5.432}
{0 CHEMBL87258,1 1,19 1,20 1,24 1,25 1,29 1,31 1,34 1,37 1,39 1,40 1,41 1,52 5.796}
{0 CHEMBL91722,1 1,19 1,20 1,24 1,25 1,34 1,37 1,39 1,40 1,41 1,47 1,52 7.678}
{0 CHEMBL99645,19 1,20 1,24 1,29 1,30 1,34 1,37 1,40 1,41 1,47 1,52 6.62}
