"molecule_id","FCFP4_1024b1","FCFP4_1024b10","FCFP4_1024b100","FCFP4_1024b1000","FCFP4_1024b1001","FCFP4_1024b1002","FCFP4_1024b1003","FCFP4_1024b1004","FCFP4_1024b1005","FCFP4_1024b1006","FCFP4_1024b1007","FCFP4_1024b1008","FCFP4_1024b1009","FCFP4_1024b101","FCFP4_1024b1010","FCFP4_1024b1011","FCFP4_1024b1012","FCFP4_1024b1013","FCFP4_1024b1014","FCFP4_1024b1015","FCFP4_1024b1016","FCFP4_1024b1017","FCFP4_1024b1018","FCFP4_1024b1019","FCFP4_1024b102","FCFP4_1024b1020","FCFP4_1024b1021","FCFP4_1024b1022","FCFP4_1024b1023","FCFP4_1024b1024","FCFP4_1024b103","FCFP4_1024b104","FCFP4_1024b105","FCFP4_1024b106","FCFP4_1024b107","FCFP4_1024b108","FCFP4_1024b109","FCFP4_1024b11","FCFP4_1024b110","FCFP4_1024b111","FCFP4_1024b112","FCFP4_1024b113","FCFP4_1024b114","FCFP4_1024b115","FCFP4_1024b116","FCFP4_1024b117","FCFP4_1024b118","FCFP4_1024b119","FCFP4_1024b12","FCFP4_1024b120","FCFP4_1024b121","pXC50"
{1 1,3 1,24 1,52 4.425}
{0 CHEMBL1287841,1 1,35 1,52 4.609}
{0 CHEMBL1289105,1 1,35 1,52 6.854}
{0 CHEMBL1289106,1 1,35 1,52 5.031}
{0 CHEMBL1289107,1 1,35 1,52 5.046}
{0 CHEMBL1289225,1 1,35 1,52 4.301}
{0 CHEMBL1289226,1 1,24 1,35 1,52 4.301}
{0 CHEMBL1289227,1 1,35 1,52 6.62}
{0 CHEMBL1289341,1 1,35 1,52 6.959}
{0 CHEMBL1289342,1 1,35 1,52 6.301}
{0 CHEMBL1290660,1 1,35 1,52 4.301}
{0 CHEMBL1290661,1 1,35 1,52 6.208}
{0 CHEMBL1290662,1 1,35 1,52 6.796}
{0 CHEMBL1290779,1 1,24 1,35 1,52 4.301}
{0 CHEMBL1290780,1 1,35 1,52 4.301}
{0 CHEMBL1908355,1 1,37 1,52 5.592}
