{
  "data_features": {
    "feature": [
      {
        "data_type": "nominal",
        "index": "0",
        "is_ignore": "false",
        "is_row_identifier": "true",
        "is_target": "false",
        "name": "molecule_id",
        "nominal_value": [
          "CHEMBL1300935",
          "CHEMBL1300997",
          "CHEMBL1306232",
          "CHEMBL1309322",
          "CHEMBL1311692",
          "CHEMBL1312413",
          "CHEMBL1314041",
          "CHEMBL1319175",
          "CHEMBL1319565",
          "CHEMBL1325848",
          "CHEMBL1332346",
          "CHEMBL1335094",
          "CHEMBL1335256",
          "CHEMBL1335373",
          "CHEMBL1335685",
          "CHEMBL1335692",
          "CHEMBL1336601",
          "CHEMBL1337101",
          "CHEMBL1338735",
          "CHEMBL1339046",
          "CHEMBL1339438",
          "CHEMBL1342885",
          "CHEMBL1343746",
          "CHEMBL1344766",
          "CHEMBL1344848",
          "CHEMBL1350024",
          "CHEMBL1351920",
          "CHEMBL1353612",
          "CHEMBL1358771",
          "CHEMBL1358809",
          "CHEMBL1359426",
          "CHEMBL1359489",
          "CHEMBL1364722",
          "CHEMBL1366282",
          "CHEMBL1370401",
          "CHEMBL1371138",
          "CHEMBL1371990",
          "CHEMBL1380202",
          "CHEMBL1381596",
          "CHEMBL1382150",
          "CHEMBL1383506",
          "CHEMBL1386141",
          "CHEMBL1387472",
          "CHEMBL1388042",
          "CHEMBL1388448",
          "CHEMBL1401638",
          "CHEMBL1402796",
          "CHEMBL1404493",
          "CHEMBL1412407",
          "CHEMBL1412874",
          "CHEMBL1413393",
          "CHEMBL1416734",
          "CHEMBL1418691",
          "CHEMBL1421312",
          "CHEMBL1421525",
          "CHEMBL1426998",
          "CHEMBL1436519",
          "CHEMBL1441254",
          "CHEMBL1446321",
          "CHEMBL1447678",
          "CHEMBL1452153",
          "CHEMBL1452812",
          "CHEMBL1454002",
          "CHEMBL1456577",
          "CHEMBL1458112",
          "CHEMBL1459221",
          "CHEMBL1460465",
          "CHEMBL1461182",
          "CHEMBL1463698",
          "CHEMBL1464847",
          "CHEMBL1467280",
          "CHEMBL1468887",
          "CHEMBL1471999",
          "CHEMBL1480448",
          "CHEMBL1482022",
          "CHEMBL1484343",
          "CHEMBL1493564",
          "CHEMBL1498512",
          "CHEMBL1499675",
          "CHEMBL1500235",
          "CHEMBL1501491",
          "CHEMBL1503352",
          "CHEMBL1503385",
          "CHEMBL1506732",
          "CHEMBL1507724",
          "CHEMBL1509579",
          "CHEMBL1517453",
          "CHEMBL1518183",
          "CHEMBL1531690",
          "CHEMBL1533829",
          "CHEMBL1536967",
          "CHEMBL1537947",
          "CHEMBL1538063",
          "CHEMBL1538214",
          "CHEMBL1539046",
          "CHEMBL1540447",
          "CHEMBL1543278",
          "CHEMBL1546168",
          "CHEMBL1549996",
          "CHEMBL1562905",
          "CHEMBL1565197",
          "CHEMBL1568072",
          "CHEMBL1569862",
          "CHEMBL1572885",
          "CHEMBL1573548",
          "CHEMBL1575268",
          "CHEMBL1576145",
          "CHEMBL1578660",
          "CHEMBL1579263",
          "CHEMBL1579913",
          "CHEMBL1582334",
          "CHEMBL1582511",
          "CHEMBL1583768",
          "CHEMBL1584538",
          "CHEMBL1585038",
          "CHEMBL1585808",
          "CHEMBL1586617",
          "CHEMBL1587146",
          "CHEMBL1588709",
          "CHEMBL1589201",
          "CHEMBL1589399",
          "CHEMBL1595687",
          "CHEMBL1595945",
          "CHEMBL1609697",
          "CHEMBL1609915",
          "CHEMBL1610617",
          "CHEMBL1697929",
          "CHEMBL1698073",
          "CHEMBL1698337",
          "CHEMBL1698879",
          "CHEMBL1699198",
          "CHEMBL1699874",
          "CHEMBL1700476",
          "CHEMBL1701301",
          "CHEMBL1701512",
          "CHEMBL1701679",
          "CHEMBL1702161",
          "CHEMBL1702876",
          "CHEMBL1703306",
          "CHEMBL1703414",
          "CHEMBL1703562",
          "CHEMBL1703918",
          "CHEMBL1705448",
          "CHEMBL1705499",
          "CHEMBL1705920",
          "CHEMBL1706556",
          "CHEMBL1706758",
          "CHEMBL1706988",
          "CHEMBL1707135",
          "CHEMBL1707743",
          "CHEMBL1707830",
          "CHEMBL1708047",
          "CHEMBL1708651",
          "CHEMBL1708907",
          "CHEMBL1709509",
          "CHEMBL1710048",
          "CHEMBL1710120",
          "CHEMBL1710128",
          "CHEMBL1710499",
          "CHEMBL1710542",
          "CHEMBL1710711",
          "CHEMBL1712328",
          "CHEMBL1713683",
          "CHEMBL1713871",
          "CHEMBL1714617",
          "CHEMBL1715364",
          "CHEMBL1715946",
          "CHEMBL1716158",
          "CHEMBL1716369",
          "CHEMBL1716381",
          "CHEMBL1717204",
          "CHEMBL1717450",
          "CHEMBL1718881",
          "CHEMBL1718965",
          "CHEMBL1719118",
          "CHEMBL1720022",
          "CHEMBL1720787",
          "CHEMBL1721648",
          "CHEMBL1722551",
          "CHEMBL1723067",
          "CHEMBL1723453",
          "CHEMBL1723963",
          "CHEMBL1724285",
          "CHEMBL1724571",
          "CHEMBL1725011",
          "CHEMBL1726190",
          "CHEMBL1726382",
          "CHEMBL1727473",
          "CHEMBL1728485",
          "CHEMBL1728621",
          "CHEMBL1728794",
          "CHEMBL1729021",
          "CHEMBL1729376",
          "CHEMBL1729749",
          "CHEMBL1729911",
          "CHEMBL1729987",
          "CHEMBL1730555",
          "CHEMBL1731173",
          "CHEMBL1731906",
          "CHEMBL1732922",
          "CHEMBL1733129",
          "CHEMBL1733974",
          "CHEMBL1734525",
          "CHEMBL1734700",
          "CHEMBL1734822",
          "CHEMBL1735215",
          "CHEMBL1735852",
          "CHEMBL1736481",
          "CHEMBL186174",
          "CHEMBL1940354",
          "CHEMBL1940536",
          "CHEMBL1940537",
          "CHEMBL1940538",
          "CHEMBL1940539",
          "CHEMBL1940541",
          "CHEMBL1940542",
          "CHEMBL1940543",
          "CHEMBL1964671",
          "CHEMBL1965488",
          "CHEMBL1965537",
          "CHEMBL1965555",
          "CHEMBL1966758",
          "CHEMBL1967160",
          "CHEMBL1967208",
          "CHEMBL1968058",
          "CHEMBL1968640",
          "CHEMBL1969065",
          "CHEMBL1970441",
          "CHEMBL1972164",
          "CHEMBL1972271",
          "CHEMBL1972527",
          "CHEMBL1973416",
          "CHEMBL1974221",
          "CHEMBL1975675",
          "CHEMBL1977285",
          "CHEMBL1977515",
          "CHEMBL1977658",
          "CHEMBL1977747",
          "CHEMBL1977847",
          "CHEMBL1979415",
          "CHEMBL1979763",
          "CHEMBL1980609",
          "CHEMBL1980701",
          "CHEMBL1980803",
          "CHEMBL1981304",
          "CHEMBL1981724",
          "CHEMBL1982410",
          "CHEMBL1982532",
          "CHEMBL1985845",
          "CHEMBL1987263",
          "CHEMBL1987422",
          "CHEMBL1988961",
          "CHEMBL1989553",
          "CHEMBL1989820",
          "CHEMBL1991771",
          "CHEMBL1992915",
          "CHEMBL1993324",
          "CHEMBL1993900",
          "CHEMBL1994128",
          "CHEMBL1995732",
          "CHEMBL1995776",
          "CHEMBL1995837",
          "CHEMBL1996268",
          "CHEMBL1999025",
          "CHEMBL1999861",
          "CHEMBL2000954",
          "CHEMBL2001553",
          "CHEMBL2001833",
          "CHEMBL2002956",
          "CHEMBL2003244",
          "CHEMBL2005445",
          "CHEMBL2005648",
          "CHEMBL2007325",
          "CHEMBL2068743",
          "CHEMBL2068744",
          "CHEMBL2068749",
          "CHEMBL2068750",
          "CHEMBL2207113",
          "CHEMBL2207114",
          "CHEMBL2207115",
          "CHEMBL2207116",
          "CHEMBL2207117",
          "CHEMBL2207118",
          "CHEMBL2207119",
          "CHEMBL2207120",
          "CHEMBL2207121",
          "CHEMBL2207519",
          "CHEMBL2207520",
          "CHEMBL2207521",
          "CHEMBL2207522",
          "CHEMBL2207523",
          "CHEMBL2207524",
          "CHEMBL2207525",
          "CHEMBL2207526",
          "CHEMBL2207527",
          "CHEMBL2207528",
          "CHEMBL2207529",
          "CHEMBL2207530",
          "CHEMBL2207531",
          "CHEMBL2314288",
          "CHEMBL2314289",
          "CHEMBL2314290",
          "CHEMBL2314291",
          "CHEMBL2314292",
          "CHEMBL2314293",
          "CHEMBL2314294",
          "CHEMBL2314295",
          "CHEMBL2314296",
          "CHEMBL2314297",
          "CHEMBL2314298",
          "CHEMBL2314299",
          "CHEMBL2314300",
          "CHEMBL2314301",
          "CHEMBL2314302",
          "CHEMBL2314303",
          "CHEMBL2314304",
          "CHEMBL2314305",
          "CHEMBL2314306",
          "CHEMBL2314307",
          "CHEMBL2314308",
          "CHEMBL2314309",
          "CHEMBL2314310",
          "CHEMBL2314311",
          "CHEMBL2314312",
          "CHEMBL2314313",
          "CHEMBL2314314",
          "CHEMBL2314315",
          "CHEMBL2314316",
          "CHEMBL2314317",
          "CHEMBL2314318",
          "CHEMBL2314319",
          "CHEMBL2314320",
          "CHEMBL2314321",
          "CHEMBL2314322",
          "CHEMBL2314323",
          "CHEMBL2314324",
          "CHEMBL2314325",
          "CHEMBL2314326",
          "CHEMBL2314327",
          "CHEMBL2314328",
          "CHEMBL2314329",
          "CHEMBL2314330",
          "CHEMBL2314331",
          "CHEMBL2314619",
          "CHEMBL2314620",
          "CHEMBL2314621",
          "CHEMBL2314622",
          "CHEMBL2314623"
        ],
        "number_of_missing_values": "0"
      },
      {
        "data_type": "numeric",
        "index": "1",
        "is_ignore": "false",
        "is_row_identifier": "false",
        "is_target": "false",
        "name": "C.019",
        "number_of_missing_values": "0"
      },
      {
        "data_type": "numeric",
        "index": "2",
        "is_ignore": "false",
        "is_row_identifier": "false",
        "is_target": "false",
        "name": "nCconjX",
        "number_of_missing_values": "0"
      },
      {
        "data_type": "numeric",
        "index": "3",
        "is_ignore": "false",
        "is_row_identifier": "false",
        "is_target": "false",
        "name": "nCXr.",
        "number_of_missing_values": "0"
      },
      {
        "data_type": "numeric",
        "index": "4",
        "is_ignore": "false",
        "is_row_identifier": "false",
        "is_target": "false",
        "name": "C.036",
        "number_of_missing_values": "0"
      },
      {
        "data_type": "numeric",
        "index": "5",
        "is_ignore": "false",
        "is_row_identifier": "false",
        "is_target": "false",
        "name": "nC.N.N.",
        "number_of_missing_values": "0"
      },
      {
        "data_type": "numeric",
        "index": "6",
        "is_ignore": "false",
        "is_row_identifier": "false",
        "is_target": "false",
        "name": "P_VSA_MR_7",
        "number_of_missing_values": "0"
      },
      {
        "data_type": "numeric",
        "index": "7",
        "is_ignore": "false",
        "is_row_identifier": "false",
        "is_target": "false",
        "name": "SsCl",
        "number_of_missing_values": "0"
      },
      {
        "data_type": "numeric",
        "index": "8",
        "is_ignore": "false",
        "is_row_identifier": "false",
        "is_target": "false",
        "name": "NdsN",
        "number_of_missing_values": "0"
      },
      {
        "data_type": "numeric",
        "index": "9",
        "is_ignore": "false",
        "is_row_identifier": "false",
        "is_target": "false",
        "name": "Cl.089",
        "number_of_missing_values": "0"
      },
      {
        "data_type": "numeric",
        "index": "10",
        "is_ignore": "false",
        "is_row_identifier": "false",
        "is_target": "false",
        "name": "nCL",
        "number_of_missing_values": "0"
      },
      {
        "data_type": "numeric",
        "index": "11",
        "is_ignore": "false",
        "is_row_identifier": "false",
        "is_target": "false",
        "name": "NsCl",
        "number_of_missing_values": "0"
      },
      {
        "data_type": "numeric",
        "index": "12",
        "is_ignore": "false",
        "is_row_identifier": "false",
        "is_target": "false",
        "name": "P_VSA_e_4",
        "number_of_missing_values": "0"
      },
      {
        "data_type": "numeric",
        "index": "13",
        "is_ignore": "false",
        "is_row_identifier": "false",
        "is_target": "false",
        "name": "CATS2D_02_DA",
        "number_of_missing_values": "0"
      },
      {
        "data_type": "numeric",
        "index": "14",
        "is_ignore": "false",
        "is_row_identifier": "false",
        "is_target": "false",
        "name": "P_VSA_LogP_2",
        "number_of_missing_values": "0"
      },
      {
        "data_type": "numeric",
        "index": "15",
        "is_ignore": "false",
        "is_row_identifier": "false",
        "is_target": "false",
        "name": "N.074",
        "number_of_missing_values": "0"
      },
      {
        "data_type": "numeric",
        "index": "16",
        "is_ignore": "false",
        "is_row_identifier": "false",
        "is_target": "false",
        "name": "NssNH",
        "number_of_missing_values": "0"
      },
      {
        "data_type": "numeric",
        "index": "17",
        "is_ignore": "false",
        "is_row_identifier": "false",
        "is_target": "false",
        "name": "D.Dtr06",
        "number_of_missing_values": "0"
      },
      {
        "data_type": "numeric",
        "index": "18",
        "is_ignore": "false",
        "is_row_identifier": "false",
        "is_target": "false",
        "name": "P_VSA_m_4",
        "number_of_missing_values": "0"
      },
      {
        "data_type": "numeric",
        "index": "19",
        "is_ignore": "false",
        "is_row_identifier": "false",
        "is_target": "false",
        "name": "CATS2D_03_AA",
        "number_of_missing_values": "0"
      },
      {
        "data_type": "numeric",
        "index": "20",
        "is_ignore": "false",
        "is_row_identifier": "false",
        "is_target": "false",
        "name": "GATS1m",
        "number_of_missing_values": "0"
      },
      {
        "data_type": "numeric",
        "index": "21",
        "is_ignore": "false",
        "is_row_identifier": "false",
        "is_target": "false",
        "name": "nR06",
        "number_of_missing_values": "0"
      },
      {
        "data_type": "numeric",
        "index": "22",
        "is_ignore": "false",
        "is_row_identifier": "false",
        "is_target": "false",
        "name": "SpMax3_Bh.m.",
        "number_of_missing_values": "0"
      },
      {
        "data_type": "numeric",
        "index": "23",
        "is_ignore": "false",
        "is_row_identifier": "false",
        "is_target": "false",
        "name": "Hy",
        "number_of_missing_values": "0"
      },
      {
        "data_type": "numeric",
        "index": "24",
        "is_ignore": "false",
        "is_row_identifier": "false",
        "is_target": "false",
        "name": "Eig03_AEA.bo.",
        "number_of_missing_values": "0"
      },
      {
        "data_type": "numeric",
        "index": "25",
        "is_ignore": "false",
        "is_row_identifier": "false",
        "is_target": "false",
        "name": "CATS2D_05_DL",
        "number_of_missing_values": "0"
      },
      {
        "data_type": "numeric",
        "index": "26",
        "is_ignore": "false",
        "is_row_identifier": "false",
        "is_target": "false",
        "name": "P_VSA_LogP_6",
        "number_of_missing_values": "0"
      },
      {
        "data_type": "numeric",
        "index": "27",
        "is_ignore": "false",
        "is_row_identifier": "false",
        "is_target": "false",
        "name": "CATS2D_04_DL",
        "number_of_missing_values": "0"
      },
      {
        "data_type": "numeric",
        "index": "28",
        "is_ignore": "false",
        "is_row_identifier": "false",
        "is_target": "false",
        "name": "NdssC",
        "number_of_missing_values": "0"
      },
      {
        "data_type": "numeric",
        "index": "29",
        "is_ignore": "false",
        "is_row_identifier": "false",
        "is_target": "false",
        "name": "nHDon",
        "number_of_missing_values": "0"
      },
      {
        "data_type": "numeric",
        "index": "30",
        "is_ignore": "false",
        "is_row_identifier": "false",
        "is_target": "false",
        "name": "SAdon",
        "number_of_missing_values": "0"
      },
      {
        "data_type": "numeric",
        "index": "31",
        "is_ignore": "false",
        "is_row_identifier": "false",
        "is_target": "false",
        "name": "CATS2D_07_DL",
        "number_of_missing_values": "0"
      },
      {
        "data_type": "numeric",
        "index": "32",
        "is_ignore": "false",
        "is_row_identifier": "false",
        "is_target": "false",
        "name": "nRCONHR",
        "number_of_missing_values": "0"
      },
      {
        "data_type": "numeric",
        "index": "33",
        "is_ignore": "false",
        "is_row_identifier": "false",
        "is_target": "false",
        "name": "H.050",
        "number_of_missing_values": "0"
      },
      {
        "data_type": "numeric",
        "index": "34",
        "is_ignore": "false",
        "is_row_identifier": "false",
        "is_target": "false",
        "name": "MATS3s",
        "number_of_missing_values": "0"
      },
      {
        "data_type": "numeric",
        "index": "35",
        "is_ignore": "false",
        "is_row_identifier": "false",
        "is_target": "false",
        "name": "CATS2D_06_DL",
        "number_of_missing_values": "0"
      },
      {
        "data_type": "numeric",
        "index": "36",
        "is_ignore": "false",
        "is_row_identifier": "false",
        "is_target": "false",
        "name": "P_VSA_s_5",
        "number_of_missing_values": "0"
      },
      {
        "data_type": "numeric",
        "index": "37",
        "is_ignore": "false",
        "is_row_identifier": "false",
        "is_target": "false",
        "name": "nArOR",
        "number_of_missing_values": "0"
      },
      {
        "data_type": "numeric",
        "index": "38",
        "is_ignore": "false",
        "is_row_identifier": "false",
        "is_target": "false",
        "name": "GATS5m",
        "number_of_missing_values": "0"
      },
      {
        "data_type": "numeric",
        "index": "39",
        "is_ignore": "false",
        "is_row_identifier": "false",
        "is_target": "false",
        "name": "CATS2D_03_DL",
        "number_of_missing_values": "0"
      },
      {
        "data_type": "numeric",
        "index": "40",
        "is_ignore": "false",
        "is_row_identifier": "false",
        "is_target": "false",
        "name": "GATS2m",
        "number_of_missing_values": "0"
      },
      {
        "data_type": "numeric",
        "index": "41",
        "is_ignore": "false",
        "is_row_identifier": "false",
        "is_target": "false",
        "name": "X.",
        "number_of_missing_values": "0"
      },
      {
        "data_type": "numeric",
        "index": "42",
        "is_ignore": "false",
        "is_row_identifier": "false",
        "is_target": "false",
        "name": "nCsp2",
        "number_of_missing_values": "0"
      },
      {
        "data_type": "numeric",
        "index": "43",
        "is_ignore": "false",
        "is_row_identifier": "false",
        "is_target": "false",
        "name": "P_VSA_LogP_8",
        "number_of_missing_values": "0"
      },
      {
        "data_type": "numeric",
        "index": "44",
        "is_ignore": "false",
        "is_row_identifier": "false",
        "is_target": "false",
        "name": "CATS2D_03_DA",
        "number_of_missing_values": "0"
      },
      {
        "data_type": "numeric",
        "index": "45",
        "is_ignore": "false",
        "is_row_identifier": "false",
        "is_target": "false",
        "name": "H.049",
        "number_of_missing_values": "0"
      },
      {
        "data_type": "numeric",
        "index": "46",
        "is_ignore": "false",
        "is_row_identifier": "false",
        "is_target": "false",
        "name": "C.",
        "number_of_missing_values": "0"
      },
      {
        "data_type": "numeric",
        "index": "47",
        "is_ignore": "false",
        "is_row_identifier": "false",
        "is_target": "false",
        "name": "TPSA.NO.",
        "number_of_missing_values": "0"
      },
      {
        "data_type": "numeric",
        "index": "48",
        "is_ignore": "false",
        "is_row_identifier": "false",
        "is_target": "false",
        "name": "nCbH",
        "number_of_missing_values": "0"
      },
      {
        "data_type": "numeric",
        "index": "49",
        "is_ignore": "false",
        "is_row_identifier": "false",
        "is_target": "false",
        "name": "nX",
        "number_of_missing_values": "0"
      },
      {
        "data_type": "numeric",
        "index": "50",
        "is_ignore": "false",
        "is_row_identifier": "false",
        "is_target": "false",
        "name": "PCD",
        "number_of_missing_values": "0"
      },
      {
        "data_type": "numeric",
        "index": "51",
        "is_ignore": "false",
        "is_row_identifier": "false",
        "is_target": "false",
        "name": "X5Av",
        "number_of_missing_values": "0"
      },
      {
        "data_type": "numeric",
        "index": "52",
        "is_ignore": "false",
        "is_row_identifier": "false",
        "is_target": "false",
        "name": "P_VSA_LogP_5",
        "number_of_missing_values": "0"
      },
      {
        "data_type": "numeric",
        "index": "53",
        "is_ignore": "false",
        "is_row_identifier": "false",
        "is_target": "false",
        "name": "P_VSA_p_3",
        "number_of_missing_values": "0"
      },
      {
        "data_type": "numeric",
        "index": "54",
        "is_ignore": "false",
        "is_row_identifier": "false",
        "is_target": "false",
        "name": "P_VSA_v_3",
        "number_of_missing_values": "0"
      },
      {
        "data_type": "numeric",
        "index": "55",
        "is_ignore": "false",
        "is_row_identifier": "false",
        "is_target": "false",
        "name": "nBnz",
        "number_of_missing_values": "0"
      },
      {
        "data_type": "numeric",
        "index": "56",
        "is_ignore": "false",
        "is_row_identifier": "false",
        "is_target": "false",
        "name": "TPSA.Tot.",
        "number_of_missing_values": "0"
      },
      {
        "data_type": "numeric",
        "index": "57",
        "is_ignore": "false",
        "is_row_identifier": "false",
        "is_target": "false",
        "name": "Eig03_EA.bo.",
        "number_of_missing_values": "0"
      },
      {
        "data_type": "numeric",
        "index": "58",
        "is_ignore": "false",
        "is_row_identifier": "false",
        "is_target": "false",
        "name": "SM13_AEA.ri.",
        "number_of_missing_values": "0"
      },
      {
        "data_type": "numeric",
        "index": "59",
        "is_ignore": "false",
        "is_row_identifier": "false",
        "is_target": "false",
        "name": "SssO",
        "number_of_missing_values": "0"
      },
      {
        "data_type": "numeric",
        "index": "60",
        "is_ignore": "false",
        "is_row_identifier": "false",
        "is_target": "false",
        "name": "P_VSA_p_2",
        "number_of_missing_values": "0"
      },
      {
        "data_type": "numeric",
        "index": "61",
        "is_ignore": "false",
        "is_row_identifier": "false",
        "is_target": "false",
        "name": "P_VSA_s_4",
        "number_of_missing_values": "0"
      },
      {
        "data_type": "numeric",
        "index": "62",
        "is_ignore": "false",
        "is_row_identifier": "false",
        "is_target": "false",
        "name": "CATS2D_05_DA",
        "number_of_missing_values": "0"
      },
      {
        "data_type": "numeric",
        "index": "63",
        "is_ignore": "false",
        "is_row_identifier": "false",
        "is_target": "false",
        "name": "GATS4m",
        "number_of_missing_values": "0"
      },
      {
        "data_type": "numeric",
        "index": "64",
        "is_ignore": "false",
        "is_row_identifier": "false",
        "is_target": "false",
        "name": "SdsN",
        "number_of_missing_values": "0"
      },
      {
        "data_type": "numeric",
        "index": "65",
        "is_ignore": "false",
        "is_row_identifier": "false",
        "is_target": "false",
        "name": "nR.Cs",
        "number_of_missing_values": "0"
      },
      {
        "data_type": "numeric",
        "index": "66",
        "is_ignore": "false",
        "is_row_identifier": "false",
        "is_target": "false",
        "name": "P_VSA_v_2",
        "number_of_missing_values": "0"
      },
      {
        "data_type": "numeric",
        "index": "67",
        "is_ignore": "false",
        "is_row_identifier": "false",
        "is_target": "false",
        "name": "CATS2D_03_AL",
        "number_of_missing_values": "0"
      },
      {
        "data_type": "numeric",
        "index": "68",
        "is_ignore": "false",
        "is_row_identifier": "false",
        "is_target": "true",
        "name": "pXC50",
        "number_of_missing_values": "0"
      }
    ]
  }
}