{
  "data_features": {
    "feature": [
      {
        "data_type": "nominal",
        "index": "0",
        "is_ignore": "false",
        "is_row_identifier": "true",
        "is_target": "false",
        "name": "molecule_id",
        "nominal_value": [
          "CHEMBL157639",
          "CHEMBL158543",
          "CHEMBL158792",
          "CHEMBL158793",
          "CHEMBL158993",
          "CHEMBL159046",
          "CHEMBL159048",
          "CHEMBL159139",
          "CHEMBL160727",
          "CHEMBL161537",
          "CHEMBL161603",
          "CHEMBL161604",
          "CHEMBL161774",
          "CHEMBL291324",
          "CHEMBL291509",
          "CHEMBL291953",
          "CHEMBL293797",
          "CHEMBL299333",
          "CHEMBL348892",
          "CHEMBL349775",
          "CHEMBL351250",
          "CHEMBL351829",
          "CHEMBL422884",
          "CHEMBL437",
          "CHEMBL442357",
          "CHEMBL443",
          "CHEMBL53450",
          "CHEMBL55589",
          "CHEMBL55865",
          "CHEMBL55866",
          "CHEMBL55911",
          "CHEMBL56063",
          "CHEMBL56190",
          "CHEMBL56233",
          "CHEMBL56302",
          "CHEMBL58777",
          "CHEMBL59151"
        ],
        "number_of_missing_values": "0"
      },
      {
        "data_type": "numeric",
        "index": "1",
        "is_ignore": "false",
        "is_row_identifier": "false",
        "is_target": "false",
        "name": "AMW",
        "number_of_missing_values": "0"
      },
      {
        "data_type": "numeric",
        "index": "2",
        "is_ignore": "false",
        "is_row_identifier": "false",
        "is_target": "false",
        "name": "C.",
        "number_of_missing_values": "0"
      },
      {
        "data_type": "numeric",
        "index": "3",
        "is_ignore": "false",
        "is_row_identifier": "false",
        "is_target": "false",
        "name": "H.",
        "number_of_missing_values": "0"
      },
      {
        "data_type": "numeric",
        "index": "4",
        "is_ignore": "false",
        "is_row_identifier": "false",
        "is_target": "false",
        "name": "Me",
        "number_of_missing_values": "0"
      },
      {
        "data_type": "numeric",
        "index": "5",
        "is_ignore": "false",
        "is_row_identifier": "false",
        "is_target": "true",
        "name": "pXC50",
        "number_of_missing_values": "0"
      }
    ]
  }
}