{
  "data_features": {
    "feature": [
      {
        "data_type": "nominal",
        "index": "0",
        "is_ignore": "false",
        "is_row_identifier": "true",
        "is_target": "false",
        "name": "molecule_id",
        "nominal_value": [
          "CHEMBL1089944",
          "CHEMBL1089945",
          "CHEMBL1089946",
          "CHEMBL1089947",
          "CHEMBL1089948",
          "CHEMBL1089949",
          "CHEMBL1089950",
          "CHEMBL1089952",
          "CHEMBL1090273",
          "CHEMBL1090274",
          "CHEMBL1090275",
          "CHEMBL1090276",
          "CHEMBL1090277",
          "CHEMBL1090278",
          "CHEMBL1090279",
          "CHEMBL1090280",
          "CHEMBL1090632",
          "CHEMBL1090633",
          "CHEMBL1090635",
          "CHEMBL1090636",
          "CHEMBL1090637",
          "CHEMBL1090638",
          "CHEMBL1090639",
          "CHEMBL1090640",
          "CHEMBL1090968",
          "CHEMBL1090969",
          "CHEMBL1090970",
          "CHEMBL207341",
          "CHEMBL2304308",
          "CHEMBL2304309",
          "CHEMBL2304310",
          "CHEMBL443697",
          "CHEMBL444514",
          "CHEMBL446284",
          "CHEMBL450322",
          "CHEMBL451424",
          "CHEMBL451944",
          "CHEMBL454229",
          "CHEMBL486090",
          "CHEMBL499121",
          "CHEMBL499402",
          "CHEMBL499664",
          "CHEMBL499749",
          "CHEMBL499766",
          "CHEMBL499790",
          "CHEMBL500258",
          "CHEMBL500441",
          "CHEMBL500475",
          "CHEMBL500788",
          "CHEMBL500995",
          "CHEMBL501031",
          "CHEMBL501094",
          "CHEMBL501283",
          "CHEMBL501395",
          "CHEMBL501541",
          "CHEMBL501558",
          "CHEMBL502045",
          "CHEMBL502310",
          "CHEMBL503191",
          "CHEMBL503205",
          "CHEMBL503219",
          "CHEMBL503489",
          "CHEMBL503673",
          "CHEMBL503730",
          "CHEMBL503983",
          "CHEMBL504003",
          "CHEMBL504095",
          "CHEMBL504145",
          "CHEMBL504226",
          "CHEMBL504266",
          "CHEMBL504269",
          "CHEMBL504336",
          "CHEMBL504423",
          "CHEMBL504493",
          "CHEMBL504539",
          "CHEMBL504543",
          "CHEMBL504837",
          "CHEMBL504855",
          "CHEMBL504919",
          "CHEMBL505501",
          "CHEMBL505603",
          "CHEMBL505609",
          "CHEMBL505622",
          "CHEMBL505681",
          "CHEMBL505689",
          "CHEMBL505790",
          "CHEMBL505899",
          "CHEMBL506195",
          "CHEMBL506261",
          "CHEMBL506263",
          "CHEMBL506482",
          "CHEMBL506507",
          "CHEMBL506623",
          "CHEMBL506644",
          "CHEMBL506646",
          "CHEMBL506647",
          "CHEMBL506740",
          "CHEMBL506836",
          "CHEMBL507004",
          "CHEMBL507073",
          "CHEMBL507344",
          "CHEMBL507649",
          "CHEMBL507807",
          "CHEMBL508126",
          "CHEMBL508221",
          "CHEMBL508377",
          "CHEMBL508398",
          "CHEMBL508411",
          "CHEMBL508486",
          "CHEMBL508491",
          "CHEMBL508564",
          "CHEMBL508704",
          "CHEMBL508902",
          "CHEMBL508983",
          "CHEMBL509335",
          "CHEMBL509409",
          "CHEMBL509666",
          "CHEMBL509774",
          "CHEMBL510017",
          "CHEMBL510066",
          "CHEMBL510233",
          "CHEMBL510473",
          "CHEMBL510716",
          "CHEMBL510720",
          "CHEMBL510817",
          "CHEMBL511030",
          "CHEMBL520698",
          "CHEMBL524297",
          "CHEMBL524476",
          "CHEMBL524483",
          "CHEMBL524509",
          "CHEMBL524517",
          "CHEMBL524659",
          "CHEMBL524691",
          "CHEMBL524718",
          "CHEMBL524722",
          "CHEMBL524825",
          "CHEMBL524856",
          "CHEMBL524877",
          "CHEMBL524887",
          "CHEMBL524908",
          "CHEMBL525014",
          "CHEMBL525018",
          "CHEMBL525040",
          "CHEMBL525045",
          "CHEMBL525060",
          "CHEMBL525088",
          "CHEMBL525201",
          "CHEMBL525216",
          "CHEMBL525232",
          "CHEMBL525263",
          "CHEMBL525265",
          "CHEMBL525431",
          "CHEMBL525583",
          "CHEMBL525594",
          "CHEMBL525614",
          "CHEMBL525624",
          "CHEMBL525635",
          "CHEMBL525636",
          "CHEMBL525782",
          "CHEMBL526130",
          "CHEMBL526174",
          "CHEMBL526187",
          "CHEMBL526300",
          "CHEMBL526336",
          "CHEMBL526337",
          "CHEMBL526373",
          "CHEMBL526381",
          "CHEMBL526499",
          "CHEMBL526683",
          "CHEMBL526861",
          "CHEMBL527054",
          "CHEMBL527072",
          "CHEMBL527080",
          "CHEMBL527084"
        ],
        "number_of_missing_values": "0"
      },
      {
        "data_type": "numeric",
        "index": "1",
        "is_ignore": "false",
        "is_row_identifier": "false",
        "is_target": "false",
        "name": "nHM",
        "number_of_missing_values": "0"
      },
      {
        "data_type": "numeric",
        "index": "2",
        "is_ignore": "false",
        "is_row_identifier": "false",
        "is_target": "false",
        "name": "nS",
        "number_of_missing_values": "0"
      },
      {
        "data_type": "numeric",
        "index": "3",
        "is_ignore": "false",
        "is_row_identifier": "false",
        "is_target": "false",
        "name": "RBF",
        "number_of_missing_values": "0"
      },
      {
        "data_type": "numeric",
        "index": "4",
        "is_ignore": "false",
        "is_row_identifier": "false",
        "is_target": "false",
        "name": "nAB",
        "number_of_missing_values": "0"
      },
      {
        "data_type": "numeric",
        "index": "5",
        "is_ignore": "false",
        "is_row_identifier": "false",
        "is_target": "false",
        "name": "Me",
        "number_of_missing_values": "0"
      },
      {
        "data_type": "numeric",
        "index": "6",
        "is_ignore": "false",
        "is_row_identifier": "false",
        "is_target": "false",
        "name": "O.",
        "number_of_missing_values": "0"
      },
      {
        "data_type": "numeric",
        "index": "7",
        "is_ignore": "false",
        "is_row_identifier": "false",
        "is_target": "true",
        "name": "pXC50",
        "number_of_missing_values": "0"
      }
    ]
  }
}