{
  "data_features": {
    "feature": [
      {
        "data_type": "nominal",
        "index": "0",
        "is_ignore": "false",
        "is_row_identifier": "true",
        "is_target": "false",
        "name": "molecule_id",
        "nominal_value": [
          "CHEMBL104",
          "CHEMBL104474",
          "CHEMBL104698",
          "CHEMBL104793",
          "CHEMBL105570",
          "CHEMBL105659",
          "CHEMBL105975",
          "CHEMBL106803",
          "CHEMBL106907",
          "CHEMBL107128",
          "CHEMBL107439",
          "CHEMBL1078231",
          "CHEMBL1093137",
          "CHEMBL1169660",
          "CHEMBL1170725",
          "CHEMBL1171008",
          "CHEMBL1171786",
          "CHEMBL1688888",
          "CHEMBL1688889",
          "CHEMBL191915",
          "CHEMBL1924014",
          "CHEMBL1924024",
          "CHEMBL193932",
          "CHEMBL194775",
          "CHEMBL194930",
          "CHEMBL195061",
          "CHEMBL195103",
          "CHEMBL195119",
          "CHEMBL195203",
          "CHEMBL195213",
          "CHEMBL195298",
          "CHEMBL195343",
          "CHEMBL195484",
          "CHEMBL195665",
          "CHEMBL195698",
          "CHEMBL195751",
          "CHEMBL195764",
          "CHEMBL195893",
          "CHEMBL197654",
          "CHEMBL198077",
          "CHEMBL199374",
          "CHEMBL199466",
          "CHEMBL199733",
          "CHEMBL199780",
          "CHEMBL199818",
          "CHEMBL199913",
          "CHEMBL200400",
          "CHEMBL200465",
          "CHEMBL200966",
          "CHEMBL2016602",
          "CHEMBL2018951",
          "CHEMBL2018952",
          "CHEMBL2018953",
          "CHEMBL2018954",
          "CHEMBL2018955",
          "CHEMBL2018956",
          "CHEMBL2018957",
          "CHEMBL2018958",
          "CHEMBL2018959",
          "CHEMBL2018960",
          "CHEMBL2018961",
          "CHEMBL2018962",
          "CHEMBL2018963",
          "CHEMBL2018964",
          "CHEMBL2018965",
          "CHEMBL2018966",
          "CHEMBL2018967",
          "CHEMBL2018968",
          "CHEMBL2018969",
          "CHEMBL202085",
          "CHEMBL205195",
          "CHEMBL205279",
          "CHEMBL205490",
          "CHEMBL205910",
          "CHEMBL206039",
          "CHEMBL206103",
          "CHEMBL206788",
          "CHEMBL206789",
          "CHEMBL206878",
          "CHEMBL206921",
          "CHEMBL207290",
          "CHEMBL207320",
          "CHEMBL207479",
          "CHEMBL207589",
          "CHEMBL207642",
          "CHEMBL207780",
          "CHEMBL207801",
          "CHEMBL207857",
          "CHEMBL208102",
          "CHEMBL208249",
          "CHEMBL208452",
          "CHEMBL208458",
          "CHEMBL208459",
          "CHEMBL2105686",
          "CHEMBL2113066",
          "CHEMBL2113068",
          "CHEMBL2113069",
          "CHEMBL2113072",
          "CHEMBL2113075",
          "CHEMBL211775",
          "CHEMBL2178575",
          "CHEMBL2207081",
          "CHEMBL2207082",
          "CHEMBL2207083",
          "CHEMBL2207085",
          "CHEMBL2207086",
          "CHEMBL2207087",
          "CHEMBL2207088",
          "CHEMBL2207089",
          "CHEMBL2207091",
          "CHEMBL2207092",
          "CHEMBL2207093",
          "CHEMBL2207094",
          "CHEMBL2207095",
          "CHEMBL2207096",
          "CHEMBL2207097",
          "CHEMBL2207098",
          "CHEMBL2207099",
          "CHEMBL2207100",
          "CHEMBL2207101",
          "CHEMBL2216810",
          "CHEMBL22587",
          "CHEMBL2321924",
          "CHEMBL2324200",
          "CHEMBL232639",
          "CHEMBL232640",
          "CHEMBL232641",
          "CHEMBL2326608",
          "CHEMBL2326609",
          "CHEMBL2326610",
          "CHEMBL2326611",
          "CHEMBL2326612",
          "CHEMBL2326613",
          "CHEMBL2326614",
          "CHEMBL2326615",
          "CHEMBL2326616",
          "CHEMBL2326617",
          "CHEMBL2326618",
          "CHEMBL2326619",
          "CHEMBL2326620",
          "CHEMBL2326621",
          "CHEMBL2326622",
          "CHEMBL2326623",
          "CHEMBL2326624",
          "CHEMBL2326625",
          "CHEMBL2326626",
          "CHEMBL2326627",
          "CHEMBL2326628",
          "CHEMBL2326629",
          "CHEMBL2326630",
          "CHEMBL2326631",
          "CHEMBL2326632",
          "CHEMBL2326633",
          "CHEMBL2326634",
          "CHEMBL2326923",
          "CHEMBL2326924",
          "CHEMBL2326925",
          "CHEMBL2326926",
          "CHEMBL2326927",
          "CHEMBL232839",
          "CHEMBL232840",
          "CHEMBL232841",
          "CHEMBL233045",
          "CHEMBL233046",
          "CHEMBL233047",
          "CHEMBL233261",
          "CHEMBL245313",
          "CHEMBL245319",
          "CHEMBL245331",
          "CHEMBL245332",
          "CHEMBL245531",
          "CHEMBL245730",
          "CHEMBL245931",
          "CHEMBL246123",
          "CHEMBL246124",
          "CHEMBL246133",
          "CHEMBL246134",
          "CHEMBL246328",
          "CHEMBL246334",
          "CHEMBL246335",
          "CHEMBL246384",
          "CHEMBL246385",
          "CHEMBL246584",
          "CHEMBL246585",
          "CHEMBL246787",
          "CHEMBL246986",
          "CHEMBL247976",
          "CHEMBL248182",
          "CHEMBL275593",
          "CHEMBL277930",
          "CHEMBL278962",
          "CHEMBL288256",
          "CHEMBL288655",
          "CHEMBL288800",
          "CHEMBL289661",
          "CHEMBL290201",
          "CHEMBL290678",
          "CHEMBL290845",
          "CHEMBL295057",
          "CHEMBL295405",
          "CHEMBL295424",
          "CHEMBL295560",
          "CHEMBL296067",
          "CHEMBL296152",
          "CHEMBL296192",
          "CHEMBL296245",
          "CHEMBL297145",
          "CHEMBL297173",
          "CHEMBL297335",
          "CHEMBL297761",
          "CHEMBL297854",
          "CHEMBL298035",
          "CHEMBL298193",
          "CHEMBL298230",
          "CHEMBL298454",
          "CHEMBL317860",
          "CHEMBL319622",
          "CHEMBL321539",
          "CHEMBL365155",
          "CHEMBL370861",
          "CHEMBL372251",
          "CHEMBL372399",
          "CHEMBL372670",
          "CHEMBL377421",
          "CHEMBL378272",
          "CHEMBL379460",
          "CHEMBL380537",
          "CHEMBL382244",
          "CHEMBL382826",
          "CHEMBL383736",
          "CHEMBL394467",
          "CHEMBL394642",
          "CHEMBL394714",
          "CHEMBL394859",
          "CHEMBL395626",
          "CHEMBL395627",
          "CHEMBL395680",
          "CHEMBL396166",
          "CHEMBL396786",
          "CHEMBL396787",
          "CHEMBL396836",
          "CHEMBL397028",
          "CHEMBL397845",
          "CHEMBL397846",
          "CHEMBL397848",
          "CHEMBL40238",
          "CHEMBL40366",
          "CHEMBL40377",
          "CHEMBL40427",
          "CHEMBL40468",
          "CHEMBL40771",
          "CHEMBL41275",
          "CHEMBL415902",
          "CHEMBL416069",
          "CHEMBL417712",
          "CHEMBL418072",
          "CHEMBL41983",
          "CHEMBL42001",
          "CHEMBL42021",
          "CHEMBL42044",
          "CHEMBL42046",
          "CHEMBL42060",
          "CHEMBL42065",
          "CHEMBL42162",
          "CHEMBL42168",
          "CHEMBL42226",
          "CHEMBL42266",
          "CHEMBL42270",
          "CHEMBL42334",
          "CHEMBL42360",
          "CHEMBL42411",
          "CHEMBL42419",
          "CHEMBL424689",
          "CHEMBL42491",
          "CHEMBL42523",
          "CHEMBL42585",
          "CHEMBL42586",
          "CHEMBL42600",
          "CHEMBL42722",
          "CHEMBL42757",
          "CHEMBL42774",
          "CHEMBL42786",
          "CHEMBL42799",
          "CHEMBL428224",
          "CHEMBL428576",
          "CHEMBL428932",
          "CHEMBL43092",
          "CHEMBL43143",
          "CHEMBL43144",
          "CHEMBL43330",
          "CHEMBL43661",
          "CHEMBL43698",
          "CHEMBL43706",
          "CHEMBL43758",
          "CHEMBL438248",
          "CHEMBL439518",
          "CHEMBL43969",
          "CHEMBL43988",
          "CHEMBL44134",
          "CHEMBL44143",
          "CHEMBL44187",
          "CHEMBL44188",
          "CHEMBL44198",
          "CHEMBL44259",
          "CHEMBL44262",
          "CHEMBL44390",
          "CHEMBL44401",
          "CHEMBL44463",
          "CHEMBL44472",
          "CHEMBL44498",
          "CHEMBL44553",
          "CHEMBL44561",
          "CHEMBL449621",
          "CHEMBL451783",
          "CHEMBL452864",
          "CHEMBL453594",
          "CHEMBL459463",
          "CHEMBL459464",
          "CHEMBL459465",
          "CHEMBL46748",
          "CHEMBL470962",
          "CHEMBL486656",
          "CHEMBL486840",
          "CHEMBL487635",
          "CHEMBL487665",
          "CHEMBL487835",
          "CHEMBL487836",
          "CHEMBL488018",
          "CHEMBL488640",
          "CHEMBL488690",
          "CHEMBL488691",
          "CHEMBL488704",
          "CHEMBL488855",
          "CHEMBL488857",
          "CHEMBL495736",
          "CHEMBL495737",
          "CHEMBL495948",
          "CHEMBL496151",
          "CHEMBL496152",
          "CHEMBL496356",
          "CHEMBL496787",
          "CHEMBL499852",
          "CHEMBL50",
          "CHEMBL508207",
          "CHEMBL509396",
          "CHEMBL510375",
          "CHEMBL515355",
          "CHEMBL516936",
          "CHEMBL518924",
          "CHEMBL521737",
          "CHEMBL526474",
          "CHEMBL529664",
          "CHEMBL589276",
          "CHEMBL589521",
          "CHEMBL598070",
          "CHEMBL598339",
          "CHEMBL599995",
          "CHEMBL599996",
          "CHEMBL600016",
          "CHEMBL600017",
          "CHEMBL600018",
          "CHEMBL600019",
          "CHEMBL600196",
          "CHEMBL600197",
          "CHEMBL600409",
          "CHEMBL600805",
          "CHEMBL601217",
          "CHEMBL601424",
          "CHEMBL601650",
          "CHEMBL601651",
          "CHEMBL601652",
          "CHEMBL601653",
          "CHEMBL602268",
          "CHEMBL602269",
          "CHEMBL602474",
          "CHEMBL602887",
          "CHEMBL602888",
          "CHEMBL603104",
          "CHEMBL603701",
          "CHEMBL604130",
          "CHEMBL604330",
          "CHEMBL605581",
          "CHEMBL606421",
          "CHEMBL607137",
          "CHEMBL611508",
          "CHEMBL633",
          "CHEMBL83338",
          "CHEMBL964"
        ],
        "number_of_missing_values": "0"
      },
      {
        "data_type": "numeric",
        "index": "1",
        "is_ignore": "false",
        "is_row_identifier": "false",
        "is_target": "false",
        "name": "AMW",
        "number_of_missing_values": "0"
      },
      {
        "data_type": "numeric",
        "index": "2",
        "is_ignore": "false",
        "is_row_identifier": "false",
        "is_target": "false",
        "name": "C.",
        "number_of_missing_values": "0"
      },
      {
        "data_type": "numeric",
        "index": "3",
        "is_ignore": "false",
        "is_row_identifier": "false",
        "is_target": "false",
        "name": "H.",
        "number_of_missing_values": "0"
      },
      {
        "data_type": "numeric",
        "index": "4",
        "is_ignore": "false",
        "is_row_identifier": "false",
        "is_target": "false",
        "name": "Me",
        "number_of_missing_values": "0"
      },
      {
        "data_type": "numeric",
        "index": "5",
        "is_ignore": "false",
        "is_row_identifier": "false",
        "is_target": "false",
        "name": "Mi",
        "number_of_missing_values": "0"
      },
      {
        "data_type": "numeric",
        "index": "6",
        "is_ignore": "false",
        "is_row_identifier": "false",
        "is_target": "false",
        "name": "Mp",
        "number_of_missing_values": "0"
      },
      {
        "data_type": "numeric",
        "index": "7",
        "is_ignore": "false",
        "is_row_identifier": "false",
        "is_target": "false",
        "name": "Mv",
        "number_of_missing_values": "0"
      },
      {
        "data_type": "numeric",
        "index": "8",
        "is_ignore": "false",
        "is_row_identifier": "false",
        "is_target": "false",
        "name": "MW",
        "number_of_missing_values": "0"
      },
      {
        "data_type": "numeric",
        "index": "9",
        "is_ignore": "false",
        "is_row_identifier": "false",
        "is_target": "false",
        "name": "N.",
        "number_of_missing_values": "0"
      },
      {
        "data_type": "numeric",
        "index": "10",
        "is_ignore": "false",
        "is_row_identifier": "false",
        "is_target": "false",
        "name": "nAB",
        "number_of_missing_values": "0"
      },
      {
        "data_type": "numeric",
        "index": "11",
        "is_ignore": "false",
        "is_row_identifier": "false",
        "is_target": "false",
        "name": "nAT",
        "number_of_missing_values": "0"
      },
      {
        "data_type": "numeric",
        "index": "12",
        "is_ignore": "false",
        "is_row_identifier": "false",
        "is_target": "false",
        "name": "nB",
        "number_of_missing_values": "0"
      },
      {
        "data_type": "numeric",
        "index": "13",
        "is_ignore": "false",
        "is_row_identifier": "false",
        "is_target": "false",
        "name": "nBM",
        "number_of_missing_values": "0"
      },
      {
        "data_type": "numeric",
        "index": "14",
        "is_ignore": "false",
        "is_row_identifier": "false",
        "is_target": "false",
        "name": "nBO",
        "number_of_missing_values": "0"
      },
      {
        "data_type": "numeric",
        "index": "15",
        "is_ignore": "false",
        "is_row_identifier": "false",
        "is_target": "false",
        "name": "nBR",
        "number_of_missing_values": "0"
      },
      {
        "data_type": "numeric",
        "index": "16",
        "is_ignore": "false",
        "is_row_identifier": "false",
        "is_target": "false",
        "name": "nBT",
        "number_of_missing_values": "0"
      },
      {
        "data_type": "numeric",
        "index": "17",
        "is_ignore": "false",
        "is_row_identifier": "false",
        "is_target": "false",
        "name": "nC",
        "number_of_missing_values": "0"
      },
      {
        "data_type": "numeric",
        "index": "18",
        "is_ignore": "false",
        "is_row_identifier": "false",
        "is_target": "false",
        "name": "nCL",
        "number_of_missing_values": "0"
      },
      {
        "data_type": "numeric",
        "index": "19",
        "is_ignore": "false",
        "is_row_identifier": "false",
        "is_target": "false",
        "name": "nCsp",
        "number_of_missing_values": "0"
      },
      {
        "data_type": "numeric",
        "index": "20",
        "is_ignore": "false",
        "is_row_identifier": "false",
        "is_target": "false",
        "name": "nCsp2",
        "number_of_missing_values": "0"
      },
      {
        "data_type": "numeric",
        "index": "21",
        "is_ignore": "false",
        "is_row_identifier": "false",
        "is_target": "false",
        "name": "nCsp3",
        "number_of_missing_values": "0"
      },
      {
        "data_type": "numeric",
        "index": "22",
        "is_ignore": "false",
        "is_row_identifier": "false",
        "is_target": "false",
        "name": "nDB",
        "number_of_missing_values": "0"
      },
      {
        "data_type": "numeric",
        "index": "23",
        "is_ignore": "false",
        "is_row_identifier": "false",
        "is_target": "false",
        "name": "nF",
        "number_of_missing_values": "0"
      },
      {
        "data_type": "numeric",
        "index": "24",
        "is_ignore": "false",
        "is_row_identifier": "false",
        "is_target": "false",
        "name": "nH",
        "number_of_missing_values": "0"
      },
      {
        "data_type": "numeric",
        "index": "25",
        "is_ignore": "false",
        "is_row_identifier": "false",
        "is_target": "false",
        "name": "nHet",
        "number_of_missing_values": "0"
      },
      {
        "data_type": "numeric",
        "index": "26",
        "is_ignore": "false",
        "is_row_identifier": "false",
        "is_target": "false",
        "name": "nHM",
        "number_of_missing_values": "0"
      },
      {
        "data_type": "numeric",
        "index": "27",
        "is_ignore": "false",
        "is_row_identifier": "false",
        "is_target": "false",
        "name": "nI",
        "number_of_missing_values": "0"
      },
      {
        "data_type": "numeric",
        "index": "28",
        "is_ignore": "false",
        "is_row_identifier": "false",
        "is_target": "false",
        "name": "nN",
        "number_of_missing_values": "0"
      },
      {
        "data_type": "numeric",
        "index": "29",
        "is_ignore": "false",
        "is_row_identifier": "false",
        "is_target": "false",
        "name": "nO",
        "number_of_missing_values": "0"
      },
      {
        "data_type": "numeric",
        "index": "30",
        "is_ignore": "false",
        "is_row_identifier": "false",
        "is_target": "false",
        "name": "nP",
        "number_of_missing_values": "0"
      },
      {
        "data_type": "numeric",
        "index": "31",
        "is_ignore": "false",
        "is_row_identifier": "false",
        "is_target": "false",
        "name": "nS",
        "number_of_missing_values": "0"
      },
      {
        "data_type": "numeric",
        "index": "32",
        "is_ignore": "false",
        "is_row_identifier": "false",
        "is_target": "false",
        "name": "nSK",
        "number_of_missing_values": "0"
      },
      {
        "data_type": "numeric",
        "index": "33",
        "is_ignore": "false",
        "is_row_identifier": "false",
        "is_target": "false",
        "name": "nTB",
        "number_of_missing_values": "0"
      },
      {
        "data_type": "numeric",
        "index": "34",
        "is_ignore": "false",
        "is_row_identifier": "false",
        "is_target": "false",
        "name": "nX",
        "number_of_missing_values": "0"
      },
      {
        "data_type": "numeric",
        "index": "35",
        "is_ignore": "false",
        "is_row_identifier": "false",
        "is_target": "false",
        "name": "O.",
        "number_of_missing_values": "0"
      },
      {
        "data_type": "numeric",
        "index": "36",
        "is_ignore": "false",
        "is_row_identifier": "false",
        "is_target": "false",
        "name": "RBF",
        "number_of_missing_values": "0"
      },
      {
        "data_type": "numeric",
        "index": "37",
        "is_ignore": "false",
        "is_row_identifier": "false",
        "is_target": "false",
        "name": "RBN",
        "number_of_missing_values": "0"
      },
      {
        "data_type": "numeric",
        "index": "38",
        "is_ignore": "false",
        "is_row_identifier": "false",
        "is_target": "false",
        "name": "SCBO",
        "number_of_missing_values": "0"
      },
      {
        "data_type": "numeric",
        "index": "39",
        "is_ignore": "false",
        "is_row_identifier": "false",
        "is_target": "false",
        "name": "Se",
        "number_of_missing_values": "0"
      },
      {
        "data_type": "numeric",
        "index": "40",
        "is_ignore": "false",
        "is_row_identifier": "false",
        "is_target": "false",
        "name": "Si",
        "number_of_missing_values": "0"
      },
      {
        "data_type": "numeric",
        "index": "41",
        "is_ignore": "false",
        "is_row_identifier": "false",
        "is_target": "false",
        "name": "Sp",
        "number_of_missing_values": "0"
      },
      {
        "data_type": "numeric",
        "index": "42",
        "is_ignore": "false",
        "is_row_identifier": "false",
        "is_target": "false",
        "name": "Sv",
        "number_of_missing_values": "0"
      },
      {
        "data_type": "numeric",
        "index": "43",
        "is_ignore": "false",
        "is_row_identifier": "false",
        "is_target": "false",
        "name": "X.",
        "number_of_missing_values": "0"
      },
      {
        "data_type": "numeric",
        "index": "44",
        "is_ignore": "false",
        "is_row_identifier": "false",
        "is_target": "true",
        "name": "pXC50",
        "number_of_missing_values": "0"
      }
    ]
  }
}