{
  "data_qualities": {
    "quality": [
      {
        "name": "AutoCorrelation",
        "value": "0.1884521963824292"
      },
      {
        "name": "ClassEntropy",
        "value": []
      },
      {
        "name": "Dimensionality",
        "value": "0.11597938144329897"
      },
      {
        "name": "EquivalentNumberOfAtts",
        "value": []
      },
      {
        "name": "MajorityClassPercentage",
        "value": []
      },
      {
        "name": "MajorityClassSize",
        "value": []
      },
      {
        "name": "MaxAttributeEntropy",
        "value": []
      },
      {
        "name": "MaxKurtosisOfNumericAtts",
        "value": "262.3569437676506"
      },
      {
        "name": "MaxMeansOfNumericAtts",
        "value": "489.5777319587629"
      },
      {
        "name": "MaxMutualInformation",
        "value": []
      },
      {
        "name": "MaxNominalAttDistinctValues",
        "value": []
      },
      {
        "name": "MaxSkewnessOfNumericAtts",
        "value": "15.823449800024285"
      },
      {
        "name": "MaxStdDevOfNumericAtts",
        "value": "109.30342521547506"
      },
      {
        "name": "MeanAttributeEntropy",
        "value": []
      },
      {
        "name": "MeanKurtosisOfNumericAtts",
        "value": "21.360064707816978"
      },
      {
        "name": "MeanMeansOfNumericAtts",
        "value": "27.27862945173383"
      },
      {
        "name": "MeanMutualInformation",
        "value": []
      },
      {
        "name": "MeanNoiseToSignalRatio",
        "value": []
      },
      {
        "name": "MeanNominalAttDistinctValues",
        "value": []
      },
      {
        "name": "MeanSkewnessOfNumericAtts",
        "value": "1.6476346567845002"
      },
      {
        "name": "MeanStdDevOfNumericAtts",
        "value": "6.340409715470266"
      },
      {
        "name": "MinAttributeEntropy",
        "value": []
      },
      {
        "name": "MinKurtosisOfNumericAtts",
        "value": "-1.2578038037578065"
      },
      {
        "name": "MinMeansOfNumericAtts",
        "value": "0.0"
      },
      {
        "name": "MinMutualInformation",
        "value": []
      },
      {
        "name": "MinNominalAttDistinctValues",
        "value": []
      },
      {
        "name": "MinSkewnessOfNumericAtts",
        "value": "-0.8791586189898841"
      },
      {
        "name": "MinStdDevOfNumericAtts",
        "value": "0.0"
      },
      {
        "name": "MinorityClassPercentage",
        "value": []
      },
      {
        "name": "MinorityClassSize",
        "value": []
      },
      {
        "name": "NumberOfBinaryFeatures",
        "value": "0.0"
      },
      {
        "name": "NumberOfClasses",
        "value": "0.0"
      },
      {
        "name": "NumberOfFeatures",
        "value": "45.0"
      },
      {
        "name": "NumberOfInstances",
        "value": "388.0"
      },
      {
        "name": "NumberOfInstancesWithMissingValues",
        "value": "0.0"
      },
      {
        "name": "NumberOfMissingValues",
        "value": "0.0"
      },
      {
        "name": "NumberOfNumericFeatures",
        "value": "44.0"
      },
      {
        "name": "NumberOfSymbolicFeatures",
        "value": "1.0"
      },
      {
        "name": "PercentageOfBinaryFeatures",
        "value": "0.0"
      },
      {
        "name": "PercentageOfInstancesWithMissingValues",
        "value": "0.0"
      },
      {
        "name": "PercentageOfMissingValues",
        "value": "0.0"
      },
      {
        "name": "PercentageOfNumericFeatures",
        "value": "97.77777777777777"
      },
      {
        "name": "PercentageOfSymbolicFeatures",
        "value": "2.2222222222222223"
      },
      {
        "name": "Quartile1AttributeEntropy",
        "value": []
      },
      {
        "name": "Quartile1KurtosisOfNumericAtts",
        "value": "-0.5639207109887349"
      },
      {
        "name": "Quartile1MeansOfNumericAtts",
        "value": "0.8238060567010309"
      },
      {
        "name": "Quartile1MutualInformation",
        "value": []
      },
      {
        "name": "Quartile1SkewnessOfNumericAtts",
        "value": "-0.22295608600891836"
      },
      {
        "name": "Quartile1StdDevOfNumericAtts",
        "value": "0.3516947785905769"
      },
      {
        "name": "Quartile2AttributeEntropy",
        "value": []
      },
      {
        "name": "Quartile2KurtosisOfNumericAtts",
        "value": "-0.2654522984551322"
      },
      {
        "name": "Quartile2MeansOfNumericAtts",
        "value": "6.226295103092784"
      },
      {
        "name": "Quartile2MutualInformation",
        "value": []
      },
      {
        "name": "Quartile2SkewnessOfNumericAtts",
        "value": "-0.06494019357587665"
      },
      {
        "name": "Quartile2StdDevOfNumericAtts",
        "value": "2.271805982222703"
      },
      {
        "name": "Quartile3AttributeEntropy",
        "value": []
      },
      {
        "name": "Quartile3KurtosisOfNumericAtts",
        "value": "2.4777070437438895"
      },
      {
        "name": "Quartile3MeansOfNumericAtts",
        "value": "35.52577319587628"
      },
      {
        "name": "Quartile3MutualInformation",
        "value": []
      },
      {
        "name": "Quartile3SkewnessOfNumericAtts",
        "value": "1.0388923973850368"
      },
      {
        "name": "Quartile3StdDevOfNumericAtts",
        "value": "6.856411228393414"
      },
      {
        "name": "StdvNominalAttDistinctValues",
        "value": []
      }
    ]
  }
}