"molecule_id","AMW","C.","H.","Me","Mi","Mp","Mv","MW","N.","nAB","nAT","nB","nBM","nBO","nBR","nBT","nC","nCL","nCsp","nCsp2","nCsp3","nDB","nF","nH","nHet","nHM","nI","nN","nO","nP","nS","nSK","nTB","nX","O.","RBF","RBN","SCBO","Se","Si","Sp","Sv","X.","pXC50"
{1 5.394,2 34.6,3 61.5,4 0.977,5 1.136,6 0.598,7 0.536,8 280.5,11 52,13 3,14 19,16 51,17 18,20 5,21 13,22 3,24 32,25 2,29 2,32 20,35 3.8,36 0.275,37 14,38 22,39 50.792,40 59.062,41 31.091,42 27.858,44 4}
{0 CHEMBL1256379,1 8.794,2 46.4,3 35.7,4 1.038,5 1.112,6 0.681,7 0.686,8 246.23,10 12,11 28,13 13,14 19,16 29,17 13,20 13,22 1,24 10,25 5,29 5,32 18,35 17.9,36 0.069,37 2,38 26,39 29.055,40 31.123,41 19.08,42 19.208,44 4.831}
{0 CHEMBL1256380,1 9.042,2 44.8,3 34.5,4 1.048,5 1.115,6 0.674,7 0.687,8 262.23,10 12,11 29,13 13,14 20,16 30,17 13,20 13,22 1,24 10,25 6,29 6,32 19,35 20.7,36 0.067,37 2,38 27,39 30.382,40 32.332,41 19.534,42 19.923,44 5.066}
{0 CHEMBL1257642,1 8.341,2 38.9,3 40.7,4 1.043,5 1.127,6 0.637,7 0.642,8 450.43,10 12,11 54,13 13,14 35,16 57,17 21,20 13,21 8,22 1,24 22,25 11,29 11,32 32,35 20.4,36 0.053,37 3,38 42,39 56.32,40 60.871,41 34.375,42 34.658,44 4.308}
{0 CHEMBL1299881,1 8.765,2 43.4,3 37.7,4 1.022,5 1.119,6 0.699,7 0.68,8 464.54,9 7.5,10 17,11 53,13 22,14 36,16 56,17 23,20 19,21 4,22 5,24 20,25 10,26 1,28 4,29 5,31 1,32 33,35 9.4,36 0.143,37 8,38 49.5,39 54.189,40 59.282,41 37.034,42 36.061,44 4.573}
{0 CHEMBL1306827,1 7.199,2 34,3 50.9,4 1.006,5 1.137,6 0.634,7 0.593,8 381.55,9 5.7,10 6,11 53,13 11,14 27,16 54,17 18,20 7,21 11,22 5,24 27,25 8,26 1,28 3,29 4,31 1,32 26,35 7.5,36 0.111,37 6,38 35,39 53.294,40 60.235,41 33.62,42 31.432,44 4.551}
{0 CHEMBL1310297,1 9.607,2 45.9,3 35.1,4 1.014,5 1.104,6 0.758,7 0.716,8 355.47,9 8.1,10 12,11 37,13 16,14 26,16 39,17 17,20 16,21 1,22 4,24 13,25 7,26 2,28 3,29 2,31 2,32 24,35 5.4,36 0.077,37 3,38 36,39 37.531,40 40.83,41 28.029,42 26.502,44 4.543}
{0 CHEMBL1318983,1 9.417,2 43.2,3 31.8,4 1.056,5 1.122,6 0.674,7 0.696,8 414.35,9 4.5,10 12,11 44,13 18,14 32,16 46,17 19,20 16,21 3,22 6,24 14,25 11,28 2,29 9,32 30,35 20.5,36 0.174,37 8,38 44,39 46.451,40 49.372,41 29.67,42 30.637,44 4.51}
{0 CHEMBL1321159,1 8.372,2 41.7,3 41.7,4 1.009,5 1.12,6 0.698,7 0.662,8 301.4,9 8.3,10 12,11 36,13 15,14 22,16 37,17 15,20 13,21 2,22 3,24 15,25 6,26 1,28 3,29 2,31 1,32 21,35 5.6,36 0.135,37 5,38 31,39 36.338,40 40.325,41 25.142,42 23.842,44 4.607}
{0 CHEMBL1324243,1 11.28,2 39.4,3 24.2,4 1.115,5 1.218,6 0.639,7 0.706,8 372.25,9 12.1,10 12,11 33,13 12,14 26,16 34,17 13,20 10,21 3,23 8,24 8,25 12,28 4,32 25,34 8,36 0.176,37 6,38 32,39 36.81,40 40.202,41 21.091,42 23.313,43 24.2,44 4.585}
{0 CHEMBL1337525,1 9.14,2 33.3,3 41,4 1.03,5 1.132,6 0.685,7 0.653,8 356.47,9 10.3,10 6,11 39,13 11,14 24,16 40,17 13,20 7,21 6,22 5,24 16,25 10,26 2,28 4,29 4,31 2,32 23,35 10.3,36 0.125,37 5,38 32,39 40.171,40 44.162,41 26.705,42 25.48,44 4.635}
{0 CHEMBL1347760,1 8.171,2 46.4,3 41.1,4 1.004,5 1.111,6 0.708,7 0.673,8 457.59,9 5.4,10 11,11 56,13 15,14 39,16 62,17 26,19 1,20 13,21 12,22 3,24 23,25 7,26 1,28 3,29 3,31 1,32 33,33 1,35 5.4,36 0.032,37 2,38 49.5,39 56.2,40 62.195,41 39.642,42 37.664,44 4.613}
{0 CHEMBL1360774,1 7.923,2 42.1,3 43.9,4 1.007,5 1.12,6 0.682,7 0.647,8 451.59,9 5.3,10 17,11 57,13 20,14 36,16 61,17 24,20 16,21 8,22 3,24 25,25 8,26 1,28 3,29 4,31 1,32 32,35 7,36 0.098,37 6,38 47.5,39 57.411,40 63.82,41 38.858,42 36.905,44 4.613}
{0 CHEMBL1364064,1 8.378,2 50,3 36.8,4 1.013,5 1.108,6 0.709,7 0.693,8 318.35,9 5.3,10 17,11 38,13 20,14 27,16 41,17 19,20 17,21 2,22 3,24 14,25 5,28 2,29 3,32 24,35 7.9,36 0.049,37 2,38 38.5,39 38.487,40 42.116,41 26.943,42 26.348,44 4.266}
{0 CHEMBL1372557,1 7.204,2 41.9,3 48.4,4 0.989,5 1.121,6 0.678,7 0.626,8 446.67,9 6.5,10 12,11 62,13 16,14 35,16 65,17 26,20 17,21 9,22 4,24 30,25 6,26 1,28 4,29 1,31 1,32 32,35 1.6,36 0.092,37 6,38 45,39 61.298,40 69.52,41 42.023,42 38.836,44 4.636}
{0 CHEMBL1378300,1 8.671,2 43.9,3 41.5,4 0.999,5 1.109,6 0.734,7 0.679,8 355.52,9 7.3,10 11,11 41,13 14,14 27,16 44,17 18,20 13,21 5,22 3,24 17,25 6,26 2,28 3,29 1,31 2,32 24,35 2.4,36 0.045,37 2,38 35.5,39 40.971,40 45.451,41 30.097,42 27.841,44 4.337}
{0 CHEMBL1382584,1 12.144,2 44.4,3 27.8,4 1.079,5 1.163,6 0.703,7 0.725,8 437.18,9 5.6,10 12,11 36,13 14,14 27,15 1,16 37,17 16,20 14,21 2,22 2,23 5,24 10,25 10,26 1,28 2,29 2,32 26,34 6,35 5.6,36 0.135,37 5,38 35,39 38.836,40 41.862,41 25.29,42 26.102,43 16.7,44 4.391}
{0 CHEMBL1385913,1 9.013,2 40.7,3 40.7,4 1.011,5 1.113,6 0.726,7 0.677,8 486.69,9 7.4,10 11,11 54,13 16,14 35,16 57,17 22,20 16,21 6,22 5,24 22,25 10,26 3,28 4,29 3,31 3,32 32,35 5.6,36 0.14,37 8,38 45.5,39 54.571,40 60.118,41 39.182,42 36.532,44 4.371}
{0 CHEMBL1387081,1 11.103,2 45.2,3 32.3,4 1.023,5 1.122,6 0.746,7 0.723,8 344.19,9 16.1,10 17,11 31,13 18,14 23,15 1,16 33,17 14,20 14,22 1,24 10,25 7,26 1,28 5,29 1,32 21,34 1,35 3.2,36 0.091,37 3,38 32.5,39 31.716,40 34.788,41 23.12,42 22.427,43 3.2,44 4.545}
{0 CHEMBL1393036,1 7.009,2 38.2,3 49.1,4 1.004,5 1.133,6 0.636,7 0.604,8 385.51,9 5.5,10 6,11 55,13 9,14 32,16 59,17 21,20 7,21 14,22 3,24 27,25 7,28 3,29 4,32 28,35 7.3,36 0.068,37 4,38 38,39 55.218,40 62.315,41 34.972,42 33.245,44 4.604}
{0 CHEMBL1414096,1 7.842,2 45.8,3 41.7,4 1.01,5 1.116,6 0.681,7 0.659,8 376.44,9 4.2,10 18,11 48,13 21,14 30,16 50,17 22,20 19,21 3,22 3,24 20,25 6,28 2,29 4,32 28,35 8.3,36 0.14,37 7,38 42,39 48.465,40 53.571,41 32.682,42 31.643,44 4.353}
{0 CHEMBL1417501,1 8.336,2 38.2,3 40,4 1.036,5 1.135,6 0.646,7 0.646,8 458.47,9 7.3,10 12,11 55,13 19,14 34,16 56,17 21,20 15,21 6,22 7,24 22,25 12,28 4,29 8,32 33,35 14.5,36 0.214,37 12,38 47,39 56.978,40 62.405,41 35.511,42 35.545,44 4.364}
{0 CHEMBL1419734,1 8.875,2 40.9,3 40.9,4 1.017,5 1.114,6 0.709,7 0.67,8 585.78,9 4.5,10 18,11 66,13 24,14 43,16 70,17 27,20 20,21 7,22 6,24 27,25 12,26 3,28 3,29 6,31 3,32 39,35 9.1,36 0.114,37 8,38 58,39 67.102,40 73.494,41 46.824,42 44.236,44 4.264}
{0 CHEMBL1420143,1 8.45,2 45.8,3 37.3,4 1.022,5 1.118,6 0.688,7 0.68,8 498.53,9 6.8,10 11,11 59,13 20,14 41,16 63,17 27,20 23,21 4,22 9,24 22,25 10,28 4,29 6,32 37,35 10.2,36 0.127,37 8,38 55.5,39 60.323,40 65.986,41 40.602,42 40.116,44 4.097}
{0 CHEMBL1421254,1 10.476,2 41.2,3 32.4,4 1.049,5 1.126,6 0.716,7 0.712,8 356.18,9 8.8,10 6,11 34,13 12,14 24,16 35,17 14,18 2,20 12,21 2,22 6,24 11,25 9,26 2,28 3,29 4,32 23,34 2,35 11.8,36 0.143,37 5,38 33,39 35.68,40 38.297,41 24.358,42 24.212,43 5.9,44 4.69}
{0 CHEMBL1422819,1 8.942,2 47.4,3 36.8,4 1.015,5 1.114,6 0.72,7 0.697,8 339.8,9 7.9,10 17,11 38,13 19,14 26,16 40,17 18,18 1,20 17,21 1,22 2,24 14,25 6,26 1,28 3,29 2,32 24,34 1,35 5.3,36 0.1,37 4,38 36.5,39 38.585,40 42.349,41 27.352,42 26.482,43 2.6,44 4.562}
{0 CHEMBL1431043,1 10.416,2 40.9,3 29.5,4 1.042,5 1.137,6 0.726,7 0.724,8 458.3,9 20.5,10 22,11 44,13 24,14 34,16 47,17 18,18 2,20 17,21 1,22 2,24 13,25 13,26 2,28 9,29 2,32 31,34 2,35 4.5,36 0.106,37 5,38 47,39 45.869,40 50.037,41 31.96,42 31.858,43 4.5,44 4.617}
{0 CHEMBL1432867,1 10.326,2 44.7,3 28.9,4 1.055,5 1.143,6 0.716,7 0.723,8 392.39,9 10.5,10 17,11 38,13 19,14 29,16 40,17 17,20 16,21 1,22 2,23 3,24 11,25 10,26 1,28 4,29 2,31 1,32 27,34 3,35 5.3,36 0.1,37 4,38 39.5,39 40.094,40 43.427,41 27.199,42 27.486,43 7.9,44 4.363}
{0 CHEMBL1438082,1 8.046,2 45.5,3 40,4 1.012,5 1.119,6 0.685,7 0.667,8 442.51,9 7.3,10 23,11 55,13 26,14 36,16 58,17 25,20 21,21 4,22 3,24 22,25 8,28 4,29 4,32 33,35 7.3,36 0.155,37 9,38 50.5,39 55.669,40 61.568,41 37.693,42 36.686,44 4.654}
{0 CHEMBL1439923,1 8.252,2 37.8,3 40.5,4 1.034,5 1.136,6 0.645,7 0.643,8 305.32,9 8.1,10 11,11 37,13 14,14 23,16 38,17 14,20 11,21 3,22 3,24 15,25 8,28 3,29 5,32 22,35 13.5,36 0.132,37 5,38 31.5,39 38.244,40 42.033,41 23.858,42 23.799,44 4.676}
{0 CHEMBL1463189,1 7.35,2 34,3 50,4 1.008,5 1.136,6 0.637,7 0.598,8 367.52,9 6,10 6,11 50,13 11,14 26,16 51,17 17,20 7,21 10,22 5,24 25,25 8,26 1,28 3,29 4,31 1,32 25,35 8,36 0.098,37 5,38 34,39 50.411,40 56.82,41 31.858,42 29.905,44 4.187}
{0 CHEMBL1465212,1 8.913,2 40.5,3 35.7,4 1.044,5 1.14,6 0.662,7 0.672,8 374.36,9 9.5,10 12,11 42,13 17,14 28,16 43,17 17,20 15,21 2,22 5,23 1,24 15,25 10,28 4,29 5,32 27,34 1,35 11.9,36 0.163,37 7,38 39,39 43.858,40 47.871,41 27.801,42 28.204,43 2.4,44 4.646}
{0 CHEMBL1481587,1 8.75,2 47.6,3 40.5,4 0.999,5 1.097,6 0.745,7 0.691,8 367.52,9 2.4,10 18,11 42,13 21,14 27,16 44,17 20,20 19,21 1,22 3,24 17,25 5,26 2,28 1,29 2,31 2,32 25,35 4.8,36 0.114,37 5,38 39,39 41.978,40 46.079,41 31.301,42 29.04,44 4.268}
{0 CHEMBL1486584,1 7.569,2 40.7,3 44.1,4 1.007,5 1.132,6 0.661,7 0.636,8 446.56,9 10.2,10 21,11 59,13 22,14 37,16 63,17 24,20 16,21 8,22 1,24 26,25 9,28 6,29 3,32 33,35 5.1,36 0.079,37 5,38 48.5,39 59.429,40 66.77,41 39.012,42 37.541,44 4.578}
{0 CHEMBL1492367,1 7.807,2 38.8,3 44.9,4 1.002,5 1.131,6 0.678,7 0.638,8 382.54,9 12.2,10 16,11 49,13 17,14 30,16 52,17 19,20 11,21 8,22 1,24 22,25 8,26 1,28 6,29 1,31 1,32 27,35 2,36 0.115,37 6,38 39,39 49.083,40 55.441,41 33.228,42 31.245,44 4.621}
{0 CHEMBL1492920,1 8.684,2 45.1,3 42.3,4 1.008,5 1.115,6 0.694,7 0.663,8 616.55,9 4.2,10 18,11 71,13 22,14 46,15 1,16 76,17 32,20 22,21 10,22 4,24 30,25 9,26 1,28 3,29 5,32 41,34 1,35 7,36 0.079,37 6,38 59,39 71.541,40 79.196,41 49.301,42 47.039,43 1.4,44 4.668}
{0 CHEMBL1505490,1 8.073,2 39.6,3 43.8,4 1.013,5 1.125,6 0.674,7 0.643,8 387.5,9 6.3,10 12,11 48,13 15,14 29,16 50,17 19,20 13,21 6,22 3,24 21,25 8,26 1,28 3,29 4,31 1,32 27,35 8.3,36 0.12,37 6,38 38,39 48.643,40 53.989,41 32.335,42 30.852,44 4.676}
{0 CHEMBL1506707,1 9.358,2 50,3 34.6,4 1.014,5 1.096,6 0.754,7 0.721,8 243.3,9 3.8,10 11,11 26,13 13,14 19,16 28,17 13,20 12,21 1,22 2,24 9,25 4,26 1,28 1,29 2,31 1,32 17,35 7.7,36 0.036,37 1,38 26.5,39 26.367,40 28.498,41 19.608,42 18.745,44 4.097}
{0 CHEMBL1507490,1 6.843,2 36.7,3 50,4 0.998,5 1.14,6 0.635,7 0.598,8 410.58,9 10,10 11,11 60,13 13,14 33,16 63,17 22,20 11,21 11,22 2,24 30,25 8,28 6,29 2,32 30,35 3.3,36 0.095,37 6,38 40.5,39 59.869,40 68.391,41 38.08,42 35.88,44 4.668}
{0 CHEMBL151,1 9.234,2 48.4,3 32.3,4 1.045,5 1.107,6 0.695,7 0.707,8 286.25,10 12,11 31,13 14,14 23,16 33,17 15,20 15,22 2,24 10,25 6,29 6,32 21,35 19.4,36 0.03,37 1,38 31,39 32.382,40 34.332,41 21.534,42 21.923,44 4.204}
{0 CHEMBL1528372,1 8.055,2 40.9,3 40.9,4 1.02,5 1.13,6 0.663,7 0.651,8 354.4,9 9.1,10 12,11 44,13 17,14 27,16 45,17 18,20 15,21 3,22 5,24 18,25 8,28 4,29 4,32 26,35 9.1,36 0.178,37 8,38 38,39 44.902,40 49.737,41 29.171,42 28.632,44 4.66}
{0 CHEMBL1528476,1 8.266,2 38.3,3 42.6,4 1.018,5 1.129,6 0.672,7 0.646,8 388.49,9 8.5,10 6,11 47,13 11,14 29,16 49,17 18,20 12,21 6,22 5,24 20,25 9,26 1,28 4,29 4,31 1,32 27,35 8.5,36 0.082,37 4,38 37,39 47.862,40 53.072,41 31.58,42 30.346,44 4.507}
{0 CHEMBL1530900,1 7.924,2 38.3,3 42.6,4 1.024,5 1.135,6 0.647,7 0.636,8 372.42,9 8.5,10 12,11 47,13 15,14 28,16 48,17 18,19 1,20 11,21 6,22 2,24 20,25 9,28 4,29 5,32 27,33 1,35 10.6,36 0.146,37 7,38 38,39 48.113,40 53.362,41 30.387,42 29.874,44 4.155}
{0 CHEMBL1532967,1 8.085,2 49.1,3 39.6,4 1.01,5 1.115,6 0.697,7 0.676,8 428.49,9 3.8,10 18,11 53,13 20,14 37,16 58,17 26,20 20,21 6,22 2,23 1,24 21,25 6,28 2,29 3,32 32,34 1,35 5.7,36 0.017,37 1,38 48,39 53.534,40 59.117,41 36.926,42 35.838,43 1.9,44 4.693}
{0 CHEMBL1538094,1 8.658,2 49,3 37.3,4 1.008,5 1.105,6 0.728,7 0.698,8 441.54,9 5.9,10 22,11 51,13 25,14 36,16 55,17 25,20 23,21 2,22 3,24 19,25 7,26 1,28 3,29 3,31 1,32 32,35 5.9,36 0.091,37 5,38 50,39 51.433,40 56.365,41 37.119,42 35.61,44 4.441}
{0 CHEMBL1565073,1 7.571,2 42.1,3 43.9,4 1.006,5 1.128,6 0.667,7 0.641,8 431.54,9 8.8,10 5,11 57,13 13,14 35,16 60,17 24,19 1,20 15,21 8,22 7,24 25,25 8,28 5,29 3,32 32,33 1,35 5.3,36 0.083,37 5,38 46.5,39 57.327,40 64.272,41 38.006,42 36.519,44 4.66}
{0 CHEMBL1569841,1 9.817,2 43.2,3 40.5,4 1.016,5 1.118,6 0.704,7 0.673,8 363.23,9 5.4,10 12,11 37,13 15,14 23,15 1,16 38,17 16,20 13,21 3,22 3,24 15,25 6,26 1,28 2,29 3,32 22,34 1,35 8.1,36 0.105,37 4,38 32,39 37.6,40 41.373,41 26.057,42 24.9,43 2.7,44 4.496}
{0 CHEMBL1591920,1 6.957,2 40.4,3 49.1,4 1,5 1.127,6 0.644,7 0.61,8 396.53,9 3.5,10 12,11 57,13 15,14 30,16 58,17 23,20 15,21 8,22 3,24 28,25 6,28 2,29 4,32 29,35 7,36 0.138,37 8,38 39,39 57,40 64.232,41 36.728,42 34.75,44 4.684}
{0 CHEMBL1596580,1 7.829,2 40.9,3 45.5,4 1.005,5 1.12,6 0.679,7 0.639,8 344.47,9 4.5,10 16,11 44,13 18,14 26,16 46,17 18,20 13,21 5,22 2,24 20,25 6,26 1,28 2,29 3,31 1,32 24,35 6.8,36 0.109,37 5,38 36,39 44.214,40 49.282,41 29.875,42 28.116,44 4.652}
{0 CHEMBL1606285,1 8.546,2 53.7,3 35.2,4 1.013,5 1.098,6 0.725,7 0.71,8 461.49,9 1.9,10 23,11 54,13 26,14 41,16 60,17 29,20 25,21 4,22 3,24 19,25 6,28 1,29 5,32 35,35 9.3,36 0.067,37 4,38 55.5,39 54.691,40 59.282,41 39.131,42 38.337,44 4.511}
{0 CHEMBL1610035,1 9.151,2 47.6,3 33.3,4 1.041,5 1.129,6 0.691,7 0.699,8 384.36,9 4.8,10 17,11 42,13 21,14 30,16 44,17 20,20 19,21 1,22 4,23 2,24 14,25 8,28 2,29 4,32 28,34 2,35 9.5,36 0.114,37 5,38 42.5,39 43.723,40 47.42,41 29.034,42 29.356,43 4.8,44 4.409}
{0 CHEMBL1704261,1 8.959,2 45.2,3 38.7,4 1.023,5 1.115,6 0.703,7 0.682,8 277.72,9 3.2,10 6,11 31,13 10,14 20,16 32,17 14,18 1,20 11,21 3,22 4,24 12,25 5,26 1,28 1,29 3,32 19,34 1,35 9.7,36 0.094,37 3,38 27,39 31.709,40 34.562,41 21.796,42 21.154,43 3.2,44 4.424}
{0 CHEMBL1706655,1 11.434,2 38.2,3 26.5,4 1.081,5 1.123,6 0.712,7 0.732,8 388.76,9 5.9,10 12,11 34,13 18,14 26,16 35,17 13,18 1,20 12,21 1,22 6,24 9,25 12,26 2,28 2,29 8,31 1,32 25,34 1,35 23.5,36 0.171,37 6,38 38,39 36.757,40 38.197,41 24.199,42 24.883,43 2.9,44 4.38}
{0 CHEMBL1708366,1 8.474,2 39,3 41.5,4 1.021,5 1.126,6 0.678,7 0.654,8 347.43,9 7.3,10 12,11 41,13 15,14 25,16 42,17 16,20 13,21 3,22 3,24 17,25 8,26 1,28 3,29 4,31 1,32 24,35 9.8,36 0.143,37 6,38 34,39 41.876,40 46.159,41 27.813,42 26.798,44 4.644}
{0 CHEMBL1712891,1 8.913,2 43.9,3 36.6,4 1.016,5 1.12,6 0.717,7 0.692,8 365.45,9 12.2,10 22,11 41,13 24,14 29,16 44,17 18,20 17,21 1,22 2,24 15,25 8,26 1,28 5,29 2,31 1,32 26,35 4.9,36 0.091,37 4,38 42,39 41.658,40 45.906,41 29.392,42 28.358,44 4.672}
{0 CHEMBL1717774,1 6.135,2 32.8,3 56.3,4 0.993,5 1.145,6 0.603,7 0.557,8 392.61,9 6.3,10 5,11 64,13 7,14 29,16 65,17 21,20 5,21 16,22 2,24 36,25 7,28 4,29 3,32 28,35 4.7,36 0.138,37 9,38 33.5,39 63.527,40 73.265,41 38.569,42 35.659,44 4.614}
{0 CHEMBL1731805,1 7.668,2 41.5,3 43.9,4 1.014,5 1.126,6 0.657,7 0.637,8 314.37,9 4.9,10 12,11 41,13 15,14 24,16 42,17 17,20 13,21 4,22 3,24 18,25 6,28 2,29 4,32 23,35 9.8,36 0.167,37 7,38 33,39 41.582,40 46.156,41 26.921,42 26.116,44 4.564}
{0 CHEMBL1733083,1 8.41,2 42.9,3 41.1,4 1.022,5 1.121,6 0.678,7 0.66,8 470.94,9 3.6,10 12,11 56,13 15,14 37,16 60,17 24,18 1,20 15,21 9,22 3,24 23,25 9,26 1,28 2,29 6,32 33,34 1,35 10.7,36 0.083,37 5,38 46,39 57.211,40 62.764,41 37.972,42 36.954,43 1.8,44 4.625}
{0 CHEMBL1734112,1 7.938,2 41.8,3 43.6,4 1.005,5 1.122,6 0.685,7 0.649,8 436.58,9 7.3,10 12,11 55,13 16,14 34,16 58,17 23,20 17,21 6,22 4,24 24,25 8,26 1,28 4,29 3,31 1,32 31,35 5.5,36 0.086,37 5,38 44,39 55.302,40 61.693,41 37.648,42 35.685,44 4.483}
{0 CHEMBL175247,1 5.634,2 33,3 60.2,4 0.985,5 1.14,6 0.592,7 0.537,8 495.83,9 1.1,11 88,13 3,14 35,16 88,17 29,20 3,21 26,22 3,24 53,25 6,28 1,29 5,32 35,35 5.7,36 0.261,37 23,38 38,39 86.712,40 100.341,41 52.075,42 47.292,44 6.553}
{0 CHEMBL1834044,1 6.867,2 42.9,3 49,4 0.991,5 1.122,6 0.659,7 0.618,8 336.47,9 4.1,10 12,11 49,13 14,14 27,16 51,17 21,20 14,21 7,22 2,24 24,25 4,28 2,29 2,32 25,35 4.1,36 0.078,37 4,38 35,39 48.578,40 54.983,41 32.296,42 30.267,44 6.319}
{0 CHEMBL1834045,1 6.628,2 41.8,3 50.9,4 0.988,5 1.124,6 0.651,7 0.606,8 364.53,9 3.6,10 12,11 55,13 14,14 29,16 57,17 23,20 14,21 9,22 2,24 28,25 4,28 2,29 2,32 27,35 3.6,36 0.088,37 5,38 37,39 54.345,40 61.813,41 35.819,42 33.321,44 6.377}
{0 CHEMBL1834178,1 6.769,2 40.7,3 50,4 0.992,5 1.128,6 0.649,7 0.608,8 365.52,9 5.6,10 12,11 54,13 14,14 29,16 56,17 22,20 14,21 8,22 2,24 27,25 5,28 3,29 2,32 27,35 3.7,36 0.089,37 5,38 37,39 53.563,40 60.896,41 35.063,42 32.815,44 5.824}
{0 CHEMBL1834179,1 6.74,2 42.3,3 50,4 0.99,5 1.123,6 0.655,7 0.611,8 350.5,9 3.8,10 12,11 52,13 14,14 28,16 54,17 22,20 14,21 8,22 2,24 26,25 4,28 2,29 2,32 26,35 3.8,36 0.093,37 5,38 36,39 51.461,40 58.398,41 34.057,42 31.794,44 6.523}
{0 CHEMBL1834180,1 6.314,2 39.1,3 53.6,4 0.985,5 1.13,6 0.636,7 0.586,8 435.67,9 4.3,10 12,11 69,13 14,14 34,16 71,17 27,20 14,21 13,22 2,24 37,25 5,28 3,29 2,32 32,35 2.9,36 0.141,37 10,38 42,39 67.981,40 77.972,41 43.87,42 40.449,44 5.699}
{0 CHEMBL1834181,1 6.867,2 42.9,3 49,4 0.991,5 1.122,6 0.659,7 0.618,8 336.47,9 4.1,10 12,11 49,13 14,14 27,16 51,17 21,20 14,21 7,22 2,24 24,25 4,28 2,29 2,32 25,35 4.1,36 0.078,37 4,38 35,39 48.578,40 54.983,41 32.296,42 30.267,44 5}
{0 CHEMBL1834182,1 7.101,2 41.8,3 47.3,4 0.996,5 1.127,6 0.66,7 0.624,8 390.53,9 7.3,10 16,11 55,13 18,14 32,16 58,17 23,20 15,21 8,22 2,24 26,25 6,28 4,29 2,32 29,35 3.6,36 0.086,37 5,38 42,39 54.781,40 61.979,41 36.307,42 34.31,44 6.721}
{0 CHEMBL1834183,1 6.975,2 41.4,3 48.3,4 0.994,5 1.127,6 0.656,7 0.618,8 404.56,9 6.9,10 16,11 58,13 18,14 33,16 61,17 24,20 15,21 9,22 2,24 28,25 6,28 4,29 2,32 30,35 3.4,36 0.082,37 5,38 43,39 57.665,40 65.394,41 38.069,42 35.837,44 6.509}
{0 CHEMBL1834184,1 7.25,2 42.6,3 46.3,4 1,5 1.124,6 0.662,7 0.63,8 391.51,9 5.6,10 16,11 54,13 18,14 32,16 57,17 23,20 15,21 8,22 2,24 25,25 6,28 3,29 3,32 29,35 5.6,36 0.088,37 5,38 42,39 54.007,40 60.69,41 35.756,42 34.003,44 7.102}
{0 CHEMBL1834185,1 7.101,2 41.8,3 47.3,4 0.996,5 1.127,6 0.66,7 0.624,8 390.53,9 7.3,10 16,11 55,13 18,14 32,16 58,17 23,20 15,21 8,22 2,24 26,25 6,28 4,29 2,32 29,35 3.6,36 0.086,37 5,38 42,39 54.781,40 61.979,41 36.307,42 34.31,44 6.538}
{0 CHEMBL1834186,1 7.24,2 42.3,3 46.2,4 0.998,5 1.126,6 0.664,7 0.63,8 376.5,9 7.7,10 16,11 52,13 18,14 31,16 55,17 22,20 15,21 7,22 2,24 24,25 6,28 4,29 2,32 28,35 3.8,36 0.073,37 4,38 41,39 51.898,40 58.564,41 34.546,42 32.783,44 5.886}
{0 CHEMBL1834187,1 6.975,2 41.4,3 48.3,4 0.994,5 1.127,6 0.656,7 0.618,8 404.56,9 6.9,10 16,11 58,13 18,14 33,16 61,17 24,20 15,21 9,22 2,24 28,25 6,28 4,29 2,32 30,35 3.4,36 0.082,37 5,38 43,39 57.665,40 65.394,41 38.069,42 35.837,44 5.824}
{0 CHEMBL1834188,1 7.115,2 40.4,3 47.4,4 0.998,5 1.131,6 0.655,7 0.62,8 405.55,9 8.8,10 16,11 57,13 18,14 33,16 60,17 23,20 15,21 8,22 2,24 27,25 7,28 5,29 2,32 30,35 3.5,36 0.083,37 5,38 43,39 56.883,40 64.478,41 37.313,42 35.331,44 6.398}
{0 CHEMBL1834189,1 6.607,2 38.9,3 51.4,4 0.99,5 1.133,6 0.641,7 0.597,8 475.7,9 6.9,10 16,11 72,13 18,14 38,16 75,17 28,20 15,21 13,22 2,24 37,25 7,28 5,29 2,32 35,35 2.8,36 0.133,37 10,38 48,39 71.301,40 81.554,41 46.12,42 42.965,44 6.155}
{0 CHEMBL1834190,1 6.993,2 40,3 48.3,4 0.996,5 1.132,6 0.651,7 0.614,8 419.58,9 8.3,10 16,11 60,13 18,14 34,16 63,17 24,20 15,21 9,22 2,24 29,25 7,28 5,29 2,32 31,35 3.3,36 0.079,37 5,38 44,39 59.767,40 67.893,41 39.074,42 36.858,44 5.854}
{0 CHEMBL1834191,1 6.53,2 38.7,3 52,4 0.989,5 1.133,6 0.638,7 0.593,8 489.73,9 6.7,10 16,11 75,13 18,14 39,16 78,17 29,20 15,21 14,22 2,24 39,25 7,28 5,29 2,32 36,35 2.7,36 0.128,37 10,38 49,39 74.185,40 84.969,41 47.881,42 44.492,44 5.62}
{0 CHEMBL1834192,1 7.402,2 43.1,3 45.1,4 1.002,5 1.123,6 0.667,7 0.637,8 377.48,9 5.9,10 16,11 51,13 18,14 31,16 54,17 22,20 15,21 7,22 2,24 23,25 6,28 3,29 3,32 28,35 5.9,36 0.074,37 4,38 41,39 51.123,40 57.275,41 33.995,42 32.477,44 6.699}
{0 CHEMBL1834193,1 7.115,2 42.1,3 47.4,4 0.998,5 1.125,6 0.658,7 0.623,8 405.54,9 5.3,10 16,11 57,13 18,14 33,16 60,17 24,20 15,21 9,22 2,24 27,25 6,28 3,29 3,32 30,35 5.3,36 0.1,37 6,38 43,39 56.891,40 64.106,41 37.517,42 35.53,44 6.377}
{0 CHEMBL1834194,1 8.107,2 43.1,3 41.2,4 1.023,5 1.136,6 0.664,7 0.652,8 413.46,9 5.9,10 16,11 51,13 18,14 33,16 54,17 22,20 15,21 7,22 2,23 2,24 21,25 8,28 3,29 3,32 30,34 2,35 5.9,36 0.074,37 4,38 43,39 52.149,40 57.955,41 33.87,42 33.243,43 3.9,44 6.569}
{0 CHEMBL1834195,1 7.409,2 41.8,3 45.5,4 1.006,5 1.125,6 0.658,7 0.631,8 407.51,9 5.5,10 16,11 55,13 18,14 33,16 58,17 23,20 15,21 8,22 2,24 25,25 7,28 3,29 4,32 30,35 7.3,36 0.103,37 6,38 43,39 55.334,40 61.9,41 36.211,42 34.718,44 6.041}
{0 CHEMBL1834196,1 7.259,2 41.1,3 46.4,4 1.002,5 1.128,6 0.656,7 0.625,8 406.53,9 7.1,10 16,11 56,13 18,14 33,16 59,17 23,20 15,21 8,22 2,24 26,25 7,28 4,29 3,32 30,35 5.4,36 0.085,37 5,38 43,39 56.109,40 63.189,41 36.762,42 35.025,44 6.276}
{0 CHEMBL1834197,1 7.259,2 41.1,3 46.4,4 1.002,5 1.128,6 0.656,7 0.625,8 406.53,9 7.1,10 16,11 56,13 18,14 33,16 59,17 23,20 15,21 8,22 2,24 26,25 7,28 4,29 3,32 30,35 5.4,36 0.068,37 4,38 43,39 56.109,40 63.189,41 36.762,42 35.025,44 6.553}
{0 CHEMBL1834198,1 6.714,2 39.4,3 50.7,4 0.993,5 1.13,6 0.642,7 0.601,8 476.68,9 5.6,10 16,11 71,13 18,14 38,16 74,17 28,20 15,21 13,22 2,24 36,25 7,28 4,29 3,32 35,35 4.2,36 0.135,37 10,38 48,39 70.527,40 80.265,41 45.569,42 42.659,44 6.237}
{0 CHEMBL1834199,1 7.25,2 42.6,3 46.3,4 1,5 1.124,6 0.662,7 0.63,8 391.51,9 5.6,10 16,11 54,13 18,14 32,16 57,17 23,20 15,21 8,22 2,24 25,25 6,28 3,29 3,32 29,35 5.6,36 0.088,37 5,38 42,39 54.007,40 60.69,41 35.756,42 34.003,44 5.523}
{0 CHEMBL187265,1 9.637,2 48.1,3 29.6,4 1.055,5 1.108,6 0.695,7 0.718,8 260.21,10 12,11 27,13 13,14 21,16 29,17 13,20 13,22 1,24 8,25 6,29 6,32 19,35 22.2,38 28,39 28.498,40 29.917,41 18.773,42 19.396,44 4.748}
{0 CHEMBL1872669,1 9.996,2 44.2,3 38.5,4 1.024,5 1.115,6 0.714,7 0.687,8 519.8,9 3.8,10 12,11 52,13 15,14 36,15 1,16 56,17 23,18 1,20 15,21 8,22 3,24 20,25 9,26 2,28 2,29 5,32 32,34 2,35 9.6,36 0.071,37 4,38 45,39 53.229,40 57.981,41 37.108,42 35.737,43 3.8,44 4.64}
{0 CHEMBL1877535,1 10.006,2 38.2,3 41.2,4 1.024,5 1.131,6 0.685,7 0.659,8 340.2,9 8.8,10 11,11 34,13 13,14 21,15 1,16 35,17 13,20 9,21 4,22 2,24 14,25 7,26 1,28 3,29 3,32 20,34 1,35 8.8,36 0.143,37 5,38 28.5,39 34.818,40 38.456,41 23.301,42 22.395,43 2.9,44 4.609}
{0 CHEMBL1881887,1 7.942,2 40,3 42.2,4 1.022,5 1.13,6 0.653,7 0.641,8 357.4,9 6.7,10 6,11 45,13 12,14 28,16 47,17 18,20 11,21 7,22 6,24 19,25 8,28 3,29 5,32 26,35 11.1,36 0.128,37 6,38 37,39 46.011,40 50.864,41 29.381,42 28.853,44 4.68}
{0 CHEMBL1891935,1 6.473,2 38.9,3 52.6,4 0.99,5 1.13,6 0.635,7 0.59,8 614.91,9 4.2,10 10,11 95,13 14,14 51,16 101,17 37,20 13,21 24,22 4,24 50,25 8,28 4,29 4,32 45,35 4.2,36 0.089,37 9,38 60,39 94.039,40 107.38,41 60.353,42 56.061,44 4.555}
{0 CHEMBL1964702,1 10.232,2 40.6,3 34.4,4 1.038,5 1.134,6 0.733,7 0.705,8 327.41,9 9.4,10 11,11 32,13 13,14 22,16 33,17 13,20 12,21 1,22 2,23 2,24 11,25 8,26 2,28 3,29 1,31 2,32 21,34 2,35 3.1,36 0.121,37 4,38 29.5,39 33.229,40 36.3,41 23.449,42 22.554,43 6.3,44 4.097}
{0 CHEMBL2005551,1 8.551,2 39.6,3 37.5,4 1.032,5 1.136,6 0.664,7 0.664,8 410.43,9 12.5,10 17,11 48,13 22,14 32,16 50,17 19,20 16,21 3,22 5,24 18,25 11,28 6,29 5,32 30,35 10.4,36 0.12,37 6,38 45.5,39 49.549,40 54.528,41 31.875,42 31.863,44 4.378}
{0 CHEMBL209576,1 9.011,2 45.7,3 37.1,4 1.023,5 1.107,6 0.715,7 0.692,8 315.37,9 2.9,10 17,11 35,13 19,14 24,16 37,17 16,20 15,21 1,22 2,24 13,25 6,26 1,28 1,29 4,31 1,32 22,35 11.4,36 0.054,37 2,38 34.5,39 35.789,40 38.747,41 25.04,42 24.229,44 4.824}
{0 CHEMBL209582,1 10.553,2 45.7,3 28.6,4 1.066,5 1.136,6 0.71,7 0.725,8 369.34,9 2.9,10 17,11 35,13 19,14 27,16 37,17 16,20 15,21 1,22 2,23 3,24 10,25 9,26 1,28 1,29 4,31 1,32 25,34 3,35 11.4,36 0.054,37 2,38 37.5,39 37.327,40 39.766,41 24.852,42 25.378,43 8.6,44 4.824}
{0 CHEMBL209656,1 9.891,2 53.3,3 30,4 1.024,5 1.101,6 0.761,7 0.747,8 296.72,9 6.7,10 17,11 30,13 18,14 23,16 32,17 16,18 1,19 1,20 15,24 9,25 5,26 1,28 2,29 2,32 21,33 1,34 1,35 6.7,36 0.031,37 1,38 33.5,39 30.716,40 33.02,41 22.824,42 22.407,43 3.3,44 6.396}
{0 CHEMBL209897,1 9.54,2 50,3 31.3,4 1.05,5 1.138,6 0.697,7 0.711,8 305.27,9 3.1,10 17,11 32,13 17,14 24,16 34,17 16,20 15,21 1,23 3,24 10,25 6,28 1,29 2,32 22,34 3,35 6.3,36 0.029,37 1,38 32.5,39 33.596,40 36.427,41 22.296,42 22.762,43 9.4,44 4.824}
{0 CHEMBL211799,1 8.665,2 50,3 37.5,4 1.007,5 1.108,6 0.727,7 0.699,8 415.9,9 6.3,10 23,11 48,13 24,14 33,16 51,17 24,18 1,19 1,20 21,21 2,24 18,25 6,26 1,28 3,29 2,32 30,33 1,34 1,35 4.2,36 0.098,37 5,38 46.5,39 48.353,40 53.179,41 34.875,42 33.536,43 2.1,44 4.824}
{0 CHEMBL212973,1 10.191,2 56.7,3 26.7,4 1.02,5 1.096,6 0.787,7 0.773,8 305.73,9 10,10 17,11 30,13 19,14 24,16 32,17 17,18 1,19 2,20 15,24 8,25 5,26 1,28 3,29 1,32 22,33 2,34 1,35 3.3,36 0.031,37 1,38 36.5,39 30.607,40 32.894,41 23.614,42 23.187,43 3.3,44 4.824}
{0 CHEMBL2130899,1 7.499,2 39.4,3 46.8,4 1.008,5 1.127,6 0.655,7 0.623,8 704.92,9 4.3,10 12,11 94,13 19,14 55,16 99,17 37,19 2,20 16,21 19,22 6,24 44,25 13,26 1,28 4,29 8,31 1,32 50,33 1,35 8.5,36 0.121,37 12,38 69,39 94.774,40 105.892,41 61.534,42 58.527,44 4.481}
{0 CHEMBL213124,1 7.331,2 39,3 47.5,4 1.017,5 1.127,6 0.632,7 0.612,8 432.51,10 12,11 59,13 14,14 32,16 60,17 23,20 14,21 9,22 2,24 28,25 8,29 8,32 31,35 13.6,36 0.133,37 8,38 40,39 59.989,40 66.488,41 37.296,42 36.094,44 4.595}
{0 CHEMBL213299,1 8.743,2 53.3,3 33.3,4 1.013,5 1.103,6 0.732,7 0.719,8 262.28,9 6.7,10 17,11 30,13 18,14 22,16 32,17 16,19 1,20 15,24 10,25 4,28 2,29 2,32 20,33 1,35 6.7,36 0.031,37 1,38 32.5,39 30.393,40 33.076,41 21.966,42 21.58,44 5.888}
{0 CHEMBL213384,1 7.473,2 39.3,3 46.4,4 1.02,5 1.126,6 0.635,7 0.617,8 418.48,10 6,11 56,13 11,14 31,16 57,17 22,20 13,21 9,22 5,24 26,25 8,29 8,32 30,35 14.3,36 0.105,37 6,38 39,39 57.105,40 63.073,41 35.534,42 34.567,44 4.542}
{0 CHEMBL2134278,1 8.661,2 33.9,3 44.1,4 1.036,5 1.154,6 0.645,7 0.626,8 511.02,9 6.8,10 6,11 59,13 10,14 35,16 61,17 20,18 1,20 8,21 12,22 4,23 3,24 26,25 13,26 2,28 4,29 4,31 1,32 33,34 4,35 6.8,36 0.082,37 5,38 42,39 61.141,40 68.112,41 38.057,42 36.958,43 6.8,44 4.431}
{0 CHEMBL213433,1 7.331,2 39,3 47.5,4 1.017,5 1.127,6 0.632,7 0.612,8 432.51,10 6,11 59,13 11,14 32,16 60,17 23,20 13,21 10,22 5,24 28,25 8,29 8,32 31,35 13.6,36 0.117,37 7,38 40,39 59.989,40 66.488,41 37.296,42 36.094,44 4.636}
{0 CHEMBL213458,1 9.891,2 53.3,3 30,4 1.024,5 1.101,6 0.761,7 0.747,8 296.72,9 6.7,10 17,11 30,13 18,14 23,16 32,17 16,18 1,19 1,20 15,24 9,25 5,26 1,28 2,29 2,32 21,33 1,34 1,35 6.7,36 0.031,37 1,38 33.5,39 30.716,40 33.02,41 22.824,42 22.407,43 3.3,44 6.866}
{0 CHEMBL213583,1 10.22,2 55,3 27.5,4 1.038,5 1.113,6 0.756,7 0.756,8 408.8,9 5,10 23,11 40,13 24,14 32,16 43,17 22,18 1,19 1,20 21,23 2,24 11,25 7,26 1,28 2,29 2,32 29,33 1,34 3,35 5,36 0.047,37 2,38 45.5,39 41.509,40 44.53,41 30.222,42 30.227,43 7.5,44 7.167}
{0 CHEMBL213634,1 9.156,2 52.3,3 34.1,4 1.016,5 1.102,6 0.74,7 0.721,8 402.85,9 4.5,10 23,11 44,13 24,14 32,16 47,17 23,18 1,19 1,20 21,21 1,24 15,25 6,26 1,28 2,29 3,32 29,33 1,34 1,35 6.8,36 0.064,37 3,38 45.5,39 44.694,40 48.475,41 32.563,42 31.702,43 2.3,44 7.721}
{0 CHEMBL213635,1 9.42,2 50,3 32.5,4 1.02,5 1.111,6 0.74,7 0.724,8 376.82,9 10,10 22,11 40,13 23,14 30,16 43,17 20,18 1,19 1,20 18,21 1,24 13,25 7,26 1,28 4,29 2,32 27,33 1,34 1,35 5,36 0.047,37 2,38 43,39 40.804,40 44.432,41 29.597,42 28.977,43 2.5,44 6.134}
{0 CHEMBL2137386,1 8.184,2 47.8,3 40.6,4 1.006,5 1.107,6 0.708,7 0.676,8 564.7,9 2.9,10 23,11 69,13 28,14 47,16 75,17 33,20 25,21 8,22 5,24 28,25 8,26 1,28 2,29 5,31 1,32 41,35 7.2,36 0.053,37 4,38 63.5,39 69.403,40 76.361,41 48.83,42 46.652,44 4.666}
{0 CHEMBL213968,1 7.086,2 38.5,3 49.2,4 1.012,5 1.128,6 0.628,7 0.602,8 460.57,10 6,11 65,13 11,14 34,16 66,17 25,20 13,21 12,22 5,24 32,25 8,29 8,32 33,35 12.3,36 0.136,37 9,38 42,39 65.756,40 73.318,41 40.818,42 39.147,44 4.487}
{0 CHEMBL214037,1 9.77,2 55,3 30,4 1.025,5 1.105,6 0.757,7 0.746,8 390.81,9 5,10 23,11 40,13 24,14 31,16 43,17 22,18 1,19 1,20 21,23 1,24 12,25 6,26 1,28 2,29 2,32 28,33 1,34 2,35 5,36 0.047,37 2,38 44.5,39 40.996,40 44.19,41 30.284,42 29.844,43 5,44 7.268}
{0 CHEMBL2140511,1 6.515,2 38.4,3 52.5,4 0.992,5 1.131,6 0.632,7 0.589,8 644.94,9 4,10 10,11 99,13 14,14 53,16 105,17 38,20 13,21 25,22 4,24 52,25 9,28 4,29 5,32 47,35 5.1,36 0.095,37 10,38 62,39 98.25,40 112.005,41 62.569,42 58.303,44 4.223}
{0 CHEMBL214093,1 8.77,2 52.3,3 36.4,4 1.003,5 1.104,6 0.742,7 0.711,8 385.87,9 6.8,10 23,11 44,13 24,14 31,16 47,17 23,18 1,19 1,20 21,21 1,24 16,25 5,26 1,28 3,29 1,32 28,33 1,34 1,35 2.3,36 0.085,37 4,38 44.5,39 44.142,40 48.555,41 32.659,42 31.294,43 2.3,44 4.824}
{0 CHEMBL214119,1 7.331,2 39,3 47.5,4 1.017,5 1.127,6 0.632,7 0.612,8 432.51,11 59,13 8,14 32,16 60,17 23,20 12,21 11,22 8,24 28,25 8,29 8,32 31,35 13.6,36 0.1,37 6,38 40,39 59.989,40 66.488,41 37.296,42 36.094,44 4.22}
{0 CHEMBL214361,1 10.868,2 55.2,3 27.6,4 1.025,5 1.095,6 0.801,7 0.777,8 315.16,9 6.9,10 17,11 29,13 18,14 23,16 31,17 16,18 2,19 1,20 15,24 8,25 5,26 2,28 2,29 1,32 21,33 1,34 2,35 3.4,36 0.032,37 1,38 33.5,39 29.713,40 31.755,41 23.227,42 22.52,43 6.9,44 4.824}
{0 CHEMBL214690,1 7.009,2 37.5,3 50,4 1.012,5 1.13,6 0.622,7 0.596,8 224.28,10 6,11 32,13 7,14 16,16 32,17 12,20 7,21 5,22 1,24 16,25 4,29 4,32 16,35 12.5,36 0.125,37 4,38 20,39 32.378,40 36.159,41 19.909,42 19.074,44 4.309}
{0 CHEMBL2147031,1 7.838,2 41.4,3 44.8,4 1.009,5 1.12,6 0.674,7 0.64,8 454.59,9 3.4,10 16,11 58,13 19,14 36,16 62,17 24,20 15,21 9,22 3,24 26,25 8,26 1,28 2,29 5,31 1,32 32,35 8.6,36 0.065,37 4,38 47,39 58.52,40 64.946,41 39.068,42 37.125,44 6.6}
{0 CHEMBL2147032,1 7.83,2 42.6,3 44.3,4 1.005,5 1.119,6 0.682,7 0.646,8 477.63,9 4.9,10 17,11 61,13 20,14 39,16 66,17 26,20 16,21 10,22 3,24 27,25 8,26 1,28 3,29 4,31 1,32 34,35 6.6,36 0.061,37 4,38 50.5,39 61.294,40 68.235,41 41.62,42 39.432,44 8}
{0 CHEMBL2147033,1 7.83,2 42.6,3 44.3,4 1.005,5 1.119,6 0.682,7 0.646,8 477.63,9 4.9,10 17,11 61,13 20,14 39,16 66,17 26,20 16,21 10,22 3,24 27,25 8,26 1,28 3,29 4,31 1,32 34,35 6.6,36 0.061,37 4,38 50.5,39 61.294,40 68.235,41 41.62,42 39.432,44 8.222}
{0 CHEMBL214860,1 7.631,2 39.6,3 45.3,4 1.023,5 1.126,6 0.637,7 0.623,8 404.45,10 6,11 53,13 11,14 30,16 54,17 21,20 13,21 8,22 5,24 24,25 8,29 8,32 29,35 15.1,36 0.111,37 6,38 38,39 54.222,40 59.658,41 33.773,42 33.04,44 4.527}
{0 CHEMBL215910,1 10.412,2 47.2,3 30.6,4 1.037,5 1.105,6 0.754,7 0.738,8 374.82,9 5.6,10 17,11 36,13 20,14 27,16 38,17 17,18 1,19 1,20 15,21 1,22 2,24 11,25 8,26 2,28 2,29 4,31 1,32 25,33 1,34 1,35 11.1,36 0.053,37 2,38 39.5,39 37.331,40 39.774,41 27.142,42 26.551,43 2.8,44 5.38}
{0 CHEMBL2165265,1 9.244,2 38.3,3 36.7,4 1.03,5 1.13,6 0.699,7 0.68,8 554.67,9 13.3,10 24,11 60,13 29,14 41,16 63,17 23,20 21,21 2,22 5,24 22,25 15,26 2,28 8,29 5,31 2,32 38,35 8.3,36 0.127,37 8,38 58,39 61.789,40 67.78,41 41.943,42 40.807,44 7.801}
{0 CHEMBL2165266,1 8.222,2 48.9,3 38.3,4 1.012,5 1.11,6 0.7,7 0.683,8 386.43,9 4.3,10 17,11 47,13 21,14 32,16 50,17 23,20 21,21 2,22 4,24 18,25 6,28 2,29 4,32 29,35 8.5,36 0.06,37 3,38 44.5,39 47.582,40 52.156,41 32.921,42 32.116,44 6.42}
{0 CHEMBL2165409,1 6.972,2 30,3 51.1,4 1.017,5 1.153,6 0.596,7 0.574,8 1324.71,9 8.9,11 190,13 16,14 94,16 191,17 57,20 16,21 41,22 16,24 97,25 36,28 17,29 19,32 93,35 10,36 0.225,37 43,38 110,39 193.293,40 219.058,41 113.188,42 109.017,44 5}
{0 CHEMBL2165410,1 7.605,2 29.2,3 46.9,4 1.034,5 1.155,6 0.596,7 0.591,8 1848.09,9 9.9,11 243,13 27,14 128,16 242,17 71,20 27,21 44,22 27,24 114,25 58,28 24,29 34,32 129,35 14,36 0.289,37 70,38 155,39 251.333,40 280.763,41 144.853,42 143.523,44 4.959}
{0 CHEMBL2165413,1 7.009,2 47.4,3 47.4,4 0.99,5 1.109,6 0.678,7 0.636,8 266.36,10 12,11 38,13 13,14 22,16 40,17 18,20 13,21 5,22 1,24 18,25 2,29 2,32 20,35 5.3,36 0.125,37 5,38 29,39 37.607,40 42.156,41 25.762,42 24.171,44 5.602}
{0 CHEMBL2322357,1 7.26,2 44.1,3 45.6,4 0.995,5 1.122,6 0.674,7 0.638,8 493.66,9 7.4,10 18,11 68,13 21,14 41,16 72,17 30,19 1,20 19,21 10,22 2,24 31,25 7,28 5,29 2,32 37,33 1,35 2.9,36 0.069,37 5,38 54,39 67.65,40 76.308,41 45.836,42 43.385,44 7.301}
{0 CHEMBL2322358,1 7.26,2 44.1,3 45.6,4 0.995,5 1.122,6 0.674,7 0.638,8 493.66,9 7.4,10 18,11 68,13 21,14 41,16 72,17 30,19 1,20 19,21 10,22 2,24 31,25 7,28 5,29 2,32 37,33 1,35 2.9,36 0.069,37 5,38 54,39 67.65,40 76.308,41 45.836,42 43.385,44 7.456}
{0 CHEMBL2322359,1 7.16,2 42.5,3 46.6,4 0.995,5 1.126,6 0.666,7 0.629,8 522.71,9 8.2,10 22,11 73,13 24,14 43,16 77,17 31,19 1,20 19,21 11,22 1,24 34,25 8,28 6,29 2,32 39,33 1,35 2.7,36 0.091,37 7,38 57,39 72.636,40 82.221,41 48.603,42 45.933,44 7.222}
{0 CHEMBL2322360,1 7.21,2 44.3,3 45.7,4 0.992,5 1.123,6 0.677,7 0.638,8 504.69,9 8.6,10 22,11 70,13 24,14 43,16 75,17 31,19 1,20 19,21 11,22 1,24 32,25 7,28 6,29 1,32 38,33 1,35 1.4,36 0.053,37 4,38 57,39 69.425,40 78.597,41 47.387,42 44.692,44 7.846}
{0 CHEMBL2322361,1 7.447,2 45.3,3 43.8,4 0.995,5 1.121,6 0.685,7 0.651,8 476.63,9 9.4,10 22,11 64,13 24,14 41,16 69,17 29,19 1,20 19,21 9,22 1,24 28,25 7,28 6,29 1,32 36,33 1,35 1.6,36 0.058,37 4,38 55,39 63.658,40 71.766,41 43.864,42 41.638,44 7.347}
{0 CHEMBL2322362,1 8.026,2 43.8,3 42.2,4 1.004,5 1.119,6 0.694,7 0.66,8 513.67,9 7.8,10 22,11 64,13 26,14 41,16 68,17 28,19 1,20 19,21 8,22 3,24 27,25 9,26 1,28 5,29 3,31 1,32 37,33 1,35 4.7,36 0.059,37 4,38 57,39 64.287,40 71.607,41 44.415,42 42.233,44 7.071}
{0 CHEMBL2322363,1 8.026,2 43.8,3 42.2,4 1.004,5 1.119,6 0.694,7 0.66,8 513.67,9 7.8,10 22,11 64,13 26,14 41,16 68,17 28,19 1,20 19,21 8,22 3,24 27,25 9,26 1,28 5,29 3,31 1,32 37,33 1,35 4.7,36 0.059,37 4,38 57,39 64.287,40 71.607,41 44.415,42 42.233,44 7.155}
{0 CHEMBL2322364,1 7.323,2 44.8,3 44.8,4 0.993,5 1.122,6 0.681,7 0.644,8 490.66,9 9,10 22,11 67,13 24,14 42,16 72,17 30,19 1,20 19,21 10,22 1,24 30,25 7,28 6,29 1,32 37,33 1,35 1.5,36 0.056,37 4,38 56,39 66.541,40 75.182,41 45.625,42 43.165,44 7.155}
{0 CHEMBL2322365,1 7.323,2 44.8,3 44.8,4 0.993,5 1.122,6 0.681,7 0.644,8 490.66,9 9,10 22,11 67,13 24,14 42,16 72,17 30,19 1,20 19,21 10,22 1,24 30,25 7,28 6,29 1,32 37,33 1,35 1.5,36 0.056,37 4,38 56,39 66.541,40 75.182,41 45.625,42 43.165,44 6.319}
{0 CHEMBL2322366,1 7.579,2 44.6,3 43.1,4 1,5 1.123,6 0.682,7 0.652,8 492.63,9 9.2,10 22,11 65,13 24,14 42,16 70,17 29,19 1,20 19,21 9,22 1,24 28,25 8,28 6,29 2,32 37,33 1,35 3.1,36 0.057,37 4,38 56,39 64.985,40 72.976,41 44.319,42 42.353,44 6.523}
{0 CHEMBL2322367,1 7.218,2 43.1,3 45.8,4 0.993,5 1.126,6 0.672,7 0.635,8 519.71,9 9.7,10 22,11 72,13 24,14 44,16 77,17 31,19 1,20 19,21 11,22 1,24 33,25 8,28 7,29 1,32 39,33 1,35 1.4,36 0.052,37 4,38 58,39 71.527,40 81.095,41 48.393,42 45.713,44 6.004}
{0 CHEMBL2322368,1 7.117,2 42.7,3 46.7,4 0.992,5 1.127,6 0.669,7 0.63,8 533.74,9 9.3,10 22,11 75,13 24,14 45,16 80,17 32,19 1,20 19,21 12,22 1,24 35,25 8,28 7,29 1,32 40,33 1,35 1.3,36 0.05,37 4,38 59,39 74.41,40 84.51,41 50.154,42 47.24,44 6.367}
{0 CHEMBL2322369,1 7.218,2 43.1,3 45.8,4 0.993,5 1.126,6 0.672,7 0.635,8 519.71,9 9.7,10 22,11 72,13 24,14 44,16 77,17 31,19 1,20 19,21 11,22 1,24 33,25 8,28 7,29 1,32 39,33 1,35 1.4,36 0.052,37 4,38 58,39 71.527,40 81.095,41 48.393,42 45.713,44 6.06}
{0 CHEMBL2322370,1 7.334,2 43.7,3 45.1,4 0.997,5 1.124,6 0.674,7 0.64,8 520.69,9 8.5,10 22,11 71,13 24,14 44,16 76,17 31,19 1,20 19,21 11,22 1,24 32,25 8,28 6,29 2,32 39,33 1,35 2.8,36 0.053,37 4,38 58,39 70.752,40 79.806,41 47.841,42 45.406,44 7.398}
{0 CHEMBL2322371,1 7.323,2 44.8,3 44.8,4 0.993,5 1.122,6 0.681,7 0.644,8 490.66,9 9,10 22,11 67,13 24,14 42,16 72,17 30,19 1,20 19,21 10,22 1,24 30,25 7,28 6,29 1,32 37,33 1,35 1.5,36 0.056,37 4,38 56,39 66.541,40 75.182,41 45.625,42 43.165,44 6.971}
{0 CHEMBL2322372,1 7.447,2 45.3,3 43.8,4 0.995,5 1.121,6 0.685,7 0.651,8 476.63,9 9.4,10 22,11 64,13 24,14 41,16 69,17 29,19 1,20 19,21 9,22 1,24 28,25 7,28 6,29 1,32 36,33 1,35 1.6,36 0.058,37 4,38 55,39 63.658,40 71.766,41 43.864,42 41.638,44 6.886}
{0 CHEMBL2322373,1 7.323,2 44.8,3 44.8,4 0.993,5 1.122,6 0.681,7 0.644,8 490.66,9 9,10 22,11 67,13 24,14 42,16 72,17 30,19 1,20 19,21 10,22 1,24 30,25 7,28 6,29 1,32 37,33 1,35 1.5,36 0.056,37 4,38 56,39 66.541,40 75.182,41 45.625,42 43.165,44 4.301}
{0 CHEMBL2322374,1 7.323,2 44.8,3 44.8,4 0.993,5 1.122,6 0.681,7 0.644,8 490.66,9 9,10 22,11 67,13 24,14 42,16 72,17 30,19 1,20 19,21 10,22 1,24 30,25 7,28 6,29 1,32 37,33 1,35 1.5,36 0.056,37 4,38 56,39 66.541,40 75.182,41 45.625,42 43.165,44 7.222}
{0 CHEMBL2322375,1 7.323,2 44.8,3 44.8,4 0.993,5 1.122,6 0.681,7 0.644,8 490.66,9 9,10 22,11 67,13 24,14 42,16 72,17 30,19 1,20 19,21 10,22 1,24 30,25 7,28 6,29 1,32 37,33 1,35 1.5,36 0.056,37 4,38 56,39 66.541,40 75.182,41 45.625,42 43.165,44 4.301}
{0 CHEMBL2322376,1 7.664,2 47.3,3 41.8,4 0.996,5 1.117,6 0.697,7 0.665,8 421.54,9 9.1,10 22,11 55,13 24,14 36,16 59,17 26,19 1,20 19,21 6,22 1,24 23,25 6,28 5,29 1,32 32,33 1,35 1.8,36 0.051,37 3,38 50,39 54.789,40 61.438,41 38.336,42 36.563,44 6.229}
{0 CHEMBL2322659,1 7.51,2 48.2,3 42.9,4 0.992,5 1.113,6 0.698,7 0.662,8 420.55,9 7.1,10 22,11 56,13 24,14 36,16 60,17 27,19 1,20 20,21 6,22 1,24 24,25 5,28 4,29 1,32 32,33 1,35 1.8,36 0.05,37 3,38 50,39 55.571,40 62.355,41 39.091,42 37.068,44 6.009}
{0 CHEMBL251750,1 7.852,2 40,3 48,4 1.001,5 1.113,6 0.685,7 0.631,8 196.29,11 25,13 4,14 13,16 25,17 10,20 7,21 3,22 4,24 12,25 3,26 1,29 2,31 1,32 13,35 8,36 0.08,37 2,38 17,39 25.033,40 27.83,41 17.125,42 15.778,44 4.014}
{0 CHEMBL260553,1 7.481,2 43.4,3 45.3,4 1.011,5 1.118,6 0.658,7 0.634,8 396.47,10 12,11 53,13 15,14 31,16 55,17 23,20 17,21 6,22 3,24 24,25 6,29 6,32 29,35 11.3,36 0.073,37 4,38 40,39 53.567,40 59.239,41 34.864,42 33.61,44 5.907}
{0 CHEMBL261706,1 7.195,2 42.4,3 47.5,4 1.006,5 1.12,6 0.651,7 0.621,8 424.53,10 12,11 59,13 15,14 33,16 61,17 25,20 17,21 8,22 3,24 28,25 6,29 6,32 31,35 10.2,36 0.098,37 6,38 42,39 59.334,40 66.069,41 38.387,42 36.664,44 4.605}
{0 CHEMBL294009,1 8.509,2 53.6,3 35.7,4 1.014,5 1.097,6 0.72,7 0.706,8 238.25,10 12,11 28,13 14,14 20,16 30,17 15,20 15,22 2,24 10,25 3,29 3,32 18,35 10.7,36 0.033,37 1,38 28,39 28.4,40 30.704,41 20.171,42 19.778,44 4}
{0 CHEMBL297453,1 8.988,2 43.1,3 35.3,4 1.05,5 1.118,6 0.664,7 0.679,8 458.4,10 18,11 51,13 19,14 36,16 54,17 22,20 19,21 3,22 1,24 18,25 11,29 11,32 33,35 21.6,36 0.074,37 4,38 46,39 53.553,40 57.04,41 33.852,42 34.604,44 4.284}
{0 CHEMBL323197,1 7.33,2 42.9,3 46.4,4 1.008,5 1.119,6 0.654,7 0.627,8 410.5,10 12,11 56,13 15,14 32,16 58,17 24,20 17,21 7,22 3,24 26,25 6,29 6,32 30,35 10.7,36 0.086,37 5,38 41,39 56.451,40 62.654,41 36.625,42 35.137,44 5.256}
{0 CHEMBL361025,1 9.393,2 50,3 30.8,4 1.045,5 1.104,6 0.705,7 0.719,8 244.21,10 12,11 26,13 13,14 20,16 28,17 13,20 13,22 1,24 8,25 5,29 5,32 18,35 19.2,38 27,39 27.171,40 28.708,41 18.318,42 18.681,44 4.387}
{0 CHEMBL373985,1 10.22,2 55,3 27.5,4 1.038,5 1.113,6 0.756,7 0.756,8 408.8,9 5,10 23,11 40,13 24,14 32,16 43,17 22,18 1,19 1,20 21,23 2,24 11,25 7,26 1,28 2,29 2,32 29,33 1,34 3,35 5,36 0.047,37 2,38 45.5,39 41.509,40 44.53,41 30.222,42 30.227,43 7.5,44 6.138}
{0 CHEMBL375390,1 9.32,2 55,3 32.5,4 1.012,5 1.096,6 0.759,7 0.737,8 372.82,9 5,10 23,11 40,13 24,14 30,16 43,17 22,18 1,19 1,20 21,24 13,25 5,26 1,28 2,29 2,32 27,33 1,34 1,35 5,36 0.047,37 2,38 43.5,39 40.484,40 43.851,41 30.347,42 29.461,43 2.5,44 7.284}
{0 CHEMBL376206,1 9.585,2 53.8,3 30.8,4 1.018,5 1.101,6 0.759,7 0.742,8 373.81,9 7.7,10 23,11 39,13 24,14 30,16 42,17 21,18 1,19 1,20 20,24 12,25 6,26 1,28 3,29 2,32 27,33 1,34 1,35 5.1,36 0.048,37 2,38 43.5,39 39.702,40 42.934,41 29.591,42 28.955,43 2.6,44 6.712}
{0 CHEMBL377474,1 7.551,2 39.8,3 45.8,4 1.021,5 1.125,6 0.638,7 0.622,8 626.71,10 6,11 83,13 15,14 47,16 85,17 33,20 19,21 14,22 9,24 38,25 12,29 12,32 45,35 14.5,36 0.118,37 10,38 59,39 84.716,40 93.402,41 52.921,42 51.587,44 4.509}
{0 CHEMBL377865,1 9.975,2 55.8,3 30.2,4 1.013,5 1.088,6 0.791,7 0.759,8 428.91,9 4.7,10 27,11 43,13 28,14 34,16 47,17 24,18 1,19 1,20 23,24 13,25 6,26 2,28 2,29 2,31 1,32 30,33 1,34 1,35 4.7,36 0.043,37 2,38 49.5,39 43.56,40 46.771,41 33.994,42 32.648,43 2.3,44 6.996}
{0 CHEMBL380035,1 10.216,2 48.4,3 29,4 1.044,5 1.111,6 0.733,7 0.737,8 316.71,9 6.5,10 17,11 31,13 19,14 24,16 33,17 15,18 1,20 15,22 2,24 9,25 7,26 1,28 2,29 4,32 22,34 1,35 12.9,36 0.061,37 2,38 34.5,39 32.371,40 34.439,41 22.733,42 22.837,43 3.2,44 6.684}
{0 CHEMBL385709,1 9.193,2 56.5,3 32.6,4 1.008,5 1.093,6 0.763,7 0.739,8 422.88,9 4.3,10 28,11 46,13 29,14 35,16 50,17 26,18 1,19 1,20 25,24 15,25 5,26 1,28 2,29 2,32 31,33 1,34 1,35 4.3,36 0.04,37 2,38 51,39 46.367,40 50.266,41 35.108,42 33.988,43 2.2,44 6.896}
{0 CHEMBL386578,1 9.54,2 51.6,3 32.3,4 1.016,5 1.107,6 0.754,7 0.733,8 295.74,9 9.7,10 17,11 31,13 18,14 23,16 33,17 16,18 1,19 1,20 15,24 10,25 5,26 1,28 3,29 1,32 21,33 1,34 1,35 3.2,36 0.03,37 1,38 33.5,39 31.491,40 34.309,41 23.375,42 22.714,43 3.2,44 4.824}
{0 CHEMBL399043,1 7.511,2 39.3,3 50,4 0.997,5 1.116,6 0.675,7 0.618,8 210.32,11 28,13 4,14 14,16 28,17 11,20 7,21 4,22 4,24 14,25 3,26 1,29 2,31 1,32 14,35 7.1,36 0.071,37 2,38 18,39 27.916,40 31.245,41 18.887,42 17.304,44 4}
{0 CHEMBL413773,1 9.105,2 48.4,3 32.3,4 1.034,5 1.113,6 0.706,7 0.71,8 282.27,9 6.5,10 17,11 31,13 19,14 23,16 33,17 15,20 15,22 2,24 10,25 6,28 2,29 4,32 21,35 12.9,36 0.061,37 2,38 33.5,39 32.047,40 34.495,41 21.875,42 22.009,44 5.853}
{0 CHEMBL424703,1 7.202,2 38.7,3 48.4,4 1.014,5 1.127,6 0.63,7 0.607,8 446.54,11 62,13 8,14 33,16 63,17 24,20 12,21 12,22 8,24 30,25 8,29 8,32 32,35 12.9,36 0.111,37 7,38 41,39 62.872,40 69.903,41 39.057,42 37.62,44 4.251}
{0 CHEMBL436792,1 12.4,2 55.2,3 27.6,4 1.021,5 1.091,6 0.818,7 0.783,8 359.61,9 6.9,10 17,11 29,13 18,14 23,15 1,16 31,17 16,18 1,19 1,20 15,24 8,25 5,26 2,28 2,29 1,32 21,33 1,34 2,35 3.4,36 0.032,37 1,38 33.5,39 29.618,40 31.652,41 23.722,42 22.718,43 6.9,44 4.824}
{0 CHEMBL439501,1 7.473,2 39.3,3 46.4,4 1.02,5 1.126,6 0.635,7 0.617,8 418.48,11 56,13 8,14 31,16 57,17 22,20 12,21 10,22 8,24 26,25 8,29 8,32 30,35 14.3,36 0.088,37 5,38 39,39 57.105,40 63.073,41 35.534,42 34.567,44 4.144}
{0 CHEMBL449993,1 6.359,2 35,3 55,4 1.001,5 1.135,6 0.605,7 0.566,8 254.36,11 40,13 3,14 18,16 40,17 14,20 4,21 10,22 3,24 22,25 4,29 4,32 18,35 10,36 0.2,37 8,38 21,39 40.029,40 45.405,41 24.193,42 22.654,44 4.359}
{0 CHEMBL45041,1 8.358,2 30.4,3 43.5,4 1.033,5 1.149,6 0.637,7 0.621,8 384.47,9 13,10 10,11 46,13 11,14 28,16 48,17 14,20 6,21 8,22 1,24 20,25 12,26 1,28 6,29 5,31 1,32 26,35 10.9,36 0.146,37 7,38 34,39 47.509,40 52.863,41 29.284,42 28.577,44 4.523}
{0 CHEMBL454580,1 7.039,2 42.4,3 48.5,4 1.002,5 1.12,6 0.65,7 0.617,8 464.6,10 12,11 66,13 16,14 36,16 68,17 28,20 19,21 9,22 4,24 32,25 6,29 6,32 34,35 9.1,36 0.088,37 6,38 46,39 66.101,40 73.9,41 42.909,42 40.718,44 5.481}
{0 CHEMBL45627,1 6.767,2 36.4,3 51.5,4 1.005,5 1.135,6 0.62,7 0.587,8 223.3,9 3,11 33,13 4,14 16,16 33,17 12,20 6,21 6,22 4,24 17,25 4,28 1,29 3,32 16,35 9.1,36 0.212,37 7,38 20,39 33.153,40 37.448,41 20.46,42 19.38,44 4.773}
{0 CHEMBL46624,1 8.521,2 29.8,3 42.6,4 1.039,5 1.15,6 0.633,7 0.623,8 400.47,9 12.8,10 10,11 47,13 12,14 29,16 49,17 14,20 6,21 8,22 2,24 20,25 13,26 1,28 6,29 6,31 1,32 27,35 12.8,36 0.143,37 7,38 36,39 48.836,40 54.073,41 29.739,42 29.292,44 4.523}
{0 CHEMBL46902,1 8.521,2 29.8,3 42.6,4 1.039,5 1.15,6 0.633,7 0.623,8 400.47,9 12.8,10 10,11 47,13 12,14 29,16 49,17 14,20 6,21 8,22 2,24 20,25 13,26 1,28 6,29 6,31 1,32 27,35 12.8,36 0.143,37 7,38 36,39 48.836,40 54.073,41 29.739,42 29.292,44 4.301}
{0 CHEMBL470981,1 7.771,2 45.2,3 42.9,4 1.014,5 1.114,6 0.67,7 0.65,8 326.37,10 16,11 42,13 16,14 27,16 45,17 19,20 14,21 5,24 18,25 5,29 5,32 24,35 11.9,36 0.111,37 5,38 35,39 42.589,40 46.784,41 28.125,42 27.315,44 4.041}
{0 CHEMBL47994,1 8.676,2 29.2,3 41.7,4 1.045,5 1.152,6 0.629,7 0.625,8 416.47,9 12.5,10 10,11 48,13 13,14 30,16 50,17 14,20 6,21 8,22 3,24 20,25 14,26 1,28 6,29 7,31 1,32 28,35 14.6,36 0.14,37 7,38 38,39 50.164,40 55.282,41 30.193,42 30.007,44 4}
{0 CHEMBL561643,1 7.564,2 44.4,3 44.4,4 1.011,5 1.116,6 0.664,7 0.641,8 408.48,10 12,11 54,13 15,14 33,16 57,17 24,20 17,21 7,22 3,24 24,25 6,29 6,32 30,35 11.1,36 0.053,37 3,38 42,39 54.567,40 60.239,41 35.864,42 34.61,44 4.391}
{0 CHEMBL583912,1 8.294,2 42.9,3 40,4 1.033,5 1.119,6 0.659,7 0.656,8 290.29,10 12,11 35,13 12,14 23,16 37,17 15,20 12,21 3,24 14,25 6,29 6,32 21,35 17.1,36 0.027,37 1,38 29,39 36.149,40 39.163,41 23.057,42 22.976,44 4}
