{
  "data_set_description": {
    "collection_date": "November 2013",
    "creator": "Dr Jeremy Besnard, Dr Ivan Olier, Dr Noureddin Sadawi, Dr Larisa Soldatova, Dr Crina Grosan, Prof Ross King, Dr Richard Bickerton, Prof Andrew Hopkins and Dr Willem van Hoorn",
    "default_target_attribute": "pXC50",
    "description": "This dataset contains QSAR data (from ChEMBL version 17) showing activity values (unit is pseudo-pCI50) of several compounds on drug target ChEMBL_ID: CHEMBL1075021 (TID: 102971), and it has 35 rows and 1177 features (not including molecule IDs and class feature: molecule_id and pXC50). The features represent Molecular Descriptors which were generated from SMILES strings. Missing value imputation was applied to this dataset (By choosing the Median).",
    "description_version": "1",
    "file_id": "3315822",
    "format": "ARFF",
    "id": "26897",
    "licence": "Public",
    "md5_checksum": "59143682ac6221b73225b25a7cad25ac",
    "minio_url": "https://data.openml.org/datasets/0002/26897/dataset_26897.pq",
    "name": "QSAR-DATASET-FOR-DRUG-TARGET-CHEMBL1075021",
    "original_data_url": "https://www.ebi.ac.uk/chembl/target/inspect/CHEMBL1075021",
    "parquet_url": "https://data.openml.org/datasets/0002/26897/dataset_26897.pq",
    "processing_date": "2018-10-04 00:15:39",
    "row_id_attribute": "molecule_id",
    "status": "deactivated",
    "tag": [
      "MetaQSAR",
      "study_13"
    ],
    "upload_date": "2016-07-14T20:19:00",
    "url": "https://api.openml.org/data/v1/download/3315822/QSAR-DATASET-FOR-DRUG-TARGET-CHEMBL1075021.arff",
    "version": "9",
    "visibility": "public"
  }
}