"molecule_id","AMW","H.","pXC50"
{1 6.092,2 58.3,3 5.046}
{0 CHEMBL1566,1 7.422,2 49.4,3 4}
{0 CHEMBL1651549,1 5.983,2 59,3 5}
{0 CHEMBL1651550,1 5.89,2 59.5,3 5}
{0 CHEMBL1651551,1 5.809,2 60,3 5}
{0 CHEMBL1651552,1 5.738,2 60.4,3 5.097}
{0 CHEMBL1651628,1 5.874,2 59.6,3 5.097}
{0 CHEMBL1651629,1 5.809,2 60,3 5.398}
{0 CHEMBL1651630,1 5.751,2 60.3,3 5.301}
{0 CHEMBL1651631,1 5.698,2 60.7,3 5.155}
{0 CHEMBL1651632,1 5.65,2 60.9,3 5}
{0 CHEMBL1651633,1 5.606,2 61.2,3 4.602}
{0 CHEMBL2203334,1 11.524,2 30.3,3 4.55}
{0 CHEMBL2207948,1 9.133,2 33.3,3 4.628}
{0 CHEMBL2207949,1 10.177,2 30.3,3 4.657}
{0 CHEMBL2207950,1 9.678,2 30.3,3 4.602}
{0 CHEMBL2207951,1 9.444,2 32.4,3 4.675}
{0 CHEMBL2207952,1 9.012,2 33.3,3 4.674}
{0 CHEMBL2207953,1 8.872,2 34.9,3 4.798}
{0 CHEMBL2207954,1 9.888,2 32.4,3 4.706}
{0 CHEMBL2207955,1 8.762,2 36.1,3 4.693}
{0 CHEMBL2207956,1 8.636,2 37.5,3 4.738}
{0 CHEMBL2207957,1 8.957,2 35.1,3 4.603}
{0 CHEMBL2207958,1 8.636,2 37.5,3 4.728}
{0 CHEMBL2207959,1 11.089,2 32.4,3 4.85}
{0 CHEMBL408500,1 5.676,2 60.8,3 5.097}
{0 CHEMBL574645,1 5.935,2 58.2,3 5.398}
