"molecule_id","AMW","C.","H.","Me","Mi","Mp","Mv","MW","N.","nAB","nAT","nB","nBM","nBO","nBR","nBT","nC","nCL","nCsp","nCsp2","nCsp3","nDB","nF","nH","nHet","nHM","nI","nN","nO","nP","nS","nSK","nTB","nX","O.","RBF","RBN","SCBO","Se","Si","Sp","Sv","X.","pXC50"
{1 12.452,2 47.4,3 23.7,4 1.081,5 1.145,6 0.724,7 0.753,8 473.19,9 5.3,10 17,11 38,13 19,14 31,15 1,16 40,17 18,20 17,21 1,22 2,23 4,24 9,25 11,26 1,28 2,29 4,32 29,34 5,35 10.5,36 0.1,37 4,38 41.5,39 41.094,40 43.526,41 27.5,42 28.621,43 13.2,44 5.824}
{0 CHEMBL130278,1 11.283,2 47.4,3 23.7,4 1.084,5 1.148,6 0.711,7 0.748,8 428.74,9 5.3,10 17,11 38,13 19,14 31,16 40,17 18,18 1,20 17,21 1,22 2,23 4,24 9,25 11,26 1,28 2,29 4,32 29,34 5,35 10.5,36 0.1,37 4,38 41.5,39 41.189,40 43.628,41 27.006,42 28.424,43 13.2,44 5.959}
{0 CHEMBL130279,1 10.376,2 47.4,3 26.3,4 1.075,5 1.15,6 0.688,7 0.726,8 394.3,9 5.3,10 17,11 38,13 19,14 30,16 40,17 18,20 17,21 1,22 2,23 4,24 10,25 10,28 2,29 4,32 28,34 4,35 10.5,36 0.1,37 4,38 40.5,39 40.865,40 43.684,41 26.148,42 27.596,43 10.5,44 5.721}
{0 CHEMBL130657,1 10.03,2 44.4,3 28.9,4 1.071,5 1.151,6 0.675,7 0.708,8 451.36,9 6.7,10 17,11 45,13 20,14 34,16 47,17 20,20 18,21 2,22 3,23 4,24 13,25 12,28 3,29 5,32 32,34 4,35 11.1,36 0.106,37 5,38 45.5,39 48.178,40 51.807,41 30.369,42 31.859,43 8.9,44 6.886}
{0 CHEMBL130683,1 9.52,2 46.3,3 31.7,4 1.055,5 1.14,6 0.682,7 0.701,8 390.34,9 4.9,10 17,11 41,13 19,14 30,16 43,17 19,20 17,21 2,22 2,23 3,24 13,25 9,28 2,29 4,32 28,34 3,35 9.8,36 0.093,37 4,38 40.5,39 43.236,40 46.76,41 27.972,42 28.74,43 7.3,44 6.081}
{0 CHEMBL130832,1 13.39,2 48.6,3 28.6,4 1.038,5 1.102,6 0.804,7 0.762,8 468.64,9 5.7,10 17,11 35,13 19,14 27,16 37,17 17,18 1,20 17,22 2,24 10,25 8,26 2,27 1,28 2,29 4,32 25,34 2,35 11.4,36 0.108,37 4,38 37.5,39 36.324,40 38.575,41 28.153,42 26.68,43 5.7,44 5.886}
{0 CHEMBL131492,1 13.031,2 48.6,3 25.7,4 1.052,5 1.104,6 0.792,7 0.778,8 456.08,9 5.7,10 17,11 35,13 19,14 28,15 1,16 37,17 17,18 2,20 17,22 2,24 9,25 9,26 3,28 2,29 4,32 26,34 3,35 11.4,36 0.108,37 4,38 38.5,39 36.807,40 38.64,41 27.705,42 27.216,43 8.6,44 4.699}
{0 CHEMBL132388,1 9.675,2 45.2,3 31,4 1.061,5 1.142,6 0.677,7 0.701,8 406.34,9 4.8,10 17,11 42,13 19,14 31,16 44,17 19,20 17,21 2,22 2,23 3,24 13,25 10,28 2,29 5,32 29,34 3,35 11.9,36 0.114,37 5,38 41.5,39 44.563,40 47.969,41 28.426,42 29.454,43 7.1,44 5.357}
{0 CHEMBL132893,1 9.793,2 48.6,3 31.4,4 1.036,5 1.11,6 0.728,7 0.725,8 342.75,9 5.7,10 17,11 35,13 19,14 26,16 37,17 17,18 1,20 17,22 2,24 11,25 7,26 1,28 2,29 4,32 24,34 1,35 11.4,36 0.108,37 4,38 36.5,39 36.255,40 38.854,41 25.494,42 25.364,43 2.9,44 4.824}
{0 CHEMBL133301,1 12.082,2 46.2,3 25.6,4 1.075,5 1.138,6 0.718,7 0.742,8 471.2,9 5.1,10 17,11 39,13 19,14 31,15 1,16 41,17 18,20 17,21 1,22 2,23 3,24 10,25 11,26 1,28 2,29 5,32 29,34 4,35 12.8,36 0.122,37 5,38 41.5,39 41.909,40 44.396,41 28.017,42 28.953,43 10.3,44 4.824}
{0 CHEMBL133468,1 9.137,2 46.2,3 33.3,4 1.042,5 1.125,6 0.687,7 0.696,8 356.33,9 5.1,10 17,11 39,13 19,14 28,16 41,17 18,20 17,21 1,22 2,23 1,24 13,25 8,28 2,29 5,32 26,34 1,35 12.8,36 0.122,37 5,38 38.5,39 40.654,40 43.875,41 26.79,42 27.161,43 2.6,44 4.699}
{0 CHEMBL133577,1 10.942,2 46.2,3 25.6,4 1.077,5 1.141,6 0.706,7 0.737,8 426.75,9 5.1,10 17,11 39,13 19,14 31,16 41,17 18,18 1,20 17,21 1,22 2,23 3,24 10,25 11,26 1,28 2,29 5,32 29,34 4,35 12.8,36 0.122,37 5,38 41.5,39 42.004,40 44.498,41 27.523,42 28.755,43 10.3,44 4.699}
{0 CHEMBL134062,1 8.809,2 48.6,3 34.3,4 1.027,5 1.112,6 0.704,7 0.701,8 308.31,9 5.7,10 17,11 35,13 19,14 25,16 37,17 17,20 17,22 2,24 12,25 6,28 2,29 4,32 23,35 11.4,36 0.108,37 4,38 35.5,39 35.931,40 38.91,41 24.636,42 24.536,44 4.699}
{0 CHEMBL197241,1 9.728,2 47.2,3 36.1,4 1.025,5 1.109,6 0.734,7 0.709,8 350.21,9 2.8,10 12,11 36,13 15,14 24,16 37,17 17,18 2,20 16,21 1,22 3,24 13,25 6,26 2,28 1,29 3,32 23,34 2,35 8.3,36 0.108,37 4,38 33,39 36.916,40 39.921,41 26.415,42 25.508,43 5.6,44 4.491}
{0 CHEMBL335756,1 9.959,2 46.3,3 29.3,4 1.067,5 1.149,6 0.681,7 0.71,8 408.33,9 4.9,10 17,11 41,13 19,14 31,16 43,17 19,20 17,21 2,22 2,23 4,24 12,25 10,28 2,29 4,32 29,34 4,35 9.8,36 0.093,37 4,38 41.5,39 43.749,40 47.099,41 27.909,42 29.123,43 9.8,44 6.569}
{0 CHEMBL339848,1 10.307,2 48.6,3 28.6,4 1.05,5 1.12,6 0.727,7 0.736,8 360.74,9 5.7,10 17,11 35,13 19,14 27,16 37,17 17,18 1,20 17,22 2,23 1,24 10,25 8,26 1,28 2,29 4,32 25,34 2,35 11.4,36 0.108,37 4,38 37.5,39 36.767,40 39.194,41 25.432,42 25.747,43 5.7,44 5.678}
{0 CHEMBL339849,1 12.047,2 48.6,3 28.6,4 1.042,5 1.106,6 0.767,7 0.754,8 421.64,9 5.7,10 17,11 35,13 19,14 27,15 1,16 37,17 17,18 1,20 17,22 2,24 10,25 8,26 2,28 2,29 4,32 25,34 2,35 11.4,36 0.108,37 4,38 37.5,39 36.484,40 38.696,41 26.847,42 26.389,43 5.7,44 5.469}
{0 CHEMBL35,1 10.337,2 37.5,3 34.4,4 1.052,5 1.124,6 0.706,7 0.696,8 330.77,9 6.3,10 11,11 32,13 14,14 22,16 33,17 12,18 1,20 11,21 1,22 3,24 11,25 9,26 2,28 2,29 5,31 1,32 21,34 1,35 15.6,36 0.152,37 5,38 30.5,39 33.658,40 35.984,41 22.597,42 22.265,43 3.1,44 4.896}
{0 CHEMBL371442,1 9.687,2 53.8,3 30.8,4 1.027,5 1.097,6 0.75,7 0.74,8 377.79,9 2.6,10 18,11 39,13 21,14 30,16 42,17 21,18 1,20 21,22 3,24 12,25 6,26 1,28 1,29 4,32 27,34 1,35 10.3,36 0.071,37 3,38 42,39 40.036,40 42.771,41 29.25,42 28.869,43 2.6,44 6.086}
{0 CHEMBL373194,1 8.363,2 44.7,3 42.1,4 1.013,5 1.116,6 0.693,7 0.663,8 317.79,9 2.6,10 12,11 38,13 14,14 23,16 39,17 17,18 1,20 14,21 3,22 2,24 16,25 5,26 1,28 1,29 3,32 22,34 1,35 7.9,36 0.128,37 5,38 31,39 38.476,40 42.392,41 26.318,42 25.208,43 2.6,44 5.553}
{0 CHEMBL383810,1 9.854,2 43.6,3 38.5,4 1.022,5 1.109,6 0.739,7 0.698,8 384.3,9 2.6,10 12,11 39,13 14,14 25,16 40,17 17,18 2,20 14,21 3,22 2,24 15,25 7,26 3,28 1,29 3,31 1,32 24,34 2,35 7.7,36 0.15,37 6,38 33,39 39.876,40 43.256,41 28.824,42 27.222,43 5.1,44 5.854}
{0 CHEMBL435599,1 12.885,2 47.4,3 23.7,4 1.076,5 1.135,6 0.748,7 0.765,8 489.64,9 5.3,10 17,11 38,13 19,14 31,15 1,16 40,17 18,18 1,20 17,21 1,22 2,23 3,24 9,25 11,26 2,28 2,29 4,32 29,34 5,35 10.5,36 0.1,37 4,38 41.5,39 40.905,40 43.13,41 28.421,42 29.065,43 13.2,44 5.699}
