{
  "data_qualities": {
    "quality": [
      {
        "name": "AutoCorrelation",
        "value": "-0.01849999999999974"
      },
      {
        "name": "ClassEntropy",
        "value": []
      },
      {
        "name": "Dimensionality",
        "value": "36.94117647058823"
      },
      {
        "name": "EquivalentNumberOfAtts",
        "value": []
      },
      {
        "name": "MajorityClassPercentage",
        "value": []
      },
      {
        "name": "MajorityClassSize",
        "value": []
      },
      {
        "name": "MaxAttributeEntropy",
        "value": []
      },
      {
        "name": "MaxKurtosisOfNumericAtts",
        "value": "17.000000000000128"
      },
      {
        "name": "MaxMeansOfNumericAtts",
        "value": "55001.294117647056"
      },
      {
        "name": "MaxMutualInformation",
        "value": []
      },
      {
        "name": "MaxNominalAttDistinctValues",
        "value": []
      },
      {
        "name": "MaxSkewnessOfNumericAtts",
        "value": "4.123105625617688"
      },
      {
        "name": "MaxStdDevOfNumericAtts",
        "value": "8675.440729184209"
      },
      {
        "name": "MeanAttributeEntropy",
        "value": []
      },
      {
        "name": "MeanKurtosisOfNumericAtts",
        "value": "0.6408022103870062"
      },
      {
        "name": "MeanMeansOfNumericAtts",
        "value": "256.66089961534885"
      },
      {
        "name": "MeanMutualInformation",
        "value": []
      },
      {
        "name": "MeanNoiseToSignalRatio",
        "value": []
      },
      {
        "name": "MeanNominalAttDistinctValues",
        "value": []
      },
      {
        "name": "MeanSkewnessOfNumericAtts",
        "value": "0.4652198796422164"
      },
      {
        "name": "MeanStdDevOfNumericAtts",
        "value": "30.039289200475775"
      },
      {
        "name": "MinAttributeEntropy",
        "value": []
      },
      {
        "name": "MinKurtosisOfNumericAtts",
        "value": "-2.2666666666666675"
      },
      {
        "name": "MinMeansOfNumericAtts",
        "value": "-2.626470588235294"
      },
      {
        "name": "MinMutualInformation",
        "value": []
      },
      {
        "name": "MinNominalAttDistinctValues",
        "value": []
      },
      {
        "name": "MinSkewnessOfNumericAtts",
        "value": "-3.771681123680689"
      },
      {
        "name": "MinStdDevOfNumericAtts",
        "value": "7.717436331412897E-4"
      },
      {
        "name": "MinorityClassPercentage",
        "value": []
      },
      {
        "name": "MinorityClassSize",
        "value": []
      },
      {
        "name": "NumberOfBinaryFeatures",
        "value": "0.0"
      },
      {
        "name": "NumberOfClasses",
        "value": "0.0"
      },
      {
        "name": "NumberOfFeatures",
        "value": "628.0"
      },
      {
        "name": "NumberOfInstances",
        "value": "17.0"
      },
      {
        "name": "NumberOfInstancesWithMissingValues",
        "value": "0.0"
      },
      {
        "name": "NumberOfMissingValues",
        "value": "0.0"
      },
      {
        "name": "NumberOfNumericFeatures",
        "value": "627.0"
      },
      {
        "name": "NumberOfSymbolicFeatures",
        "value": "1.0"
      },
      {
        "name": "PercentageOfBinaryFeatures",
        "value": "0.0"
      },
      {
        "name": "PercentageOfInstancesWithMissingValues",
        "value": "0.0"
      },
      {
        "name": "PercentageOfMissingValues",
        "value": "0.0"
      },
      {
        "name": "PercentageOfNumericFeatures",
        "value": "99.84076433121018"
      },
      {
        "name": "PercentageOfSymbolicFeatures",
        "value": "0.15923566878980894"
      },
      {
        "name": "Quartile1AttributeEntropy",
        "value": []
      },
      {
        "name": "Quartile1KurtosisOfNumericAtts",
        "value": "-1.0541991159925521"
      },
      {
        "name": "Quartile1MeansOfNumericAtts",
        "value": "0.7647058823529411"
      },
      {
        "name": "Quartile1MutualInformation",
        "value": []
      },
      {
        "name": "Quartile1SkewnessOfNumericAtts",
        "value": "-0.12728889298772364"
      },
      {
        "name": "Quartile1StdDevOfNumericAtts",
        "value": "0.05802262489753457"
      },
      {
        "name": "Quartile2AttributeEntropy",
        "value": []
      },
      {
        "name": "Quartile2KurtosisOfNumericAtts",
        "value": "-0.39595783325311995"
      },
      {
        "name": "Quartile2MeansOfNumericAtts",
        "value": "1.9621176470588235"
      },
      {
        "name": "Quartile2MutualInformation",
        "value": []
      },
      {
        "name": "Quartile2SkewnessOfNumericAtts",
        "value": "0.401301630490011"
      },
      {
        "name": "Quartile2StdDevOfNumericAtts",
        "value": "0.13418183448545615"
      },
      {
        "name": "Quartile3AttributeEntropy",
        "value": []
      },
      {
        "name": "Quartile3KurtosisOfNumericAtts",
        "value": "0.5700119629560167"
      },
      {
        "name": "Quartile3MeansOfNumericAtts",
        "value": "5.048588235294118"
      },
      {
        "name": "Quartile3MutualInformation",
        "value": []
      },
      {
        "name": "Quartile3SkewnessOfNumericAtts",
        "value": "0.89980078502251"
      },
      {
        "name": "Quartile3StdDevOfNumericAtts",
        "value": "0.6380497859977422"
      },
      {
        "name": "StdvNominalAttDistinctValues",
        "value": []
      }
    ]
  }
}