{
  "data_set_description": {
    "collection_date": "November 2013",
    "creator": "Dr Jeremy Besnard, Dr Ivan Olier, Dr Noureddin Sadawi, Dr Larisa Soldatova, Dr Crina Grosan, Prof Ross King, Dr Richard Bickerton, Prof Andrew Hopkins and Dr Willem van Hoorn",
    "default_target_attribute": "pXC50",
    "description": "This dataset contains QSAR data (from ChEMBL version 17) showing activity values (unit is pseudo-pCI50) of several compounds on drug target ChEMBL_ID: CHEMBL1293303 (TID: 103736), and it has 130 rows and 43 features (not including molecule IDs and class feature: molecule_id and pXC50). The features represent Basic Molecular Descriptors which were generated from SMILES strings.  Missing value imputation was applied to this dataset (By choosing the Median).",
    "description_version": "1",
    "file_id": "3313228",
    "format": "ARFF",
    "id": "26803",
    "licence": "Public",
    "md5_checksum": "bfbd86aa6c04b2287365cfd107f06d23",
    "minio_url": "https://data.openml.org/datasets/0002/26803/dataset_26803.pq",
    "name": "QSAR-DATASET-FOR-DRUG-TARGET-CHEMBL1293303",
    "original_data_url": "https://www.ebi.ac.uk/chembl/target/inspect/CHEMBL1293303",
    "parquet_url": "https://data.openml.org/datasets/0002/26803/dataset_26803.pq",
    "processing_date": "2018-10-04 00:04:32",
    "row_id_attribute": "molecule_id",
    "status": "deactivated",
    "tag": [
      "MetaQSAR",
      "study_13"
    ],
    "upload_date": "2016-07-14T20:05:58",
    "url": "https://api.openml.org/data/v1/download/3313228/QSAR-DATASET-FOR-DRUG-TARGET-CHEMBL1293303.arff",
    "version": "10",
    "visibility": "public"
  }
}