{
  "data_features": {
    "feature": [
      {
        "data_type": "nominal",
        "index": "0",
        "is_ignore": "false",
        "is_row_identifier": "true",
        "is_target": "false",
        "name": "molecule_id",
        "nominal_value": [
          "CHEMBL1075689",
          "CHEMBL1075731",
          "CHEMBL1075838",
          "CHEMBL1075857",
          "CHEMBL1075905",
          "CHEMBL1075973",
          "CHEMBL1079478",
          "CHEMBL1079479",
          "CHEMBL1079495",
          "CHEMBL1079660",
          "CHEMBL1079661",
          "CHEMBL1079662",
          "CHEMBL1079663",
          "CHEMBL1079845",
          "CHEMBL1079988",
          "CHEMBL1079989",
          "CHEMBL1080016",
          "CHEMBL1080017",
          "CHEMBL1080018",
          "CHEMBL1080200",
          "CHEMBL1080201",
          "CHEMBL1080202",
          "CHEMBL1080311",
          "CHEMBL1080488",
          "CHEMBL1080494",
          "CHEMBL1080495",
          "CHEMBL1080496",
          "CHEMBL1080667",
          "CHEMBL1081059",
          "CHEMBL1081060",
          "CHEMBL1081578",
          "CHEMBL1081579",
          "CHEMBL1081583",
          "CHEMBL1081748",
          "CHEMBL1081935",
          "CHEMBL1081936",
          "CHEMBL1081937",
          "CHEMBL1081955",
          "CHEMBL1081956",
          "CHEMBL1082129",
          "CHEMBL1082130",
          "CHEMBL1098610",
          "CHEMBL1289456",
          "CHEMBL1289457",
          "CHEMBL1289670",
          "CHEMBL151848",
          "CHEMBL1765359",
          "CHEMBL1765360",
          "CHEMBL1773168",
          "CHEMBL1773180",
          "CHEMBL1773181",
          "CHEMBL1784316",
          "CHEMBL1945186",
          "CHEMBL1945189",
          "CHEMBL1945552",
          "CHEMBL1946279",
          "CHEMBL1946281",
          "CHEMBL1946981",
          "CHEMBL1946982",
          "CHEMBL1946988",
          "CHEMBL1946992",
          "CHEMBL1946997",
          "CHEMBL1946998",
          "CHEMBL200386",
          "CHEMBL200475",
          "CHEMBL200830",
          "CHEMBL217931",
          "CHEMBL275787",
          "CHEMBL371922",
          "CHEMBL372159",
          "CHEMBL374279",
          "CHEMBL377360",
          "CHEMBL381633",
          "CHEMBL409618",
          "CHEMBL427374",
          "CHEMBL439324",
          "CHEMBL441861",
          "CHEMBL455453",
          "CHEMBL455469",
          "CHEMBL484145",
          "CHEMBL487051",
          "CHEMBL50626",
          "CHEMBL519069",
          "CHEMBL520906"
        ],
        "number_of_missing_values": "0"
      },
      {
        "data_type": "numeric",
        "index": "1",
        "is_ignore": "false",
        "is_row_identifier": "false",
        "is_target": "false",
        "name": "nO",
        "number_of_missing_values": "0"
      },
      {
        "data_type": "numeric",
        "index": "2",
        "is_ignore": "false",
        "is_row_identifier": "false",
        "is_target": "false",
        "name": "Sv",
        "number_of_missing_values": "0"
      },
      {
        "data_type": "numeric",
        "index": "3",
        "is_ignore": "false",
        "is_row_identifier": "false",
        "is_target": "true",
        "name": "pXC50",
        "number_of_missing_values": "0"
      }
    ]
  }
}