{
  "data_set_description": {
    "collection_date": "November 2013",
    "creator": "Dr Jeremy Besnard, Dr Ivan Olier, Dr Noureddin Sadawi, Dr Larisa Soldatova, Dr Crina Grosan, Prof Ross King, Dr Richard Bickerton, Prof Andrew Hopkins and Dr Willem van Hoorn",
    "default_target_attribute": "pXC50",
    "description": "This dataset contains QSAR data (from ChEMBL version 17) showing activity values (unit is pseudo-pCI50) of several compounds on drug target ChEMBL_ID: CHEMBL4802 (TID: 12899), and it has 182 rows and 1306 features (not including molecule IDs and class feature: molecule_id and pXC50). The features represent Molecular Descriptors which were generated from SMILES strings. Missing value imputation was applied to this dataset (By choosing the Median).",
    "description_version": "1",
    "file_id": "3310401",
    "format": "ARFF",
    "id": "26702",
    "licence": "Public",
    "md5_checksum": "de57c9338d0f009942f967bddb7002d3",
    "minio_url": "https://data.openml.org/datasets/0002/26702/dataset_26702.pq",
    "name": "QSAR-DATASET-FOR-DRUG-TARGET-CHEMBL4802",
    "original_data_url": "https://www.ebi.ac.uk/chembl/target/inspect/CHEMBL4802",
    "parquet_url": "https://data.openml.org/datasets/0002/26702/dataset_26702.pq",
    "processing_date": "2018-10-03 23:52:33",
    "row_id_attribute": "molecule_id",
    "status": "deactivated",
    "tag": [
      "MetaQSAR",
      "study_13"
    ],
    "upload_date": "2016-07-14T19:51:49",
    "url": "https://api.openml.org/data/v1/download/3310401/QSAR-DATASET-FOR-DRUG-TARGET-CHEMBL4802.arff",
    "version": "7",
    "visibility": "public"
  }
}