{
  "data_features": {
    "feature": [
      {
        "data_type": "nominal",
        "index": "0",
        "is_ignore": "false",
        "is_row_identifier": "true",
        "is_target": "false",
        "name": "molecule_id",
        "nominal_value": [
          "CHEMBL1076549",
          "CHEMBL1076555",
          "CHEMBL1076559",
          "CHEMBL1076570",
          "CHEMBL1076585",
          "CHEMBL1080392",
          "CHEMBL1080890",
          "CHEMBL1081115",
          "CHEMBL1081116",
          "CHEMBL1081262",
          "CHEMBL1081276",
          "CHEMBL1081463",
          "CHEMBL1081480",
          "CHEMBL1081482",
          "CHEMBL1081626",
          "CHEMBL1081627",
          "CHEMBL1081994",
          "CHEMBL1082029",
          "CHEMBL1082173",
          "CHEMBL1082174",
          "CHEMBL1082175",
          "CHEMBL1082184",
          "CHEMBL1087626",
          "CHEMBL1302170",
          "CHEMBL1303508",
          "CHEMBL1306199",
          "CHEMBL1306258",
          "CHEMBL1306425",
          "CHEMBL1307594",
          "CHEMBL1314351",
          "CHEMBL1318338",
          "CHEMBL1329974",
          "CHEMBL1333429",
          "CHEMBL1334062",
          "CHEMBL1355382",
          "CHEMBL1356663",
          "CHEMBL1362311",
          "CHEMBL1362595",
          "CHEMBL1362734",
          "CHEMBL1364907",
          "CHEMBL1373154",
          "CHEMBL1375922",
          "CHEMBL1379971",
          "CHEMBL1399109",
          "CHEMBL1401333",
          "CHEMBL1404929",
          "CHEMBL1416392",
          "CHEMBL1417692",
          "CHEMBL1418273",
          "CHEMBL1418796",
          "CHEMBL1424118",
          "CHEMBL1425538",
          "CHEMBL1426692",
          "CHEMBL1432810",
          "CHEMBL1434053",
          "CHEMBL1434737",
          "CHEMBL1446122",
          "CHEMBL1448902",
          "CHEMBL1458321",
          "CHEMBL1462375",
          "CHEMBL1476178",
          "CHEMBL1478990",
          "CHEMBL1484370",
          "CHEMBL1484618",
          "CHEMBL1484797",
          "CHEMBL1490267",
          "CHEMBL1499658",
          "CHEMBL1504948",
          "CHEMBL1511080",
          "CHEMBL1515723",
          "CHEMBL1516388",
          "CHEMBL1524172",
          "CHEMBL1529285",
          "CHEMBL1532953",
          "CHEMBL1544997",
          "CHEMBL1547025",
          "CHEMBL1560833",
          "CHEMBL1575869",
          "CHEMBL1588106",
          "CHEMBL1593230",
          "CHEMBL1593304",
          "CHEMBL1603938",
          "CHEMBL1606112",
          "CHEMBL1613272",
          "CHEMBL1972037",
          "CHEMBL1989852",
          "CHEMBL2001831",
          "CHEMBL2005296",
          "CHEMBL2311578",
          "CHEMBL2315413",
          "CHEMBL2315414",
          "CHEMBL2315415",
          "CHEMBL2315416",
          "CHEMBL2315417",
          "CHEMBL2315418",
          "CHEMBL2315419",
          "CHEMBL2315420",
          "CHEMBL2315421",
          "CHEMBL2315422",
          "CHEMBL2315423",
          "CHEMBL2315424",
          "CHEMBL2315425",
          "CHEMBL2315426",
          "CHEMBL2315427",
          "CHEMBL2315428",
          "CHEMBL2315429",
          "CHEMBL2315430",
          "CHEMBL2315431",
          "CHEMBL2315432",
          "CHEMBL2315433",
          "CHEMBL2315434",
          "CHEMBL2315435",
          "CHEMBL2315436",
          "CHEMBL2315437",
          "CHEMBL2315438",
          "CHEMBL2315439",
          "CHEMBL2315440",
          "CHEMBL2315441",
          "CHEMBL2315442",
          "CHEMBL2315443",
          "CHEMBL2315444",
          "CHEMBL2315445",
          "CHEMBL2315446",
          "CHEMBL2315447",
          "CHEMBL2315448",
          "CHEMBL2315449",
          "CHEMBL2315450",
          "CHEMBL2315451",
          "CHEMBL2315452",
          "CHEMBL2315453",
          "CHEMBL2315454",
          "CHEMBL2315455",
          "CHEMBL2315456",
          "CHEMBL2315457",
          "CHEMBL2315458",
          "CHEMBL2315459",
          "CHEMBL2315460",
          "CHEMBL2315461",
          "CHEMBL2315462",
          "CHEMBL2315463",
          "CHEMBL2315464",
          "CHEMBL2315465",
          "CHEMBL2315466",
          "CHEMBL2315467",
          "CHEMBL2315468",
          "CHEMBL2315469",
          "CHEMBL2315470",
          "CHEMBL2315471",
          "CHEMBL2315763",
          "CHEMBL2315764",
          "CHEMBL2315765",
          "CHEMBL2315766",
          "CHEMBL2315767",
          "CHEMBL2315768",
          "CHEMBL2315769",
          "CHEMBL2315770",
          "CHEMBL2315771",
          "CHEMBL2315772",
          "CHEMBL2315773",
          "CHEMBL2315774",
          "CHEMBL2315775",
          "CHEMBL2315776",
          "CHEMBL2315777",
          "CHEMBL2315778",
          "CHEMBL2315779",
          "CHEMBL2315780",
          "CHEMBL2315781",
          "CHEMBL2315782",
          "CHEMBL2315783",
          "CHEMBL2315784",
          "CHEMBL2315785",
          "CHEMBL2315786",
          "CHEMBL2315787",
          "CHEMBL2315788",
          "CHEMBL2315789",
          "CHEMBL2315790",
          "CHEMBL2315791",
          "CHEMBL2315792",
          "CHEMBL2315793",
          "CHEMBL2315794",
          "CHEMBL2315795",
          "CHEMBL2315796",
          "CHEMBL2315797",
          "CHEMBL2315798",
          "CHEMBL2315799",
          "CHEMBL2315800",
          "CHEMBL2315801",
          "CHEMBL2315802",
          "CHEMBL2315803",
          "CHEMBL2315804",
          "CHEMBL2315805",
          "CHEMBL2315806",
          "CHEMBL2315807",
          "CHEMBL2315808",
          "CHEMBL2315809",
          "CHEMBL2315810",
          "CHEMBL2315811",
          "CHEMBL2315812",
          "CHEMBL2315813",
          "CHEMBL239103",
          "CHEMBL373909",
          "CHEMBL463175",
          "CHEMBL496",
          "CHEMBL51931",
          "CHEMBL562493",
          "CHEMBL565257",
          "CHEMBL579212",
          "CHEMBL601757",
          "CHEMBL63354"
        ],
        "number_of_missing_values": "0"
      },
      {
        "data_type": "numeric",
        "index": "1",
        "is_ignore": "false",
        "is_row_identifier": "false",
        "is_target": "false",
        "name": "C.027",
        "number_of_missing_values": "0"
      },
      {
        "data_type": "numeric",
        "index": "2",
        "is_ignore": "false",
        "is_row_identifier": "false",
        "is_target": "false",
        "name": "C.044",
        "number_of_missing_values": "0"
      },
      {
        "data_type": "numeric",
        "index": "3",
        "is_ignore": "false",
        "is_row_identifier": "false",
        "is_target": "false",
        "name": "SpMAD_AEA.ed.",
        "number_of_missing_values": "0"
      },
      {
        "data_type": "numeric",
        "index": "4",
        "is_ignore": "false",
        "is_row_identifier": "false",
        "is_target": "false",
        "name": "nPyridines",
        "number_of_missing_values": "0"
      },
      {
        "data_type": "numeric",
        "index": "5",
        "is_ignore": "false",
        "is_row_identifier": "false",
        "is_target": "false",
        "name": "MCD",
        "number_of_missing_values": "0"
      },
      {
        "data_type": "numeric",
        "index": "6",
        "is_ignore": "false",
        "is_row_identifier": "false",
        "is_target": "false",
        "name": "SssCH2",
        "number_of_missing_values": "0"
      },
      {
        "data_type": "numeric",
        "index": "7",
        "is_ignore": "false",
        "is_row_identifier": "false",
        "is_target": "false",
        "name": "NssCH2",
        "number_of_missing_values": "0"
      },
      {
        "data_type": "numeric",
        "index": "8",
        "is_ignore": "false",
        "is_row_identifier": "false",
        "is_target": "false",
        "name": "Rperim",
        "number_of_missing_values": "0"
      },
      {
        "data_type": "numeric",
        "index": "9",
        "is_ignore": "false",
        "is_row_identifier": "false",
        "is_target": "false",
        "name": "nCrs",
        "number_of_missing_values": "0"
      },
      {
        "data_type": "numeric",
        "index": "10",
        "is_ignore": "false",
        "is_row_identifier": "false",
        "is_target": "false",
        "name": "SpMAD_AEA.bo.",
        "number_of_missing_values": "0"
      },
      {
        "data_type": "numeric",
        "index": "11",
        "is_ignore": "false",
        "is_row_identifier": "false",
        "is_target": "false",
        "name": "NNRS",
        "number_of_missing_values": "0"
      },
      {
        "data_type": "numeric",
        "index": "12",
        "is_ignore": "false",
        "is_row_identifier": "false",
        "is_target": "false",
        "name": "C.002",
        "number_of_missing_values": "0"
      },
      {
        "data_type": "numeric",
        "index": "13",
        "is_ignore": "false",
        "is_row_identifier": "false",
        "is_target": "false",
        "name": "nCs",
        "number_of_missing_values": "0"
      },
      {
        "data_type": "numeric",
        "index": "14",
        "is_ignore": "false",
        "is_row_identifier": "false",
        "is_target": "false",
        "name": "RCI",
        "number_of_missing_values": "0"
      },
      {
        "data_type": "numeric",
        "index": "15",
        "is_ignore": "false",
        "is_row_identifier": "false",
        "is_target": "false",
        "name": "RFD",
        "number_of_missing_values": "0"
      },
      {
        "data_type": "numeric",
        "index": "16",
        "is_ignore": "false",
        "is_row_identifier": "false",
        "is_target": "false",
        "name": "C.026",
        "number_of_missing_values": "0"
      },
      {
        "data_type": "numeric",
        "index": "17",
        "is_ignore": "false",
        "is_row_identifier": "false",
        "is_target": "false",
        "name": "nTriazoles",
        "number_of_missing_values": "0"
      },
      {
        "data_type": "numeric",
        "index": "18",
        "is_ignore": "false",
        "is_row_identifier": "false",
        "is_target": "false",
        "name": "SpMin4_Bh.s.",
        "number_of_missing_values": "0"
      },
      {
        "data_type": "numeric",
        "index": "19",
        "is_ignore": "false",
        "is_row_identifier": "false",
        "is_target": "false",
        "name": "nAB",
        "number_of_missing_values": "0"
      },
      {
        "data_type": "numeric",
        "index": "20",
        "is_ignore": "false",
        "is_row_identifier": "false",
        "is_target": "false",
        "name": "JGI4",
        "number_of_missing_values": "0"
      },
      {
        "data_type": "numeric",
        "index": "21",
        "is_ignore": "false",
        "is_row_identifier": "false",
        "is_target": "false",
        "name": "Rbrid",
        "number_of_missing_values": "0"
      },
      {
        "data_type": "numeric",
        "index": "22",
        "is_ignore": "false",
        "is_row_identifier": "false",
        "is_target": "false",
        "name": "SpMin2_Bh.s.",
        "number_of_missing_values": "0"
      },
      {
        "data_type": "numeric",
        "index": "23",
        "is_ignore": "false",
        "is_row_identifier": "false",
        "is_target": "false",
        "name": "SpDiam_EA.ri.",
        "number_of_missing_values": "0"
      },
      {
        "data_type": "numeric",
        "index": "24",
        "is_ignore": "false",
        "is_row_identifier": "false",
        "is_target": "false",
        "name": "Eig01_EA.ri.",
        "number_of_missing_values": "0"
      },
      {
        "data_type": "numeric",
        "index": "25",
        "is_ignore": "false",
        "is_row_identifier": "false",
        "is_target": "false",
        "name": "SpMax_EA.ri.",
        "number_of_missing_values": "0"
      },
      {
        "data_type": "numeric",
        "index": "26",
        "is_ignore": "false",
        "is_row_identifier": "false",
        "is_target": "false",
        "name": "SpMin5_Bh.p.",
        "number_of_missing_values": "0"
      },
      {
        "data_type": "numeric",
        "index": "27",
        "is_ignore": "false",
        "is_row_identifier": "false",
        "is_target": "false",
        "name": "Psi_e_A",
        "number_of_missing_values": "0"
      },
      {
        "data_type": "numeric",
        "index": "28",
        "is_ignore": "false",
        "is_row_identifier": "false",
        "is_target": "false",
        "name": "Psi_i_A",
        "number_of_missing_values": "0"
      },
      {
        "data_type": "numeric",
        "index": "29",
        "is_ignore": "false",
        "is_row_identifier": "false",
        "is_target": "false",
        "name": "SpMax1_Bh.e.",
        "number_of_missing_values": "0"
      },
      {
        "data_type": "numeric",
        "index": "30",
        "is_ignore": "false",
        "is_row_identifier": "false",
        "is_target": "false",
        "name": "SpMin5_Bh.s.",
        "number_of_missing_values": "0"
      },
      {
        "data_type": "numeric",
        "index": "31",
        "is_ignore": "false",
        "is_row_identifier": "false",
        "is_target": "false",
        "name": "GATS2p",
        "number_of_missing_values": "0"
      },
      {
        "data_type": "numeric",
        "index": "32",
        "is_ignore": "false",
        "is_row_identifier": "false",
        "is_target": "false",
        "name": "JGI5",
        "number_of_missing_values": "0"
      },
      {
        "data_type": "numeric",
        "index": "33",
        "is_ignore": "false",
        "is_row_identifier": "false",
        "is_target": "false",
        "name": "CATS2D_08_LL",
        "number_of_missing_values": "0"
      },
      {
        "data_type": "numeric",
        "index": "34",
        "is_ignore": "false",
        "is_row_identifier": "false",
        "is_target": "false",
        "name": "CATS2D_05_AL",
        "number_of_missing_values": "0"
      },
      {
        "data_type": "numeric",
        "index": "35",
        "is_ignore": "false",
        "is_row_identifier": "false",
        "is_target": "false",
        "name": "GNar",
        "number_of_missing_values": "0"
      },
      {
        "data_type": "numeric",
        "index": "36",
        "is_ignore": "false",
        "is_row_identifier": "false",
        "is_target": "false",
        "name": "H.046",
        "number_of_missing_values": "0"
      },
      {
        "data_type": "numeric",
        "index": "37",
        "is_ignore": "false",
        "is_row_identifier": "false",
        "is_target": "false",
        "name": "MATS4v",
        "number_of_missing_values": "0"
      },
      {
        "data_type": "numeric",
        "index": "38",
        "is_ignore": "false",
        "is_row_identifier": "false",
        "is_target": "false",
        "name": "SpMax3_Bh.m.",
        "number_of_missing_values": "0"
      },
      {
        "data_type": "numeric",
        "index": "39",
        "is_ignore": "false",
        "is_row_identifier": "false",
        "is_target": "false",
        "name": "SM15_EA.bo.",
        "number_of_missing_values": "0"
      },
      {
        "data_type": "numeric",
        "index": "40",
        "is_ignore": "false",
        "is_row_identifier": "false",
        "is_target": "false",
        "name": "P_VSA_e_1",
        "number_of_missing_values": "0"
      },
      {
        "data_type": "numeric",
        "index": "41",
        "is_ignore": "false",
        "is_row_identifier": "false",
        "is_target": "false",
        "name": "P_VSA_m_1",
        "number_of_missing_values": "0"
      },
      {
        "data_type": "numeric",
        "index": "42",
        "is_ignore": "false",
        "is_row_identifier": "false",
        "is_target": "false",
        "name": "P_VSA_p_1",
        "number_of_missing_values": "0"
      },
      {
        "data_type": "numeric",
        "index": "43",
        "is_ignore": "false",
        "is_row_identifier": "false",
        "is_target": "false",
        "name": "P_VSA_s_2",
        "number_of_missing_values": "0"
      },
      {
        "data_type": "numeric",
        "index": "44",
        "is_ignore": "false",
        "is_row_identifier": "false",
        "is_target": "false",
        "name": "P_VSA_v_1",
        "number_of_missing_values": "0"
      },
      {
        "data_type": "numeric",
        "index": "45",
        "is_ignore": "false",
        "is_row_identifier": "false",
        "is_target": "false",
        "name": "SpMin6_Bh.p.",
        "number_of_missing_values": "0"
      },
      {
        "data_type": "numeric",
        "index": "46",
        "is_ignore": "false",
        "is_row_identifier": "false",
        "is_target": "false",
        "name": "IVDE",
        "number_of_missing_values": "0"
      },
      {
        "data_type": "numeric",
        "index": "47",
        "is_ignore": "false",
        "is_row_identifier": "false",
        "is_target": "false",
        "name": "SpMin5_Bh.v.",
        "number_of_missing_values": "0"
      },
      {
        "data_type": "numeric",
        "index": "48",
        "is_ignore": "false",
        "is_row_identifier": "false",
        "is_target": "false",
        "name": "N.073",
        "number_of_missing_values": "0"
      },
      {
        "data_type": "numeric",
        "index": "49",
        "is_ignore": "false",
        "is_row_identifier": "false",
        "is_target": "false",
        "name": "SpMax1_Bh.i.",
        "number_of_missing_values": "0"
      },
      {
        "data_type": "numeric",
        "index": "50",
        "is_ignore": "false",
        "is_row_identifier": "false",
        "is_target": "false",
        "name": "JGI2",
        "number_of_missing_values": "0"
      },
      {
        "data_type": "numeric",
        "index": "51",
        "is_ignore": "false",
        "is_row_identifier": "false",
        "is_target": "false",
        "name": "NRS",
        "number_of_missing_values": "0"
      },
      {
        "data_type": "numeric",
        "index": "52",
        "is_ignore": "false",
        "is_row_identifier": "false",
        "is_target": "false",
        "name": "PW3",
        "number_of_missing_values": "0"
      },
      {
        "data_type": "numeric",
        "index": "53",
        "is_ignore": "false",
        "is_row_identifier": "false",
        "is_target": "false",
        "name": "SpMax5_Bh.i.",
        "number_of_missing_values": "0"
      },
      {
        "data_type": "numeric",
        "index": "54",
        "is_ignore": "false",
        "is_row_identifier": "false",
        "is_target": "false",
        "name": "MATS6e",
        "number_of_missing_values": "0"
      },
      {
        "data_type": "numeric",
        "index": "55",
        "is_ignore": "false",
        "is_row_identifier": "false",
        "is_target": "false",
        "name": "nCsp3",
        "number_of_missing_values": "0"
      },
      {
        "data_type": "numeric",
        "index": "56",
        "is_ignore": "false",
        "is_row_identifier": "false",
        "is_target": "false",
        "name": "SM14_EA.bo.",
        "number_of_missing_values": "0"
      },
      {
        "data_type": "numeric",
        "index": "57",
        "is_ignore": "false",
        "is_row_identifier": "false",
        "is_target": "false",
        "name": "CATS2D_07_LL",
        "number_of_missing_values": "0"
      },
      {
        "data_type": "numeric",
        "index": "58",
        "is_ignore": "false",
        "is_row_identifier": "false",
        "is_target": "false",
        "name": "DECC",
        "number_of_missing_values": "0"
      },
      {
        "data_type": "numeric",
        "index": "59",
        "is_ignore": "false",
        "is_row_identifier": "false",
        "is_target": "false",
        "name": "ATSC3m",
        "number_of_missing_values": "0"
      },
      {
        "data_type": "numeric",
        "index": "60",
        "is_ignore": "false",
        "is_row_identifier": "false",
        "is_target": "false",
        "name": "P_VSA_LogP_7",
        "number_of_missing_values": "0"
      },
      {
        "data_type": "numeric",
        "index": "61",
        "is_ignore": "false",
        "is_row_identifier": "false",
        "is_target": "false",
        "name": "SpMin7_Bh.p.",
        "number_of_missing_values": "0"
      },
      {
        "data_type": "numeric",
        "index": "62",
        "is_ignore": "false",
        "is_row_identifier": "false",
        "is_target": "false",
        "name": "P_VSA_s_4",
        "number_of_missing_values": "0"
      },
      {
        "data_type": "numeric",
        "index": "63",
        "is_ignore": "false",
        "is_row_identifier": "false",
        "is_target": "false",
        "name": "SpMax3_Bh.v.",
        "number_of_missing_values": "0"
      },
      {
        "data_type": "numeric",
        "index": "64",
        "is_ignore": "false",
        "is_row_identifier": "false",
        "is_target": "false",
        "name": "SpMin5_Bh.e.",
        "number_of_missing_values": "0"
      },
      {
        "data_type": "numeric",
        "index": "65",
        "is_ignore": "false",
        "is_row_identifier": "false",
        "is_target": "false",
        "name": "P_VSA_s_3",
        "number_of_missing_values": "0"
      },
      {
        "data_type": "numeric",
        "index": "66",
        "is_ignore": "false",
        "is_row_identifier": "false",
        "is_target": "false",
        "name": "SpMax1_Bh.v.",
        "number_of_missing_values": "0"
      },
      {
        "data_type": "numeric",
        "index": "67",
        "is_ignore": "false",
        "is_row_identifier": "false",
        "is_target": "false",
        "name": "nRSR",
        "number_of_missing_values": "0"
      },
      {
        "data_type": "numeric",
        "index": "68",
        "is_ignore": "false",
        "is_row_identifier": "false",
        "is_target": "true",
        "name": "pXC50",
        "number_of_missing_values": "0"
      }
    ]
  }
}