"molecule_id","AMW","C.","H.","Me","Mi","Mp","Mv","MW","N.","nAB","nAT","nB","nBM","nBO","nBR","nBT","nC","nCL","nCsp","nCsp2","nCsp3","nDB","nF","nH","nHet","nHM","nI","nN","nO","nP","nS","nSK","nTB","nX","O.","RBF","RBN","SCBO","Se","Si","Sp","Sv","X.","pXC50"
{1 6.074,2 34.4,3 59,4 0.982,5 1.137,6 0.623,7 0.553,8 370.54,11 61,13 5,14 24,16 60,17 21,20 8,21 13,22 5,23 1,24 36,25 4,26 1,29 2,30 1,32 25,34 1,35 3.3,36 0.267,37 16,38 29,39 59.93,40 69.371,41 37.995,42 33.746,43 1.6,44 6.194}
{0 CHEMBL138705,1 7.464,2 46.8,3 44.2,4 1,5 1.113,6 0.681,7 0.65,8 574.72,9 2.6,10 28,11 77,13 30,14 48,16 82,17 36,20 28,21 8,22 2,24 34,25 7,28 2,29 5,32 43,35 6.5,36 0.122,37 10,38 64,39 76.978,40 85.687,41 52.466,42 50.046,44 5.301}
{0 CHEMBL138810,1 8.07,2 46.3,3 41.8,4 1.006,5 1.11,6 0.699,7 0.666,8 540.68,9 3,10 28,11 67,13 31,14 43,16 71,17 31,20 27,21 4,22 3,24 28,25 8,26 1,28 2,29 5,31 1,32 39,35 7.5,36 0.127,37 9,38 60,39 67.403,40 74.361,41 46.83,42 44.652,44 4.699}
{0 CHEMBL138867,1 8.087,2 47.7,3 41.5,4 1.005,5 1.106,6 0.705,7 0.671,8 525.66,9 1.5,10 28,11 65,13 31,14 42,16 69,17 31,20 27,21 4,22 3,24 27,25 7,26 1,28 1,29 5,31 1,32 38,35 7.7,36 0.116,37 8,38 59,39 65.302,40 71.863,41 45.824,42 43.631,44 5.699}
{0 CHEMBL139435,1 7.891,2 50.8,3 40.7,4 1.003,5 1.109,6 0.702,7 0.676,8 465.55,9 1.7,10 28,11 59,13 29,14 39,16 63,17 30,20 27,21 3,22 1,23 1,24 24,25 5,28 1,29 3,32 35,34 1,35 5.1,36 0.111,37 7,38 54,39 59.2,40 65.449,41 41.443,42 39.871,43 1.7,44 6}
{0 CHEMBL139508,1 8.169,2 50.8,3 40.7,4 1,5 1.103,6 0.718,7 0.683,8 482,9 1.7,10 28,11 59,13 29,14 39,16 63,17 30,18 1,20 27,21 3,22 1,24 24,25 5,26 1,28 1,29 3,32 35,34 1,35 5.1,36 0.111,37 7,38 54,39 59.011,40 65.053,41 42.364,42 40.315,43 1.7,44 5.347}
{0 CHEMBL139858,1 8.169,2 50.8,3 40.7,4 1,5 1.103,6 0.718,7 0.683,8 482,9 1.7,10 28,11 59,13 29,14 39,16 63,17 30,18 1,20 27,21 3,22 1,24 24,25 5,26 1,28 1,29 3,32 35,34 1,35 5.1,36 0.111,37 7,38 54,39 59.011,40 65.053,41 42.364,42 40.315,43 1.7,44 6.097}
{0 CHEMBL139904,1 7.586,2 50.8,3 42.4,4 0.995,5 1.104,6 0.703,7 0.669,8 447.56,9 1.7,10 28,11 59,13 29,14 38,16 63,17 30,20 27,21 3,22 1,24 25,25 4,28 1,29 3,32 34,35 5.1,36 0.111,37 7,38 53,39 58.687,40 65.109,41 41.506,42 39.487,44 5.444}
{0 CHEMBL140298,1 7.865,2 43.4,3 43.4,4 1.007,5 1.118,6 0.682,7 0.65,8 652.83,9 4.8,10 28,11 83,13 32,14 52,16 88,17 36,20 27,21 9,22 4,24 36,25 11,26 1,28 4,29 6,31 1,32 47,35 7.2,36 0.125,37 11,38 70,39 83.585,40 92.813,41 56.58,42 53.99,44 4.42}
{0 CHEMBL140432,1 7.295,2 45.5,3 45.5,4 0.997,5 1.117,6 0.676,7 0.641,8 561.73,9 3.9,10 28,11 77,13 30,14 46,16 81,17 35,20 28,21 7,22 2,24 35,25 7,28 3,29 4,32 42,35 5.2,36 0.136,37 11,38 62,39 76.752,40 85.976,41 52.017,42 49.352,44 4.824}
{0 CHEMBL140539,1 8.923,2 50.8,3 40.7,4 0.999,5 1.101,6 0.726,7 0.687,8 526.45,9 1.7,10 28,11 59,13 29,14 39,15 1,16 63,17 30,20 27,21 3,22 1,24 24,25 5,26 1,28 1,29 3,32 35,34 1,35 5.1,36 0.111,37 7,38 54,39 58.916,40 64.951,41 42.858,42 40.513,43 1.7,44 6.222}
{0 CHEMBL140797,1 7.498,2 41.7,3 46.4,4 1.003,5 1.121,6 0.668,7 0.631,8 629.84,9 3.6,10 22,11 84,13 26,14 50,16 89,17 35,20 22,21 13,22 4,24 39,25 10,26 1,28 3,29 6,31 1,32 45,35 7.1,36 0.112,37 10,38 65,39 84.25,40 94.145,41 56.097,42 53.022,44 4.77}
{0 CHEMBL140997,1 7.583,2 49.2,3 42.6,4 0.997,5 1.108,6 0.697,7 0.664,8 462.58,9 3.3,10 28,11 61,13 29,14 39,16 65,17 30,20 27,21 3,22 1,24 26,25 5,28 2,29 3,32 35,35 4.9,36 0.108,37 7,38 54,39 60.789,40 67.607,41 42.512,42 40.509,44 4.387}
{0 CHEMBL164883,1 6.804,2 45.2,3 49.3,4 0.989,5 1.114,6 0.665,7 0.621,8 496.69,10 17,11 73,13 21,14 40,16 76,17 33,20 22,21 11,22 4,24 36,25 4,29 4,32 37,35 5.5,36 0.092,37 7,38 52.5,39 72.214,40 81.311,41 48.523,42 45.342,44 5.699}
{0 CHEMBL164895,1 6.994,2 46.3,3 47.8,4 0.992,5 1.112,6 0.672,7 0.631,8 468.63,10 17,11 67,13 21,14 38,16 70,17 31,20 22,21 9,22 4,24 32,25 4,29 4,32 35,35 6,36 0.071,37 5,38 50.5,39 66.447,40 74.481,41 45,42 42.288,44 4.77}
{0 CHEMBL166741,1 7.578,2 49.2,3 43.1,4 1,5 1.106,6 0.691,7 0.661,8 492.6,10 23,11 65,13 27,14 40,16 68,17 32,20 28,21 4,22 4,24 28,25 5,29 5,32 37,35 7.7,36 0.147,37 10,38 55.5,39 65.007,40 71.86,41 44.932,42 42.949,44 4.77}
{0 CHEMBL168129,1 6.638,2 41.4,3 51.4,4 0.993,5 1.122,6 0.643,7 0.601,8 464.65,10 12,11 70,13 16,14 35,16 71,17 29,20 18,21 11,22 4,24 36,25 5,29 5,32 34,35 7.1,36 0.211,37 15,38 45,39 69.541,40 78.521,41 44.978,42 42.056,44 5.155}
{0 CHEMBL187504,1 9.284,2 51.7,3 31,4 1.038,5 1.101,6 0.714,7 0.722,8 538.48,10 24,11 58,13 28,14 45,16 63,17 30,20 30,22 4,24 18,25 10,29 10,32 40,35 17.2,36 0.063,37 4,38 61,39 60.225,40 63.831,41 41.398,42 41.889,44 4}
{0 CHEMBL197759,1 7.915,2 48.4,3 40.6,4 1.007,5 1.11,6 0.694,7 0.671,8 506.59,9 3.1,10 28,11 64,13 31,14 42,16 68,17 31,20 27,21 4,22 3,24 26,25 7,28 2,29 5,32 38,35 7.8,36 0.132,37 9,38 59,39 64.443,40 71.026,41 44.421,42 42.938,44 5.301}
{0 CHEMBL198292,1 7.937,2 47.1,3 42.6,4 1.003,5 1.107,6 0.7,7 0.664,8 539.69,9 1.5,10 28,11 68,13 31,14 43,16 72,17 32,20 27,21 5,22 3,24 29,25 7,26 1,28 1,29 5,31 1,32 39,35 7.4,36 0.125,37 9,38 60,39 68.185,40 75.278,41 47.585,42 45.158,44 5.523}
{0 CHEMBL198592,1 7.468,2 51.4,3 43.1,4 0.991,5 1.102,6 0.705,7 0.668,8 537.69,9 1.4,10 34,11 72,13 35,14 46,16 77,17 37,20 33,21 4,22 1,24 31,25 4,28 1,29 3,32 41,35 4.2,36 0.117,37 9,38 64,39 71.338,40 79.355,41 50.79,42 48.068,44 4.481}
{0 CHEMBL199500,1 7.847,2 49.2,3 43.1,4 0.997,5 1.106,6 0.706,7 0.667,8 510.06,9 1.5,10 28,11 65,13 29,14 41,16 69,17 32,18 1,20 27,21 5,22 1,24 28,25 5,26 1,28 1,29 3,32 37,34 1,35 4.6,36 0.13,37 9,38 56,39 64.778,40 71.883,41 45.887,42 43.368,43 1.5,44 5}
{0 CHEMBL199533,1 8.291,2 50,3 40.3,4 1.007,5 1.11,6 0.711,7 0.681,8 514.02,9 1.6,10 28,11 62,13 29,14 41,16 66,17 31,18 1,20 27,21 4,22 1,23 1,24 25,25 6,26 1,28 1,29 3,32 37,34 2,35 4.8,36 0.121,37 8,38 56,39 62.407,40 68.808,41 44.063,42 42.225,43 3.2,44 5.699}
{0 CHEMBL199644,1 8.26,2 50,3 41.9,4 0.994,5 1.1,6 0.731,7 0.682,8 512.1,9 1.6,10 28,11 62,13 29,14 40,16 66,17 31,18 1,20 27,21 4,22 1,24 26,25 5,26 2,28 1,29 2,31 1,32 36,34 1,35 3.2,36 0.121,37 8,38 55,39 61.643,40 68.179,41 45.318,42 42.314,43 1.6,44 5.699}
{0 CHEMBL199669,1 8.245,2 48.4,3 40.6,4 1.008,5 1.109,6 0.708,7 0.677,8 527.65,9 1.6,10 28,11 64,13 31,14 42,16 68,17 31,20 27,21 4,22 3,23 1,24 26,25 7,26 1,28 1,29 4,31 1,32 38,34 1,35 6.3,36 0.118,37 8,38 59,39 64.487,40 70.993,41 45.307,42 43.299,43 1.6,44 6}
{0 CHEMBL199714,1 8.169,2 50.8,3 40.7,4 1,5 1.103,6 0.718,7 0.683,8 482,9 1.7,10 28,11 59,13 29,14 39,16 63,17 30,18 1,20 27,21 3,22 1,24 24,25 5,26 1,28 1,29 3,32 35,34 1,35 5.1,36 0.127,37 8,38 54,39 59.011,40 65.053,41 42.364,42 40.315,43 1.7,44 5.301}
{0 CHEMBL199745,1 8.168,2 48.5,3 40.9,4 1.005,5 1.109,6 0.706,7 0.675,8 539.06,9 3,10 28,11 66,13 30,14 43,16 70,17 32,18 1,20 28,21 4,22 2,24 27,25 7,26 1,28 2,29 4,32 39,34 1,35 6.1,36 0.129,37 9,38 59,39 66.323,40 73.176,41 46.585,42 44.578,43 1.5,44 4.42}
{0 CHEMBL199751,1 7.707,2 48.5,3 44.1,4 0.995,5 1.107,6 0.701,7 0.66,8 524.09,9 1.5,10 28,11 68,13 29,14 42,16 72,17 33,18 1,20 27,21 6,22 1,24 30,25 5,26 1,28 1,29 3,32 38,34 1,35 4.4,36 0.139,37 10,38 57,39 67.661,40 75.299,41 47.648,42 44.895,43 1.5,44 5.699}
{0 CHEMBL199867,1 7.461,2 47.3,3 45.9,4 0.992,5 1.11,6 0.691,7 0.648,8 552.15,9 1.4,10 28,11 74,13 29,14 44,16 78,17 35,18 1,20 27,21 8,22 1,24 34,25 5,26 1,28 1,29 3,32 40,34 1,35 4.1,36 0.128,37 10,38 59,39 73.429,40 82.129,41 51.171,42 47.949,43 1.4,44 4.699}
{0 CHEMBL199979,1 8.174,2 47.1,3 42.9,4 1.001,5 1.106,6 0.711,7 0.669,8 572.16,9 1.4,10 28,11 70,13 31,14 44,16 74,17 33,18 1,20 27,21 6,22 3,24 30,25 7,26 2,28 1,29 4,31 1,32 40,34 1,35 5.7,36 0.135,37 10,38 61,39 70.065,40 77.428,41 49.75,42 46.797,43 1.4,44 4.032}
{0 CHEMBL200025,1 8.06,2 47.8,3 43.5,4 0.996,5 1.105,6 0.714,7 0.668,8 556.16,9 1.4,10 28,11 69,13 30,14 43,16 73,17 33,18 1,20 27,21 6,22 2,24 30,25 6,26 2,28 1,29 3,31 1,32 39,34 1,35 4.3,36 0.137,37 10,38 59,39 68.738,40 76.219,41 49.296,42 46.082,43 1.4,44 4.745}
{0 CHEMBL200054,1 7.963,2 48.4,3 42.2,4 1,5 1.104,6 0.709,7 0.671,8 509.66,9 1.6,10 28,11 64,13 31,14 41,16 68,17 31,20 27,21 4,22 3,24 27,25 6,26 1,28 1,29 4,31 1,32 37,35 6.3,36 0.118,37 8,38 58,39 63.974,40 70.654,41 45.37,42 42.916,44 5.699}
{0 CHEMBL201135,1 9.04,2 48.4,3 39.1,4 1.01,5 1.102,6 0.736,7 0.696,8 578.54,9 1.6,10 28,11 64,13 31,14 43,16 68,17 31,18 2,20 27,21 4,22 3,24 25,25 8,26 3,28 1,29 4,31 1,32 39,34 2,35 6.3,36 0.118,37 8,38 60,39 64.622,40 70.542,41 47.085,42 44.571,43 3.1,44 5.523}
{0 CHEMBL201194,1 8.502,2 48.4,3 40.6,4 1.005,5 1.103,6 0.722,7 0.683,8 544.1,9 1.6,10 28,11 64,13 31,14 42,16 68,17 31,18 1,20 27,21 4,22 3,24 26,25 7,26 2,28 1,29 4,31 1,32 38,34 1,35 6.3,36 0.118,37 8,38 59,39 64.298,40 70.598,41 46.227,42 43.744,43 1.6,44 5.222}
{0 CHEMBL201266,1 7.72,2 50,3 43.8,4 0.991,5 1.104,6 0.71,7 0.666,8 494.06,9 1.6,10 28,11 64,13 29,14 40,16 68,17 32,18 1,20 27,21 5,22 1,24 28,25 4,26 1,28 1,29 2,32 36,34 1,35 3.1,36 0.118,37 8,38 55,39 63.451,40 70.674,41 45.432,42 42.654,43 1.6,44 5.699}
{0 CHEMBL201267,1 8.717,2 50,3 41.9,4 0.997,5 1.103,6 0.72,7 0.678,8 540.48,9 1.6,10 28,11 62,13 29,14 40,15 1,16 66,17 31,20 27,21 4,22 1,24 26,25 5,26 1,28 1,29 3,32 36,34 1,35 4.8,36 0.121,37 8,38 55,39 61.8,40 68.366,41 44.62,42 42.039,43 1.6,44 5.699}
{0 CHEMBL201428,1 8.574,2 50.8,3 37.7,4 1.009,5 1.104,6 0.722,7 0.697,8 523.01,9 3.3,10 28,11 61,13 31,14 42,16 65,17 31,18 1,20 29,21 2,22 3,24 23,25 7,26 1,28 2,29 4,32 38,34 1,35 6.6,36 0.108,37 7,38 59,39 61.556,40 67.345,41 44.063,42 42.524,43 1.6,44 4.585}
{0 CHEMBL201647,1 8.556,2 50,3 40.3,4 1.004,5 1.103,6 0.726,7 0.688,8 530.47,9 1.6,10 28,11 62,13 29,14 41,16 66,17 31,18 2,20 27,21 4,22 1,24 25,25 6,26 2,28 1,29 3,32 37,34 2,35 4.8,36 0.121,37 8,38 56,39 62.218,40 68.412,41 44.983,42 42.669,43 3.2,44 4.959}
{0 CHEMBL202821,1 7.447,2 48.4,3 43.8,4 0.995,5 1.11,6 0.692,7 0.657,8 476.61,9 3.1,10 28,11 64,13 29,14 40,16 68,17 31,20 27,21 4,22 1,24 28,25 5,28 2,29 3,32 36,35 4.7,36 0.118,37 8,38 55,39 63.672,40 71.022,41 44.273,42 42.036,44 5.097}
{0 CHEMBL203311,1 8,2 50,3 41.9,4 0.998,5 1.104,6 0.712,7 0.675,8 496.03,9 1.6,10 28,11 62,13 29,14 40,16 66,17 31,18 1,20 27,21 4,22 1,24 26,25 5,26 1,28 1,29 3,32 36,34 1,35 4.8,36 0.121,37 8,38 55,39 61.894,40 68.468,41 44.125,42 41.842,43 1.6,44 4.046}
{0 CHEMBL204302,1 6.676,2 41.3,3 50.8,4 0.991,5 1.125,6 0.648,7 0.605,8 420.6,9 3.2,10 16,11 63,13 18,14 33,16 65,17 26,20 16,21 10,22 2,24 32,25 5,28 2,29 3,32 31,35 4.8,36 0.2,37 13,38 43,39 62.44,40 70.853,41 40.796,42 38.089,44 6.518}
{0 CHEMBL204618,1 7.025,2 42.2,3 48.4,4 1,5 1.121,6 0.652,7 0.617,8 449.59,9 1.6,10 16,11 64,13 19,14 35,16 66,17 27,20 17,21 10,22 3,24 31,25 6,28 1,29 5,32 33,35 7.8,36 0.212,37 14,38 46,39 63.992,40 71.773,41 41.699,42 39.497,44 6.42}
{0 CHEMBL204948,1 8.509,2 57.7,3 34.6,4 1.005,5 1.088,6 0.744,7 0.723,8 442.48,10 24,11 52,13 28,14 39,16 57,17 30,20 30,22 4,24 18,25 4,29 4,32 34,35 7.7,36 0.053,37 3,38 55,39 52.262,40 56.574,41 38.671,42 37.6,44 5.075}
{0 CHEMBL205219,1 8.509,2 57.7,3 34.6,4 1.005,5 1.088,6 0.744,7 0.723,8 442.48,10 24,11 52,13 28,14 39,16 57,17 30,20 30,22 4,24 18,25 4,29 4,32 34,35 7.7,36 0.053,37 3,38 55,39 52.262,40 56.574,41 38.671,42 37.6,44 5.222}
{0 CHEMBL205326,1 8.509,2 57.7,3 34.6,4 1.005,5 1.088,6 0.744,7 0.723,8 442.48,10 24,11 52,13 28,14 39,16 57,17 30,20 30,22 4,24 18,25 4,29 4,32 34,35 7.7,36 0.053,37 3,38 55,39 52.262,40 56.574,41 38.671,42 37.6,44 4.924}
{0 CHEMBL205753,1 7.355,2 41.9,3 48.4,4 1,5 1.121,6 0.663,7 0.623,8 456.02,9 1.6,10 16,11 62,13 18,14 34,16 64,17 26,18 1,20 16,21 10,22 2,24 30,25 6,26 1,28 1,29 4,32 32,34 1,35 6.5,36 0.203,37 13,38 44,39 61.989,40 69.508,41 41.103,42 38.61,43 1.6,44 6.94}
{0 CHEMBL205892,1 6.8,2 41.9,3 50,4 0.995,5 1.122,6 0.649,7 0.609,8 421.58,9 1.6,10 16,11 62,13 18,14 33,16 64,17 26,20 16,21 10,22 2,24 31,25 5,28 1,29 4,32 31,35 6.5,36 0.203,37 13,38 43,39 61.665,40 69.564,41 40.245,42 37.783,44 7.601}
{0 CHEMBL205941,1 6.8,2 41.9,3 50,4 0.995,5 1.122,6 0.649,7 0.609,8 421.58,9 1.6,10 16,11 62,13 18,14 33,16 64,17 26,20 16,21 10,22 2,24 31,25 5,28 1,29 4,32 31,35 6.5,36 0.203,37 13,38 43,39 61.665,40 69.564,41 40.245,42 37.783,44 5.644}
{0 CHEMBL206054,1 6.8,2 41.9,3 50,4 0.995,5 1.122,6 0.649,7 0.609,8 421.58,9 1.6,10 16,11 62,13 18,14 33,16 64,17 26,20 16,21 10,22 2,24 31,25 5,28 1,29 4,32 31,35 6.5,36 0.203,37 13,38 43,39 61.665,40 69.564,41 40.245,42 37.783,44 5}
{0 CHEMBL206530,1 6.8,2 41.9,3 50,4 0.995,5 1.122,6 0.649,7 0.609,8 421.58,9 1.6,10 16,11 62,13 18,14 33,16 64,17 26,20 16,21 10,22 2,24 31,25 5,28 1,29 4,32 31,35 6.5,36 0.203,37 13,38 43,39 61.665,40 69.564,41 40.245,42 37.783,44 5.097}
{0 CHEMBL206906,1 6.702,2 41.5,3 50.8,4 0.993,5 1.123,6 0.646,7 0.605,8 435.61,9 1.5,10 16,11 65,13 18,14 34,16 67,17 27,20 16,21 11,22 2,24 33,25 5,28 1,29 4,32 32,35 6.2,36 0.209,37 14,38 44,39 64.549,40 72.979,41 42.006,42 39.309,44 5}
{0 CHEMBL206943,1 6.455,2 40.5,3 52.7,4 0.989,5 1.125,6 0.639,7 0.593,8 477.7,9 1.4,10 16,11 74,13 18,14 37,16 76,17 30,20 16,21 14,22 2,24 39,25 5,28 1,29 4,32 35,35 5.4,36 0.184,37 14,38 47,39 73.199,40 83.225,41 47.29,42 43.89,44 6.554}
{0 CHEMBL207086,1 7.629,2 43.7,3 43.7,4 1.009,5 1.121,6 0.668,7 0.644,8 541.65,9 4.2,10 18,11 71,13 23,14 43,16 74,17 31,20 24,21 7,22 5,24 31,25 9,28 3,29 6,32 40,35 8.5,36 0.162,37 12,38 57,39 71.64,40 79.564,41 47.404,42 45.728,44 5.62}
{0 CHEMBL207279,1 8.24,2 47.7,3 38.5,4 1.015,5 1.113,6 0.694,7 0.679,8 535.59,9 4.6,10 24,11 65,13 28,14 44,16 69,17 31,20 28,21 3,22 4,24 25,25 9,28 3,29 6,32 40,35 9.2,36 0.13,37 9,38 60,39 65.989,40 72.319,41 45.119,42 44.148,44 4.301}
{0 CHEMBL207418,1 7.993,2 44.3,3 41,4 1.016,5 1.12,6 0.674,7 0.658,8 487.55,9 4.9,10 18,11 61,13 22,14 39,16 64,17 27,20 22,21 5,22 4,24 25,25 9,28 3,29 6,32 36,35 9.8,36 0.141,37 9,38 52,39 61.989,40 68.319,41 41.119,42 40.148,44 5.125}
{0 CHEMBL207446,1 8.057,2 45.2,3 40.3,4 1.016,5 1.118,6 0.679,7 0.664,8 499.56,9 4.8,10 18,11 62,13 23,14 40,16 65,17 28,20 24,21 4,22 5,24 25,25 9,28 3,29 6,32 37,35 9.7,36 0.154,37 10,38 54,39 62.989,40 69.319,41 42.119,42 41.148,44 5.301}
{0 CHEMBL207595,1 6.71,2 43.3,3 50,4 0.987,5 1.12,6 0.66,7 0.614,8 402.58,9 3.3,10 16,11 60,13 18,14 32,16 62,17 26,19 1,20 15,21 10,22 1,24 30,25 4,28 2,29 2,32 30,33 1,35 3.3,36 0.194,37 12,38 43,39 59.229,40 67.228,41 39.58,42 36.848,44 5}
{0 CHEMBL207977,1 6.92,2 41.8,3 49.3,4 0.998,5 1.122,6 0.649,7 0.612,8 463.62,9 1.5,10 16,11 67,13 19,14 36,16 69,17 28,20 17,21 11,22 3,24 33,25 6,28 1,29 5,32 34,35 7.5,36 0.203,37 14,38 47,39 66.876,40 75.189,41 43.461,42 41.024,44 7.859}
{0 CHEMBL207998,1 8.317,2 46.2,3 38.5,4 1.022,5 1.115,6 0.684,7 0.674,8 432.46,9 3.8,10 18,11 52,13 21,14 35,16 55,17 24,20 21,21 3,22 3,24 20,25 8,28 2,29 6,32 32,35 11.5,36 0.145,37 8,38 47,39 53.12,40 57.99,41 35.591,42 35.073,44 4.301}
{0 CHEMBL208073,1 7.995,2 47.2,3 40.3,4 1.011,5 1.113,6 0.689,7 0.669,8 575.66,9 4.2,10 24,11 72,13 29,14 47,16 76,17 34,20 30,21 4,22 5,24 29,25 9,28 3,29 6,32 43,35 8.3,36 0.145,37 11,38 64,39 72.756,40 80.149,41 49.642,42 48.201,44 5.886}
{0 CHEMBL208360,1 6.8,2 41.9,3 50,4 0.995,5 1.122,6 0.649,7 0.609,8 421.58,9 1.6,10 16,11 62,13 18,14 33,16 64,17 26,20 16,21 10,22 2,24 31,25 5,28 1,29 4,32 31,35 6.5,36 0.203,37 13,38 43,39 61.665,40 69.564,41 40.245,42 37.783,44 5}
{0 CHEMBL208401,1 6.748,2 40.6,3 50.7,4 0.997,5 1.125,6 0.641,7 0.602,8 465.64,9 1.4,10 16,11 69,13 18,14 36,16 71,17 28,20 16,21 12,22 2,24 35,25 6,28 1,29 5,32 34,35 7.2,36 0.225,37 16,38 46,39 68.76,40 77.604,41 44.222,42 41.551,44 6.678}
{0 CHEMBL208432,1 7.696,2 43.3,3 43.3,4 1.011,5 1.122,6 0.666,7 0.645,8 515.61,9 4.5,10 18,11 67,13 22,14 41,16 70,17 29,20 22,21 7,22 4,24 29,25 9,28 3,29 6,32 38,35 9,36 0.157,37 11,38 54,39 67.756,40 75.149,41 44.642,42 43.201,44 5.252}
{0 CHEMBL208570,1 8.009,2 45.8,3 40.7,4 1.015,5 1.116,6 0.68,7 0.663,8 472.53,9 3.4,10 18,11 59,13 22,14 38,16 62,17 27,20 23,21 4,22 4,24 24,25 8,28 2,29 6,32 35,35 10.2,36 0.161,37 10,38 51,39 59.887,40 65.82,41 40.114,42 39.126,44 4.301}
{0 CHEMBL208571,1 8.255,2 47.4,3 38.6,4 1.018,5 1.112,6 0.69,7 0.677,8 470.51,9 3.5,10 18,11 57,13 22,14 38,16 60,17 27,19 2,20 21,21 4,22 3,24 22,25 8,28 2,29 6,32 35,33 1,35 10.5,36 0.133,37 8,38 52,39 58.003,40 63.405,41 39.352,42 38.6,44 4.638}
{0 CHEMBL208972,1 8.118,2 45.5,3 40,4 1.018,5 1.116,6 0.679,7 0.665,8 446.49,9 3.6,10 18,11 55,13 21,14 36,16 58,17 25,20 21,21 4,22 3,24 22,25 8,28 2,29 6,32 33,35 10.9,36 0.155,37 9,38 48,39 56.003,40 61.405,41 37.352,42 36.6,44 5.174}
{0 CHEMBL210197,1 7.78,2 44.3,3 42.6,4 1.013,5 1.119,6 0.67,7 0.65,8 474.55,9 3.3,10 18,11 61,13 21,14 38,16 64,17 27,20 21,21 6,22 3,24 26,25 8,28 2,29 6,32 35,35 9.8,36 0.172,37 11,38 50,39 61.771,40 68.235,41 40.875,42 39.653,44 4.301}
{0 CHEMBL210464,1 8.083,2 47.1,3 39.7,4 1.013,5 1.114,6 0.689,7 0.672,8 549.62,9 4.4,10 24,11 68,13 28,14 45,16 72,17 32,20 28,21 4,22 4,24 27,25 9,28 3,29 6,32 41,35 8.8,36 0.139,37 10,38 61,39 68.872,40 75.734,41 46.881,42 45.675,44 5.456}
{0 CHEMBL210690,1 7.94,2 44.8,3 41.4,4 1.015,5 1.118,6 0.674,7 0.657,8 460.52,9 3.4,10 18,11 58,13 21,14 37,16 61,17 26,20 21,21 5,22 3,24 24,25 8,28 2,29 6,32 34,35 10.3,36 0.164,37 10,38 49,39 58.887,40 64.82,41 39.114,42 38.126,44 4.907}
{0 CHEMBL220577,1 8.184,2 47,3 42.2,4 1.003,5 1.108,6 0.708,7 0.67,8 679.28,9 2.4,10 34,11 83,13 37,14 53,16 88,17 39,18 1,20 33,21 6,22 3,24 35,25 9,26 2,28 2,29 5,31 1,32 48,34 1,35 6,36 0.159,37 14,38 73,39 83.261,40 91.966,41 58.733,42 55.587,43 1.2,44 5.301}
{0 CHEMBL220734,1 7.92,2 46.4,3 44,4 0.998,5 1.109,6 0.703,7 0.66,8 665.3,9 2.4,10 34,11 84,13 36,14 52,16 89,17 39,18 1,20 32,21 7,22 2,24 37,25 8,26 2,28 2,29 4,31 1,32 47,34 1,35 4.8,36 0.157,37 14,38 71,39 83.818,40 93.172,41 59.04,42 55.399,43 1.2,44 4.523}
{0 CHEMBL220735,1 8.184,2 47,3 42.2,4 1.003,5 1.108,6 0.708,7 0.67,8 679.28,9 2.4,10 34,11 83,13 37,14 53,16 88,17 39,18 1,20 33,21 6,22 3,24 35,25 9,26 2,28 2,29 5,31 1,32 48,34 1,35 6,36 0.159,37 14,38 73,39 83.261,40 91.966,41 58.733,42 55.587,43 1.2,44 6.796}
{0 CHEMBL220736,1 8.116,2 45.9,3 41.2,4 1.01,5 1.112,6 0.694,7 0.667,8 689.84,9 3.5,10 34,11 85,13 39,14 55,16 90,17 39,20 33,21 6,22 5,24 35,25 11,26 1,28 3,29 7,31 1,32 50,35 8.2,36 0.167,37 15,38 77,39 85.811,40 94.524,41 59.029,42 56.684,44 6.921}
{0 CHEMBL220738,1 9.014,2 47,3 39.8,4 1.011,5 1.107,6 0.728,7 0.69,8 748.16,9 2.4,10 34,11 83,13 37,14 55,16 88,17 39,18 3,20 33,21 6,22 3,24 33,25 11,26 4,28 2,29 5,31 1,32 50,34 3,35 6,36 0.159,37 14,38 75,39 83.909,40 91.854,41 60.449,42 57.242,43 3.6,44 6.959}
{0 CHEMBL220806,1 8.316,2 47.5,3 41.3,4 1.005,5 1.107,6 0.712,7 0.676,8 665.25,9 2.5,10 34,11 80,13 37,14 52,16 85,17 38,18 1,20 33,21 5,22 3,24 33,25 9,26 2,28 2,29 5,31 1,32 47,34 1,35 6.3,36 0.153,37 13,38 72,39 80.378,40 88.551,41 56.972,42 54.06,43 1.3,44 5.523}
{0 CHEMBL221504,1 8.674,2 50,3 37.8,4 1.01,5 1.107,6 0.726,7 0.697,8 850.03,9 3.1,10 36,11 98,13 42,14 68,16 105,17 49,20 43,21 6,22 6,23 2,24 37,25 12,26 2,28 3,29 5,31 2,32 61,34 2,35 5.1,36 0.114,37 12,38 92,39 99.025,40 108.535,41 71.165,42 68.261,43 2,44 6.959}
{0 CHEMBL223204,1 7.985,2 48.4,3 42.2,4 1,5 1.109,6 0.705,7 0.67,8 511.05,9 3.1,10 28,11 64,13 29,14 41,16 68,17 31,18 1,20 27,21 4,22 1,24 27,25 6,26 1,28 2,29 3,32 37,34 1,35 4.7,36 0.132,37 9,38 56,39 63.996,40 70.966,41 45.131,42 42.863,43 1.6,44 5.155}
{0 CHEMBL223258,1 7.971,2 48.5,3 42.4,4 1.002,5 1.107,6 0.702,7 0.668,8 526.06,9 1.5,10 28,11 66,13 29,14 42,16 70,17 32,18 1,20 27,21 5,22 1,24 28,25 6,26 1,28 1,29 4,32 38,34 1,35 6.1,36 0.143,37 10,38 57,39 66.105,40 73.093,41 46.341,42 44.083,43 1.5,44 5.26}
{0 CHEMBL223670,1 9.014,2 47,3 39.8,4 1.011,5 1.107,6 0.728,7 0.69,8 748.16,9 2.4,10 34,11 83,13 37,14 55,16 88,17 39,18 3,20 33,21 6,22 3,24 33,25 11,26 4,28 2,29 5,31 1,32 50,34 3,35 6,36 0.159,37 14,38 75,39 83.909,40 91.854,41 60.449,42 57.242,43 3.6,44 6.721}
{0 CHEMBL232782,1 7.256,2 44.6,3 46.2,4 0.998,5 1.124,6 0.67,7 0.635,8 471.62,9 4.6,10 23,11 65,13 24,14 38,16 68,17 29,20 22,21 7,22 1,23 1,24 30,25 6,28 3,29 2,32 35,34 1,35 3.1,36 0.162,37 11,38 50.5,39 64.843,40 73.066,41 43.523,42 41.252,43 1.5,44 4.824}
{0 CHEMBL241891,1 7.102,2 41.5,3 47.7,4 1,5 1.125,6 0.654,7 0.62,8 461.61,9 4.6,10 16,11 65,13 19,14 37,16 68,17 27,20 17,21 10,22 3,24 31,25 7,28 3,29 4,32 34,35 6.2,36 0.191,37 13,38 48,39 64.985,40 73.145,41 42.495,42 40.299,44 5.456}
{0 CHEMBL241892,1 6.963,2 40.6,3 48.4,4 0.995,5 1.13,6 0.654,7 0.615,8 445.62,9 7.8,10 21,11 64,13 22,14 36,16 67,17 26,20 16,21 10,22 1,24 31,25 7,28 5,29 2,32 33,35 3.1,36 0.194,37 13,38 47.5,39 63.65,40 72.308,41 41.836,42 39.385,44 5.959}
{0 CHEMBL242101,1 7.135,2 39.1,3 50,4 0.998,5 1.125,6 0.655,7 0.609,8 456.66,9 3.1,10 16,11 64,13 19,14 34,16 66,17 25,20 15,21 10,22 3,24 32,25 7,26 1,28 2,29 4,31 1,32 32,35 6.3,36 0.197,37 13,38 45,39 63.843,40 71.982,41 41.898,42 38.991,44 6.409}
{0 CHEMBL242320,1 7.025,2 38.8,3 50.7,4 0.996,5 1.125,6 0.652,7 0.605,8 470.69,9 3,10 16,11 67,13 19,14 35,16 69,17 26,20 15,21 11,22 3,24 34,25 7,26 1,28 2,29 4,31 1,32 33,35 6,36 0.203,37 14,38 46,39 66.727,40 75.397,41 43.659,42 40.518,44 6.509}
{0 CHEMBL242960,1 6.585,2 40.9,3 51.5,4 0.99,5 1.125,6 0.645,7 0.6,8 434.63,9 3,10 16,11 66,13 18,14 34,16 68,17 27,20 16,21 11,22 2,24 34,25 5,28 2,29 3,32 32,35 4.5,36 0.191,37 13,38 44,39 65.323,40 74.268,41 42.557,42 39.616,44 6.432}
{0 CHEMBL242961,1 6.502,2 40.6,3 52.2,4 0.989,5 1.126,6 0.642,7 0.596,8 448.66,9 2.9,10 16,11 69,13 18,14 35,16 71,17 28,20 16,21 12,22 2,24 36,25 5,28 2,29 3,32 33,35 4.3,36 0.183,37 13,38 45,39 68.207,40 77.683,41 44.319,42 41.143,44 6.076}
{0 CHEMBL258651,1 6.662,2 40.3,3 51.4,4 0.995,5 1.125,6 0.639,7 0.598,8 479.67,9 1.4,10 16,11 72,13 18,14 37,16 74,17 29,20 16,21 13,22 2,24 37,25 6,28 1,29 5,32 35,35 6.9,36 0.216,37 16,38 47,39 71.643,40 81.019,41 45.983,42 43.078,44 5.678}
{0 CHEMBL259823,1 6.946,2 41.3,3 49.2,4 1,5 1.123,6 0.646,7 0.611,8 437.58,9 1.6,10 16,11 63,13 18,14 34,16 65,17 26,20 16,21 10,22 2,24 31,25 6,28 1,29 5,32 32,35 7.9,36 0.215,37 14,38 44,39 62.992,40 70.773,41 40.699,42 38.497,44 5.481}
{0 CHEMBL260247,1 7.183,2 40.6,3 47.8,4 1.008,5 1.125,6 0.643,7 0.615,8 495.62,9 1.4,10 16,11 69,13 19,14 38,16 71,17 28,20 17,21 11,22 3,24 33,25 8,28 1,29 7,32 36,35 10.1,36 0.225,37 16,38 49,39 69.531,40 77.607,41 44.37,42 42.454,44 5.886}
{0 CHEMBL260248,1 6.982,2 40,3 49.3,4 1.004,5 1.126,6 0.639,7 0.607,8 523.68,9 1.3,10 16,11 75,13 19,14 40,16 77,17 30,20 17,21 13,22 3,24 37,25 8,28 1,29 7,32 38,35 9.3,36 0.234,37 18,38 51,39 75.298,40 84.438,41 47.892,42 45.507,44 6.461}
{0 CHEMBL260365,1 6.843,2 40.9,3 50,4 0.998,5 1.124,6 0.643,7 0.606,8 451.61,9 1.5,10 16,11 66,13 18,14 35,16 68,17 27,20 16,21 11,22 2,24 33,25 6,28 1,29 5,32 33,35 7.6,36 0.206,37 14,38 45,39 65.876,40 74.189,41 42.461,42 40.024,44 5.921}
{0 CHEMBL260517,1 7.237,2 43,3 46.8,4 1.004,5 1.119,6 0.657,7 0.627,8 571.72,9 1.3,10 22,11 79,13 25,14 45,16 82,17 34,20 23,21 11,22 3,24 37,25 8,28 1,29 7,32 42,35 8.9,36 0.207,37 17,38 59,39 79.298,40 88.438,41 51.892,42 49.507,44 5.824}
{0 CHEMBL260708,1 6.812,2 39.5,3 50.6,4 1.001,5 1.127,6 0.635,7 0.6,8 551.74,9 1.2,10 16,11 81,13 19,14 42,16 83,17 32,20 17,21 15,22 3,24 41,25 8,28 1,29 7,32 40,35 8.6,36 0.241,37 20,38 53,39 81.065,40 91.268,41 51.415,42 48.561,44 6.262}
{0 CHEMBL260716,1 6.441,2 39.5,3 53.1,4 0.991,5 1.127,6 0.633,7 0.588,8 521.76,9 1.2,10 16,11 81,13 18,14 40,16 83,17 32,20 16,21 16,22 2,24 43,25 6,28 1,29 5,32 38,35 6.2,36 0.229,37 19,38 50,39 80.294,40 91.265,41 51.268,42 47.658,44 5}
{0 CHEMBL266374,1 9.227,2 46,3 39.1,4 1.019,5 1.118,6 0.708,7 0.681,8 802.74,9 3.4,10 24,11 87,13 30,14 58,15 1,16 92,17 40,20 31,21 9,22 6,23 2,24 34,25 13,26 2,28 3,29 6,31 1,32 53,34 3,35 6.9,36 0.12,37 11,38 76,39 88.621,40 97.251,41 61.563,42 59.287,43 3.4,44 7.658}
{0 CHEMBL266580,1 8.203,2 48.9,3 39.8,4 1.005,5 1.106,6 0.711,7 0.681,8 721.88,9 3.4,10 30,11 88,13 36,14 59,16 94,17 43,20 37,21 6,22 6,24 35,25 10,26 1,28 3,29 6,31 1,32 53,35 6.8,36 0.117,37 11,38 80,39 88.483,40 97.315,41 62.574,42 59.969,44 5}
{0 CHEMBL267258,1 7.82,2 46.7,3 42.9,4 1.002,5 1.114,6 0.694,7 0.66,8 821.05,9 3.8,10 30,11 105,13 37,14 66,16 111,17 49,20 39,21 10,22 7,23 1,24 45,25 11,26 1,28 4,29 5,31 1,32 60,34 1,35 4.8,36 0.126,37 14,38 88,39 105.188,40 117.019,41 72.87,42 69.293,43 1,44 8.509}
{0 CHEMBL267697,1 8.612,2 48.9,3 37.5,4 1.017,5 1.114,6 0.71,7 0.69,8 757.86,9 3.4,10 30,11 88,13 36,14 61,16 94,17 43,20 37,21 6,22 6,23 2,24 33,25 12,26 1,28 3,29 6,31 1,32 55,34 2,35 6.8,36 0.117,37 11,38 82,39 89.509,40 97.994,41 62.449,42 60.735,43 2.3,44 7.31}
{0 CHEMBL268419,1 8.773,2 48.9,3 38.6,4 1.006,5 1.103,6 0.737,7 0.697,8 772.01,9 3.4,10 30,11 88,13 36,14 60,16 94,17 43,20 37,21 6,22 6,23 1,24 34,25 11,26 3,28 3,29 4,31 3,32 54,34 1,35 4.5,36 0.117,37 11,38 81,39 88.494,40 97.075,41 64.898,42 61.297,43 1.1,44 7.143}
{0 CHEMBL268434,1 8.59,2 48.9,3 38.6,4 1.008,5 1.106,6 0.724,7 0.691,8 755.94,9 3.4,10 30,11 88,13 36,14 60,16 94,17 43,20 37,21 6,22 6,23 1,24 34,25 11,26 2,28 3,29 5,31 2,32 54,34 1,35 5.7,36 0.117,37 11,38 81,39 88.745,40 97.365,41 63.705,42 60.824,43 1.1,44 7.469}
{0 CHEMBL268896,1 9.02,2 46,3 40.2,4 1.013,5 1.114,6 0.708,7 0.677,8 784.75,9 3.4,10 24,11 87,13 30,14 57,15 1,16 92,17 40,20 31,21 9,22 6,23 1,24 35,25 12,26 2,28 3,29 6,31 1,32 52,34 2,35 6.9,36 0.12,37 11,38 75,39 88.109,40 96.911,41 61.625,42 58.904,43 2.3,44 7.42}
{0 CHEMBL268904,1 8.203,2 48.9,3 39.8,4 1.005,5 1.106,6 0.711,7 0.681,8 721.88,9 3.4,10 30,11 88,13 36,14 59,16 94,17 43,20 37,21 6,22 6,24 35,25 10,26 1,28 3,29 6,31 1,32 53,35 6.8,36 0.117,37 11,38 80,39 88.483,40 97.315,41 62.574,42 59.969,44 5}
{0 CHEMBL268905,1 8.203,2 48.9,3 39.8,4 1.005,5 1.106,6 0.711,7 0.681,8 721.88,9 3.4,10 30,11 88,13 36,14 59,16 94,17 43,20 37,21 6,22 6,24 35,25 10,26 1,28 3,29 6,31 1,32 53,35 6.8,36 0.117,37 11,38 80,39 88.483,40 97.315,41 62.574,42 59.969,44 6.783}
{0 CHEMBL269787,1 9.014,2 47,3 39.8,4 1.011,5 1.107,6 0.728,7 0.69,8 748.16,9 2.4,10 34,11 83,13 37,14 55,16 88,17 39,18 3,20 33,21 6,22 3,24 33,25 11,26 4,28 2,29 5,31 1,32 50,34 3,35 6,36 0.159,37 14,38 75,39 83.909,40 91.854,41 60.449,42 57.242,43 3.6,44 6.841}
{0 CHEMBL272342,1 8.779,2 47.1,3 41.2,4 1.005,5 1.107,6 0.727,7 0.683,8 746.19,9 2.4,10 34,11 85,13 37,14 55,16 90,17 40,18 3,20 33,21 7,22 3,24 35,25 10,26 4,28 2,29 4,31 1,32 50,34 3,35 4.7,36 0.156,37 14,38 75,39 85.465,40 94.06,41 61.756,42 58.054,43 3.5,44 7.398}
{0 CHEMBL281211,1 6.366,2 37.5,3 55.4,4 0.998,5 1.148,6 0.611,7 0.568,8 356.52,11 56,13 5,14 24,16 55,17 21,20 9,21 12,22 5,23 3,24 31,25 4,29 1,32 25,34 3,35 1.8,36 0.255,37 14,38 29,39 55.887,40 64.287,41 34.211,42 31.82,43 5.4,44 5.638}
{0 CHEMBL29838,1 7.617,2 44.3,3 45.9,4 1.001,5 1.111,6 0.682,7 0.642,8 464.62,10 18,11 61,13 20,14 35,16 63,17 27,20 20,21 7,22 2,24 28,25 6,26 1,29 5,31 1,32 33,35 8.2,36 0.222,37 14,38 46,39 61.083,40 67.78,41 41.58,42 39.136,44 7.398}
{0 CHEMBL30108,1 6.706,2 39.4,3 51.5,4 1,5 1.126,6 0.631,7 0.595,8 442.6,10 12,11 66,13 14,14 33,16 67,17 26,20 14,21 12,22 2,24 34,25 6,29 6,32 32,35 9.1,36 0.254,37 17,38 41,39 65.985,40 74.315,41 41.671,42 39.244,44 6.602}
{0 CHEMBL313583,1 6.676,2 42.9,3 50.8,4 0.991,5 1.119,6 0.651,7 0.608,8 420.59,10 6,11 63,13 13,14 32,16 64,17 27,20 18,21 9,22 7,24 32,25 4,29 4,32 31,35 6.3,36 0.109,37 7,38 42,39 62.447,40 70.481,41 41,42 38.288,44 4.398}
{0 CHEMBL334902,1 7.603,2 42,3 45.7,4 1.005,5 1.12,6 0.671,7 0.636,8 615.81,9 3.7,10 22,11 81,13 26,14 49,16 86,17 34,20 22,21 12,22 4,24 37,25 10,26 1,28 3,29 6,31 1,32 44,35 7.4,36 0.128,37 11,38 64,39 81.367,40 90.73,41 54.336,42 51.496,44 4.699}
{0 CHEMBL337790,1 7.445,2 50,3 43.5,4 0.993,5 1.105,6 0.698,7 0.662,8 461.59,9 1.6,10 28,11 62,13 29,14 39,16 66,17 31,20 27,21 4,22 1,24 27,25 4,28 1,29 3,32 35,35 4.8,36 0.106,37 7,38 54,39 61.571,40 68.524,41 43.267,42 41.014,44 6.046}
{0 CHEMBL342487,1 7.323,2 47.8,3 44.8,4 0.993,5 1.111,6 0.687,7 0.65,8 490.64,9 3,10 28,11 67,13 29,14 41,16 71,17 32,20 27,21 5,22 1,24 30,25 5,28 2,29 3,32 37,35 4.5,36 0.113,37 8,38 56,39 66.556,40 74.438,41 46.034,42 43.562,44 4.62}
{0 CHEMBL343124,1 8.169,2 50.8,3 40.7,4 1,5 1.103,6 0.718,7 0.683,8 482,9 1.7,10 28,11 59,13 29,14 39,16 63,17 30,18 1,20 27,21 3,22 1,24 24,25 5,26 1,28 1,29 3,32 35,34 1,35 5.1,36 0.111,37 7,38 54,39 59.011,40 65.053,41 42.364,42 40.315,43 1.7,44 6.398}
{0 CHEMBL343391,1 8.169,2 50.8,3 40.7,4 1,5 1.103,6 0.718,7 0.683,8 482,9 1.7,10 28,11 59,13 29,14 39,16 63,17 30,18 1,20 27,21 3,22 1,24 24,25 5,26 1,28 1,29 3,32 35,34 1,35 5.1,36 0.111,37 7,38 54,39 59.011,40 65.053,41 42.364,42 40.315,43 1.7,44 5.678}
{0 CHEMBL344176,1 8.075,2 49.2,3 39.3,4 1.009,5 1.108,6 0.699,7 0.679,8 492.56,9 3.3,10 28,11 61,13 31,14 41,16 65,17 30,20 27,21 3,22 3,24 24,25 7,28 2,29 5,32 37,35 8.2,36 0.123,37 8,38 58,39 61.56,40 67.611,41 42.659,42 41.412,44 6.398}
{0 CHEMBL344686,1 7.581,2 49.2,3 42.9,4 0.998,5 1.107,6 0.694,7 0.662,8 477.59,9 1.6,10 28,11 63,13 29,14 40,16 67,17 31,20 27,21 4,22 1,24 27,25 5,28 1,29 4,32 36,35 6.3,36 0.119,37 8,38 55,39 62.898,40 69.734,41 43.722,42 41.729,44 5.721}
{0 CHEMBL345056,1 7.744,2 45.7,3 43.6,4 1.001,5 1.112,6 0.69,7 0.655,8 727.94,9 3.2,10 34,11 94,13 38,14 59,16 100,17 43,20 34,21 9,22 4,24 41,25 10,26 1,28 3,29 6,31 1,32 53,35 6.4,36 0.12,37 12,38 80,39 94.134,40 104.56,41 64.858,42 61.549,44 5.222}
{0 CHEMBL354938,1 6.772,2 43.4,3 50,4 0.992,5 1.118,6 0.654,7 0.613,8 514.71,10 17,11 76,13 21,14 40,16 78,17 33,20 22,21 11,22 4,24 38,25 5,29 5,32 38,35 6.6,36 0.192,37 15,38 52.5,39 75.425,40 84.936,41 49.739,42 46.583,44 4.854}
{0 CHEMBL370113,1 8.502,2 48.4,3 40.6,4 1.005,5 1.103,6 0.722,7 0.683,8 544.1,9 1.6,10 28,11 64,13 31,14 42,16 68,17 31,18 1,20 27,21 4,22 3,24 26,25 7,26 2,28 1,29 4,31 1,32 38,34 1,35 6.3,36 0.118,37 8,38 59,39 64.298,40 70.598,41 46.227,42 43.744,43 1.6,44 5.699}
{0 CHEMBL370366,1 8.502,2 48.4,3 40.6,4 1.005,5 1.103,6 0.722,7 0.683,8 544.1,9 1.6,10 28,11 64,13 31,14 42,16 68,17 31,18 1,20 27,21 4,22 3,24 26,25 7,26 2,28 1,29 4,31 1,32 38,34 1,35 6.3,36 0.118,37 8,38 59,39 64.298,40 70.598,41 46.227,42 43.744,43 1.6,44 5.398}
{0 CHEMBL370799,1 8,2 50,3 41.9,4 0.998,5 1.104,6 0.712,7 0.675,8 496.03,9 1.6,10 28,11 62,13 29,14 40,16 66,17 31,18 1,20 27,21 4,22 1,24 26,25 5,26 1,28 1,29 3,32 36,34 1,35 4.8,36 0.121,37 8,38 55,39 61.894,40 68.468,41 44.125,42 41.842,43 1.6,44 5.222}
{0 CHEMBL371226,1 8,2 50,3 41.9,4 0.998,5 1.104,6 0.712,7 0.675,8 496.03,9 1.6,10 28,11 62,13 29,14 40,16 66,17 31,18 1,20 27,21 4,22 1,24 26,25 5,26 1,28 1,29 3,32 36,34 1,35 4.8,36 0.121,37 8,38 55,39 61.894,40 68.468,41 44.125,42 41.842,43 1.6,44 5.546}
{0 CHEMBL372790,1 8.502,2 48.4,3 40.6,4 1.005,5 1.103,6 0.722,7 0.683,8 544.1,9 1.6,10 28,11 64,13 31,14 42,16 68,17 31,18 1,20 27,21 4,22 3,24 26,25 7,26 2,28 1,29 4,31 1,32 38,34 1,35 6.3,36 0.118,37 8,38 59,39 64.298,40 70.598,41 46.227,42 43.744,43 1.6,44 6.097}
{0 CHEMBL372950,1 7.289,2 46.7,3 45.3,4 0.995,5 1.113,6 0.68,7 0.644,8 546.71,9 2.7,10 28,11 75,13 29,14 46,16 80,17 35,20 27,21 8,22 1,24 34,25 6,28 2,29 4,32 41,35 5.3,36 0.113,37 9,38 61,39 74.65,40 83.477,41 51.012,42 48.331,44 4.658}
{0 CHEMBL373549,1 8.075,2 47.6,3 42.9,4 1.001,5 1.106,6 0.708,7 0.668,8 678.29,9 1.2,10 34,11 84,13 37,14 53,16 89,17 40,18 1,20 33,21 7,22 3,24 36,25 8,26 2,28 1,29 5,31 1,32 48,34 1,35 6,36 0.157,37 14,38 73,39 84.043,40 92.883,41 59.489,42 56.092,43 1.2,44 5.523}
{0 CHEMBL373603,1 7.581,2 48.2,3 44.6,4 0.993,5 1.109,6 0.698,7 0.657,8 629.24,9 2.4,10 34,11 83,13 35,14 51,16 88,17 40,18 1,20 33,21 7,22 1,24 37,25 6,26 1,28 2,29 3,32 46,34 1,35 3.6,36 0.159,37 14,38 69,39 82.414,40 92.042,41 57.938,42 54.497,43 1.2,44 5.398}
{0 CHEMBL373604,1 8.184,2 47,3 42.2,4 1.003,5 1.108,6 0.708,7 0.67,8 679.28,9 2.4,10 34,11 83,13 37,14 53,16 88,17 39,18 1,20 33,21 6,22 3,24 35,25 9,26 2,28 2,29 5,31 1,32 48,34 1,35 6,36 0.159,37 14,38 73,39 83.261,40 91.966,41 58.733,42 55.587,43 1.2,44 4.783}
{0 CHEMBL373778,1 8.184,2 47,3 42.2,4 1.003,5 1.108,6 0.708,7 0.67,8 679.28,9 2.4,10 34,11 83,13 37,14 53,16 88,17 39,18 1,20 33,21 6,22 3,24 35,25 9,26 2,28 2,29 5,31 1,32 48,34 1,35 6,36 0.159,37 14,38 73,39 83.261,40 91.966,41 58.733,42 55.587,43 1.2,44 6.959}
{0 CHEMBL373933,1 8.316,2 47.5,3 41.3,4 1.005,5 1.107,6 0.712,7 0.676,8 665.25,9 2.5,10 34,11 80,13 37,14 52,16 85,17 38,18 1,20 33,21 5,22 3,24 33,25 9,26 2,28 2,29 5,31 1,32 47,34 1,35 6.3,36 0.153,37 13,38 72,39 80.378,40 88.551,41 56.972,42 54.06,43 1.3,44 5.377}
{0 CHEMBL374423,1 8.046,2 42,3 44.9,4 1.007,5 1.118,6 0.684,7 0.645,8 555.14,9 2.9,10 22,11 69,13 25,14 41,16 72,17 29,18 1,20 21,21 8,22 3,24 31,25 9,26 2,28 2,29 5,31 1,32 38,34 1,35 7.2,36 0.167,37 12,38 55,39 69.494,40 77.136,41 47.21,42 44.533,43 1.4,44 4.046}
{0 CHEMBL374425,1 8.062,2 46.5,3 43,4 1.002,5 1.109,6 0.703,7 0.664,8 693.31,9 2.3,10 34,11 86,13 37,14 54,16 91,17 40,18 1,20 33,21 7,22 3,24 37,25 9,26 2,28 2,29 5,31 1,32 49,34 1,35 5.8,36 0.165,37 15,38 74,39 86.145,40 95.381,41 60.495,42 57.114,43 1.2,44 6.585}
{0 CHEMBL374648,1 8.062,2 46.5,3 43,4 1.002,5 1.109,6 0.703,7 0.664,8 693.31,9 2.3,10 34,11 86,13 37,14 54,16 91,17 40,18 1,20 33,21 7,22 3,24 37,25 9,26 2,28 2,29 5,31 1,32 49,34 1,35 5.8,36 0.154,37 14,38 74,39 86.145,40 95.381,41 60.495,42 57.114,43 1.2,44 5.602}
{0 CHEMBL374649,1 8.075,2 46.4,3 42.9,4 1,5 1.11,6 0.706,7 0.665,8 678.3,9 3.6,10 34,11 84,13 37,14 53,16 89,17 39,18 1,20 33,21 6,22 3,24 36,25 9,26 2,28 3,29 4,31 1,32 48,34 1,35 4.8,36 0.157,37 14,38 73,39 84.036,40 93.255,41 59.284,42 55.894,43 1.2,44 5.174}
{0 CHEMBL374715,1 8.127,2 49.2,3 41.3,4 1.004,5 1.106,6 0.708,7 0.675,8 512.03,9 1.6,10 28,11 63,13 29,14 41,16 67,17 31,18 1,20 27,21 4,22 1,24 26,25 6,26 1,28 1,29 4,32 37,34 1,35 6.3,36 0.134,37 9,38 56,39 63.222,40 69.678,41 44.58,42 42.556,43 1.6,44 5.638}
{0 CHEMBL374877,1 9.206,2 45.2,3 39.7,4 1.016,5 1.11,6 0.725,7 0.688,8 672.06,9 2.7,10 28,11 73,13 31,14 48,16 77,17 33,18 3,20 27,21 6,22 3,24 29,25 11,26 4,28 2,29 5,31 1,32 44,34 3,35 6.8,36 0.169,37 13,38 65,39 74.142,40 81.024,41 52.926,42 50.188,43 4.1,44 4.745}
{0 CHEMBL374878,1 8.599,2 47,3 41,4 1.007,5 1.107,6 0.718,7 0.68,8 713.72,9 2.4,10 34,11 83,13 37,14 54,16 88,17 39,18 2,20 33,21 6,22 3,24 34,25 10,26 3,28 2,29 5,31 1,32 49,34 2,35 6,36 0.159,37 14,38 74,39 83.585,40 91.91,41 59.591,42 56.414,43 2.4,44 7.284}
{0 CHEMBL375430,1 8.065,2 48.8,3 41.3,4 1.004,5 1.108,6 0.704,7 0.673,8 645.19,9 2.5,10 34,11 80,13 36,14 52,16 85,17 39,18 1,20 34,21 5,22 2,24 33,25 8,26 1,28 2,29 5,32 47,34 1,35 6.3,36 0.153,37 13,38 71,39 80.301,40 88.631,41 56.324,42 53.873,43 1.3,44 5.921}
{0 CHEMBL375551,1 7.942,2 48.2,3 42.2,4 1.002,5 1.109,6 0.7,7 0.667,8 659.22,9 2.4,10 34,11 83,13 36,14 53,16 88,17 40,18 1,20 34,21 6,22 2,24 35,25 8,26 1,28 2,29 5,32 48,34 1,35 6,36 0.159,37 14,38 72,39 83.185,40 92.046,41 58.086,42 55.4,43 1.2,44 5.796}
{0 CHEMBL375593,1 9.014,2 47,3 39.8,4 1.011,5 1.107,6 0.728,7 0.69,8 748.16,9 2.4,10 34,11 83,13 37,14 55,16 88,17 39,18 3,20 33,21 6,22 3,24 33,25 11,26 4,28 2,29 5,31 1,32 50,34 3,35 6,36 0.159,37 14,38 75,39 83.909,40 91.854,41 60.449,42 57.242,43 3.6,44 7}
{0 CHEMBL375769,1 7.844,2 48.8,3 42.7,4 0.998,5 1.108,6 0.703,7 0.667,8 643.22,9 2.4,10 34,11 82,13 36,14 52,16 87,17 40,18 1,20 34,21 6,22 2,24 35,25 7,26 1,28 2,29 4,32 47,34 1,35 4.9,36 0.149,37 13,38 71,39 81.858,40 90.837,41 57.631,42 54.685,43 1.2,44 5.229}
{0 CHEMBL375994,1 7.604,2 44.8,3 44.8,4 1,5 1.114,6 0.684,7 0.647,8 729.96,9 3.1,10 34,11 96,13 37,14 59,16 102,17 43,20 33,21 10,22 3,24 43,25 10,26 1,28 3,29 6,31 1,32 53,35 6.3,36 0.147,37 15,38 79,39 96.018,40 106.975,41 65.62,42 62.076,44 6.222}
{0 CHEMBL375995,1 8.116,2 45.9,3 41.2,4 1.01,5 1.112,6 0.694,7 0.667,8 689.84,9 3.5,10 34,11 85,13 39,14 55,16 90,17 39,20 33,21 6,22 5,24 35,25 11,26 1,28 3,29 7,31 1,32 50,35 8.2,36 0.167,37 15,38 77,39 85.811,40 94.524,41 59.029,42 56.684,44 4.553}
{0 CHEMBL375996,1 8.263,2 45.2,3 42.5,4 1.007,5 1.111,6 0.702,7 0.665,8 603.18,9 2.7,10 28,11 73,13 31,14 46,16 77,17 33,18 1,20 27,21 6,22 3,24 31,25 9,26 2,28 2,29 5,31 1,32 42,34 1,35 6.8,36 0.169,37 13,38 63,39 73.494,40 81.136,41 51.21,42 48.533,43 1.4,44 5.301}
{0 CHEMBL375997,1 8.599,2 47,3 41,4 1.007,5 1.107,6 0.718,7 0.68,8 713.72,9 2.4,10 34,11 83,13 37,14 54,16 88,17 39,18 2,20 33,21 6,22 3,24 34,25 10,26 3,28 2,29 5,31 1,32 49,34 2,35 6,36 0.159,37 14,38 74,39 83.585,40 91.91,41 59.591,42 56.414,43 2.4,44 6.921}
{0 CHEMBL376238,1 8.263,2 45.2,3 42.5,4 1.007,5 1.111,6 0.702,7 0.665,8 603.18,9 2.7,10 28,11 73,13 31,14 46,16 77,17 33,18 1,20 27,21 6,22 3,24 31,25 9,26 2,28 2,29 5,31 1,32 42,34 1,35 6.8,36 0.156,37 12,38 63,39 73.494,40 81.136,41 51.21,42 48.533,43 1.4,44 6.187}
{0 CHEMBL376633,1 8.062,2 46.5,3 43,4 1.002,5 1.109,6 0.703,7 0.664,8 693.31,9 2.3,10 34,11 86,13 37,14 54,16 91,17 40,18 1,20 33,21 7,22 3,24 37,25 9,26 2,28 2,29 5,31 1,32 49,34 1,35 5.8,36 0.165,37 15,38 74,39 86.145,40 95.381,41 60.495,42 57.114,43 1.2,44 6.293}
{0 CHEMBL378803,1 8.088,2 52.2,3 40.6,4 0.997,5 1.1,6 0.723,7 0.686,8 558.1,9 1.4,10 34,11 69,13 35,14 46,16 74,17 36,18 1,20 33,21 3,22 1,24 28,25 5,26 1,28 1,29 3,32 41,34 1,35 4.3,36 0.122,37 9,38 64,39 68.778,40 75.883,41 49.887,42 47.368,43 1.4,44 4.301}
{0 CHEMBL379366,1 7.901,2 44.6,3 41.5,4 1.013,5 1.119,6 0.675,7 0.657,8 513.59,9 4.6,10 18,11 65,13 23,14 41,16 68,17 29,20 24,21 5,22 5,24 27,25 9,28 3,29 6,32 38,35 9.2,36 0.147,37 10,38 55,39 65.872,40 72.734,41 43.881,42 42.675,44 5.796}
{0 CHEMBL379418,1 8.259,2 44.6,3 39.3,4 1.024,5 1.118,6 0.675,7 0.666,8 462.49,9 3.6,10 18,11 56,13 21,14 37,16 59,17 25,20 21,21 4,22 3,24 22,25 9,28 2,29 7,32 34,35 12.5,36 0.153,37 9,38 49,39 57.331,40 62.614,41 37.807,42 37.314,44 4.569}
{0 CHEMBL379776,1 7.964,2 45.5,3 40.9,4 1.013,5 1.117,6 0.68,7 0.662,8 525.6,9 4.5,10 18,11 66,13 24,14 42,16 69,17 30,20 26,21 4,22 6,24 27,25 9,28 3,29 6,32 39,35 9.1,36 0.159,37 11,38 57,39 66.872,40 73.734,41 44.881,42 43.675,44 5.886}
{0 CHEMBL380631,1 9.04,2 48.4,3 39.1,4 1.01,5 1.102,6 0.736,7 0.696,8 578.54,9 1.6,10 28,11 64,13 31,14 43,16 68,17 31,18 2,20 27,21 4,22 3,24 25,25 8,26 3,28 1,29 4,31 1,32 39,34 2,35 6.3,36 0.118,37 8,38 60,39 64.622,40 70.542,41 47.085,42 44.571,43 3.1,44 6}
{0 CHEMBL380864,1 8.509,2 57.7,3 34.6,4 1.005,5 1.088,6 0.744,7 0.723,8 442.48,10 24,11 52,13 28,14 39,16 57,17 30,20 30,22 4,24 18,25 4,29 4,32 34,35 7.7,36 0.053,37 3,38 55,39 52.262,40 56.574,41 38.671,42 37.6,44 4.412}
{0 CHEMBL381067,1 7.579,2 47.9,3 45.1,4 0.994,5 1.109,6 0.696,7 0.654,8 538.12,9 1.4,10 28,11 71,13 29,14 43,16 75,17 34,18 1,20 27,21 7,22 1,24 32,25 5,26 1,28 1,29 3,32 39,34 1,35 4.2,36 0.147,37 11,38 58,39 70.545,40 78.714,41 49.409,42 46.422,43 1.4,44 4.699}
{0 CHEMBL381068,1 8.556,2 50,3 40.3,4 1.004,5 1.103,6 0.726,7 0.688,8 530.47,9 1.6,10 28,11 62,13 29,14 41,16 66,17 31,18 2,20 27,21 4,22 1,24 25,25 6,26 2,28 1,29 3,32 37,34 2,35 4.8,36 0.121,37 8,38 56,39 62.218,40 68.412,41 44.983,42 42.669,43 3.2,44 5.155}
{0 CHEMBL381114,1 8.396,2 48.3,3 39.7,4 1.01,5 1.109,6 0.708,7 0.681,8 486.98,9 3.4,10 27,11 58,13 28,14 39,16 62,17 28,18 1,20 24,21 4,22 1,24 23,25 7,26 1,28 2,29 4,32 35,34 1,35 6.9,36 0.129,37 8,38 53.5,39 58.556,40 64.345,41 41.063,42 39.524,43 1.7,44 4.398}
{0 CHEMBL381294,1 7.089,2 42.9,3 47.6,4 0.998,5 1.121,6 0.659,7 0.623,8 446.59,9 3.2,10 16,11 63,13 19,14 35,16 65,17 27,19 1,20 16,21 10,22 2,24 30,25 6,28 2,29 4,32 33,33 1,35 6.3,36 0.2,37 13,38 47,39 62.883,40 70.647,41 41.489,42 39.277,44 7.892}
{0 CHEMBL381471,1 8.383,2 49.2,3 41.3,4 1,5 1.101,6 0.727,7 0.683,8 528.1,9 1.6,10 28,11 63,13 30,14 41,16 67,17 31,18 1,20 27,21 4,22 2,24 26,25 6,26 2,28 1,29 3,31 1,32 37,34 1,35 4.8,36 0.119,37 8,38 57,39 62.971,40 69.388,41 45.773,42 43.029,43 1.6,44 6}
{0 CHEMBL381582,1 7.939,2 46.5,3 40.8,4 1.011,5 1.115,6 0.685,7 0.665,8 563.65,9 4.2,10 24,11 71,13 28,14 46,16 75,17 33,20 28,21 5,22 4,24 29,25 9,28 3,29 6,32 42,35 8.5,36 0.147,37 11,38 62,39 71.756,40 79.149,41 48.642,42 47.201,44 4.523}
{0 CHEMBL381944,1 8.148,2 49.2,3 41,4 1.002,5 1.107,6 0.711,7 0.678,8 497.02,9 3.3,10 28,11 61,13 29,14 40,16 65,17 30,18 1,20 26,21 4,22 1,24 25,25 6,26 1,28 2,29 3,32 36,34 1,35 4.9,36 0.123,37 8,38 55,39 61.112,40 67.551,41 43.37,42 41.336,43 1.6,44 4.071}
{0 CHEMBL382105,1 7.858,2 49.2,3 42.9,4 0.995,5 1.107,6 0.709,7 0.669,8 495.05,9 3.2,10 28,11 63,13 29,14 40,16 67,17 31,18 1,20 27,21 4,22 1,24 27,25 5,26 1,28 2,29 2,32 36,34 1,35 3.2,36 0.119,37 8,38 55,39 62.669,40 69.757,41 44.676,42 42.148,43 1.6,44 4.638}
{0 CHEMBL382306,1 7.707,2 48.5,3 44.1,4 0.995,5 1.107,6 0.701,7 0.66,8 524.09,9 1.5,10 28,11 68,13 29,14 42,16 72,17 33,18 1,20 27,21 6,22 1,24 30,25 5,26 1,28 1,29 3,32 38,34 1,35 4.4,36 0.139,37 10,38 57,39 67.661,40 75.299,41 47.648,42 44.895,43 1.5,44 5.523}
{0 CHEMBL382896,1 8.118,2 45.5,3 40,4 1.018,5 1.116,6 0.679,7 0.665,8 446.49,9 3.6,10 18,11 55,13 21,14 36,16 58,17 25,20 21,21 4,22 3,24 22,25 8,28 2,29 6,32 33,35 10.9,36 0.155,37 9,38 48,39 56.003,40 61.405,41 37.352,42 36.6,44 4.301}
{0 CHEMBL383336,1 8.509,2 57.7,3 34.6,4 1.005,5 1.088,6 0.744,7 0.723,8 442.48,10 24,11 52,13 28,14 39,16 57,17 30,20 30,22 4,24 18,25 4,29 4,32 34,35 7.7,36 0.053,37 3,38 55,39 52.262,40 56.574,41 38.671,42 37.6,44 4.775}
{0 CHEMBL383420,1 8.174,2 47.1,3 42.9,4 1.001,5 1.106,6 0.711,7 0.669,8 572.16,9 1.4,10 28,11 70,13 31,14 44,16 74,17 33,18 1,20 27,21 6,22 3,24 30,25 7,26 2,28 1,29 4,31 1,32 40,34 1,35 5.7,36 0.135,37 10,38 61,39 70.065,40 77.428,41 49.75,42 46.797,43 1.4,44 6.301}
{0 CHEMBL383492,1 8.127,2 49.2,3 41.3,4 1.004,5 1.106,6 0.708,7 0.675,8 512.03,9 1.6,10 28,11 63,13 29,14 41,16 67,17 31,18 1,20 27,21 4,22 1,24 26,25 6,26 1,28 1,29 4,32 37,34 1,35 6.3,36 0.134,37 9,38 56,39 63.222,40 69.678,41 44.58,42 42.556,43 1.6,44 4.398}
{0 CHEMBL397954,1 6.925,2 38.6,3 51.4,4 0.994,5 1.126,6 0.649,7 0.601,8 484.72,9 2.9,10 16,11 70,13 19,14 36,16 72,17 27,20 15,21 12,22 3,24 36,25 7,26 1,28 2,29 4,31 1,32 34,35 5.7,36 0.194,37 14,38 47,39 69.61,40 78.813,41 45.421,42 42.045,44 6.301}
{0 CHEMBL404529,1 7.751,2 46.2,3 45.1,4 0.995,5 1.11,6 0.698,7 0.653,8 705.37,9 2.2,10 34,11 91,13 37,14 55,16 96,17 42,18 1,20 33,21 9,22 3,24 41,25 8,26 2,28 2,29 4,31 1,32 50,34 1,35 4.4,36 0.146,37 14,38 75,39 90.585,40 101.002,41 63.563,42 59.453,43 1.1,44 8}
{0 CHEMBL408261,1 8.062,2 46.5,3 43,4 1.002,5 1.109,6 0.703,7 0.664,8 693.31,9 2.3,10 34,11 86,13 37,14 54,16 91,17 40,18 1,20 33,21 7,22 3,24 37,25 9,26 2,28 2,29 5,31 1,32 49,34 1,35 5.8,36 0.154,37 14,38 74,39 86.145,40 95.381,41 60.495,42 57.114,43 1.2,44 7}
{0 CHEMBL409321,1 6.649,2 42.6,3 50.8,4 0.989,5 1.121,6 0.652,7 0.608,8 405.58,9 1.6,10 16,11 61,13 18,14 32,16 63,17 26,20 16,21 10,22 2,24 31,25 4,28 1,29 3,32 30,35 4.9,36 0.206,37 13,38 42,39 60.338,40 68.355,41 39.79,42 37.068,44 5.339}
{0 CHEMBL409357,1 6.944,2 43.4,3 48.7,4 0.995,5 1.119,6 0.658,7 0.619,8 527.71,9 1.3,10 22,11 76,13 24,14 42,16 79,17 33,20 22,21 11,22 2,24 37,25 6,28 1,29 5,32 39,35 6.6,36 0.203,37 16,38 55,39 75.643,40 85.019,41 49.983,42 47.078,44 5}
{0 CHEMBL410658,1 6.607,2 39,3 51.9,4 0.995,5 1.129,6 0.633,7 0.593,8 508.72,9 2.6,10 16,11 77,13 18,14 39,16 79,17 30,20 16,21 14,22 2,24 40,25 7,28 2,29 5,32 37,35 6.5,36 0.215,37 17,38 49,39 76.629,40 86.932,41 48.75,42 45.626,44 5}
{0 CHEMBL413780,1 8.184,2 47,3 42.2,4 1.003,5 1.108,6 0.708,7 0.67,8 679.28,9 2.4,10 34,11 83,13 37,14 53,16 88,17 39,18 1,20 33,21 6,22 3,24 35,25 9,26 2,28 2,29 5,31 1,32 48,34 1,35 6,36 0.159,37 14,38 73,39 83.261,40 91.966,41 58.733,42 55.587,43 1.2,44 4.959}
{0 CHEMBL416517,1 8.539,2 49.4,3 37.6,4 1.013,5 1.109,6 0.715,7 0.692,8 725.84,9 3.5,10 30,11 85,13 36,14 59,16 91,17 42,20 37,21 5,22 6,23 1,24 32,25 11,26 1,28 3,29 6,31 1,32 53,34 1,35 7.1,36 0.11,37 10,38 80,39 86.112,40 94.239,41 60.75,42 58.825,43 1.2,44 7.161}
{0 CHEMBL424290,1 7.876,2 51.7,3 40,4 0.998,5 1.103,6 0.713,7 0.683,8 472.57,9 3.3,10 28,11 60,13 30,14 40,16 64,17 31,19 1,20 27,21 3,22 1,24 24,25 5,28 2,29 3,32 36,33 1,35 5,36 0.109,37 7,38 57,39 59.905,40 66.192,41 42.75,42 40.982,44 6.097}
{0 CHEMBL424386,1 6.763,2 44.9,3 49.3,4 0.985,5 1.117,6 0.668,7 0.622,8 466.67,9 2.9,10 17,11 69,13 21,14 38,16 72,17 31,20 22,21 9,22 4,24 34,25 4,28 2,29 2,32 35,35 2.9,36 0.069,37 5,38 50.5,39 67.996,40 77.059,41 46.103,42 42.901,44 5.398}
{0 CHEMBL425029,1 7.898,2 48.5,3 42.6,4 0.998,5 1.109,6 0.704,7 0.667,8 537.09,9 2.9,10 28,11 68,13 30,14 43,16 72,17 33,18 1,20 28,21 5,22 2,24 29,25 6,26 1,28 2,29 3,32 39,34 1,35 4.4,36 0.125,37 9,38 59,39 67.88,40 75.382,41 47.892,42 45.39,43 1.5,44 4.523}
{0 CHEMBL425596,1 7.163,2 41.5,3 47.7,4 1.005,5 1.123,6 0.649,7 0.619,8 465.59,9 1.5,10 16,11 65,13 19,14 36,16 67,17 27,20 17,21 10,22 3,24 31,25 7,28 1,29 6,32 34,35 9.2,36 0.209,37 14,38 47,39 65.32,40 72.983,41 42.154,42 40.212,44 6.152}
{0 CHEMBL426665,1 7.053,2 41.2,3 48.5,4 1.003,5 1.123,6 0.646,7 0.614,8 479.62,9 1.5,10 16,11 68,13 19,14 37,16 70,17 28,20 17,21 11,22 3,24 33,25 7,28 1,29 6,32 35,35 8.8,36 0.214,37 15,38 48,39 68.203,40 76.398,41 43.915,42 41.739,44 8.635}
{0 CHEMBL426678,1 7.94,2 44.8,3 41.4,4 1.015,5 1.118,6 0.674,7 0.657,8 460.52,9 3.4,10 18,11 58,13 21,14 37,16 61,17 26,20 21,21 5,22 3,24 24,25 8,28 2,29 6,32 34,35 10.3,36 0.164,37 10,38 49,39 58.887,40 64.82,41 39.114,42 38.126,44 4.301}
{0 CHEMBL428391,1 6.631,2 40.5,3 51.4,4 0.992,5 1.126,6 0.642,7 0.6,8 490.7,9 2.7,10 16,11 74,13 18,14 39,16 77,17 30,20 16,21 14,22 2,24 38,25 6,28 2,29 4,32 36,35 5.4,36 0.169,37 13,38 49,39 73.418,40 83.308,41 47.535,42 44.384,44 6.301}
{0 CHEMBL428653,1 8.59,2 48.9,3 38.6,4 1.008,5 1.106,6 0.724,7 0.691,8 755.94,9 3.4,10 30,11 88,13 36,14 60,16 94,17 43,20 37,21 6,22 6,23 1,24 34,25 11,26 2,28 3,29 5,31 2,32 54,34 1,35 5.7,36 0.117,37 11,38 81,39 88.745,40 97.365,41 63.705,42 60.824,43 1.1,44 7.046}
{0 CHEMBL428827,1 8.728,2 49.4,3 37.6,4 1.01,5 1.105,6 0.729,7 0.698,8 741.91,9 3.5,10 30,11 85,13 36,14 59,16 91,17 42,20 37,21 5,22 6,23 1,24 32,25 11,26 2,28 3,29 5,31 2,32 53,34 1,35 5.9,36 0.11,37 10,38 80,39 85.861,40 93.95,41 61.943,42 59.298,43 1.2,44 7.081}
{0 CHEMBL428996,1 7.871,2 46.5,3 42.6,4 1.003,5 1.115,6 0.694,7 0.661,8 795.01,9 4,10 30,11 101,13 36,14 64,16 107,17 47,20 37,21 10,22 6,23 1,24 43,25 11,26 1,28 4,29 5,31 1,32 58,34 1,35 5,36 0.121,37 13,38 85,39 101.305,40 112.604,41 70.109,42 66.766,43 1,44 7.678}
{0 CHEMBL439687,1 8.509,2 57.7,3 34.6,4 1.005,5 1.088,6 0.744,7 0.723,8 442.48,10 24,11 52,13 28,14 39,16 57,17 30,20 30,22 4,24 18,25 4,29 4,32 34,35 7.7,36 0.053,37 3,38 55,39 52.262,40 56.574,41 38.671,42 37.6,44 4.318}
{0 CHEMBL441326,1 7.991,2 46.7,3 41.9,4 1.007,5 1.118,6 0.693,7 0.664,8 839.04,9 3.8,10 30,11 105,13 37,14 67,16 111,17 49,20 39,21 10,22 7,23 2,24 44,25 12,26 1,28 4,29 5,31 1,32 61,34 2,35 4.8,36 0.126,37 14,38 89,39 105.701,40 117.359,41 72.807,42 69.676,43 1.9,44 7.509}
{0 CHEMBL442623,1 8.108,2 44.2,3 43,4 1.005,5 1.116,6 0.695,7 0.658,8 697.31,9 4.7,10 33,11 86,13 36,14 54,16 91,17 38,18 1,20 30,21 8,22 3,24 37,25 11,26 2,28 4,29 5,31 1,32 49,34 1,35 5.8,36 0.165,37 15,38 73.5,39 86.465,40 95.963,41 59.745,42 56.63,43 1.2,44 6.119}
{0 CHEMBL443645,1 7.638,2 41.6,3 46.5,4 1.002,5 1.121,6 0.673,7 0.633,8 771.45,9 4,10 28,11 101,13 32,14 59,16 106,17 42,18 1,20 28,21 14,22 4,24 47,25 12,26 2,28 4,29 6,31 1,32 54,34 1,35 5.9,36 0.142,37 15,38 77,39 101.21,40 113.248,41 68.006,42 63.979,43 1,44 6.569}
{0 CHEMBL443834,1 6.982,2 40,3 49.3,4 1.004,5 1.126,6 0.639,7 0.607,8 523.68,9 1.3,10 16,11 75,13 19,14 40,16 77,17 30,20 17,21 13,22 3,24 37,25 8,28 1,29 7,32 38,35 9.3,36 0.234,37 18,38 51,39 75.298,40 84.438,41 47.892,42 45.507,44 6.244}
{0 CHEMBL444079,1 6.952,2 44.3,3 48.6,4 0.995,5 1.116,6 0.66,7 0.622,8 486.65,10 12,11 70,13 16,14 40,16 74,17 31,20 18,21 13,22 4,24 34,25 5,29 5,32 36,35 7.1,36 0.108,37 8,38 50,39 69.658,40 78.105,41 46.216,42 43.53,44 5.097}
{0 CHEMBL444909,1 7.509,2 42.3,3 47.4,4 0.998,5 1.119,6 0.676,7 0.631,8 728.42,9 3.1,10 28,11 97,13 31,14 56,16 102,17 41,18 1,20 27,21 14,22 3,24 46,25 10,26 2,28 3,29 5,31 1,32 51,34 1,35 5.2,36 0.147,37 15,38 73,39 96.781,40 108.54,41 65.546,42 61.242,43 1,44 6.602}
{0 CHEMBL447045,1 7.6,2 42.6,3 46.8,4 0.999,5 1.118,6 0.679,7 0.635,8 714.39,9 3.2,10 28,11 94,13 31,14 55,16 99,17 40,18 1,20 27,21 13,22 3,24 44,25 10,26 2,28 3,29 5,31 1,32 50,34 1,35 5.3,36 0.152,37 15,38 72,39 93.898,40 105.125,41 63.785,42 59.716,43 1.1,44 6.658}
{0 CHEMBL448596,1 8.624,2 43,3 41.8,4 1.014,5 1.113,6 0.703,7 0.667,8 681.28,9 2.5,10 28,11 79,13 33,14 50,16 83,17 34,18 1,20 27,21 7,22 5,24 33,25 12,26 3,28 2,29 7,31 2,32 46,34 1,35 8.9,36 0.169,37 14,38 69,39 80.109,40 87.89,41 55.529,42 52.677,43 1.3,44 6.824}
{0 CHEMBL448639,1 7.928,2 42.4,3 44.6,4 1.006,5 1.12,6 0.682,7 0.646,8 729.36,9 4.3,10 28,11 92,13 32,14 56,16 97,17 39,18 1,20 28,21 11,22 4,24 41,25 12,26 2,28 4,29 6,31 1,32 51,34 1,35 6.5,36 0.165,37 16,38 74,39 92.56,40 103.002,41 62.722,42 59.398,43 1.1,44 6.456}
{0 CHEMBL448664,1 8.338,2 46,3 42.5,4 1.003,5 1.107,6 0.714,7 0.67,8 725.38,9 2.3,10 34,11 87,13 37,14 55,16 92,17 40,18 1,20 33,21 7,22 3,24 37,25 10,26 3,28 2,29 5,31 2,32 50,34 1,35 5.7,36 0.163,37 15,38 75,39 87.221,40 96.301,41 62.142,42 58.301,43 1.1,44 6.824}
{0 CHEMBL448722,1 8.345,2 43.9,3 41.5,4 1.01,5 1.117,6 0.698,7 0.666,8 684.27,9 6.1,10 33,11 82,13 36,14 53,16 87,17 36,18 1,20 29,21 7,22 3,24 34,25 12,26 2,28 5,29 5,31 1,32 48,34 1,35 6.1,36 0.172,37 15,38 72.5,39 82.8,40 91.631,41 57.228,42 54.598,43 1.2,44 6.387}
{0 CHEMBL449113,1 8.878,2 46.4,3 40.5,4 1.008,5 1.105,6 0.729,7 0.686,8 745.79,9 2.4,10 34,11 84,13 37,14 55,16 89,17 39,18 2,20 33,21 6,22 3,24 34,25 11,26 4,28 2,29 5,31 2,32 50,34 2,35 6,36 0.169,37 15,38 75,39 84.662,40 92.83,41 61.239,42 57.602,43 2.4,44 6.824}
{0 CHEMBL449829,1 9.288,2 46.4,3 39.3,4 1.012,5 1.104,6 0.739,7 0.696,8 780.23,9 2.4,10 34,11 84,13 37,14 56,16 89,17 39,18 3,20 33,21 6,22 3,24 33,25 12,26 5,28 2,29 5,31 2,32 51,34 3,35 6,36 0.169,37 15,38 76,39 84.985,40 92.774,41 62.097,42 58.429,43 3.6,44 6.62}
{0 CHEMBL449856,1 7.426,2 41.2,3 48,4 0.998,5 1.122,6 0.67,7 0.625,8 757.47,9 3.9,10 28,11 102,13 31,14 58,16 107,17 42,18 1,20 27,21 15,22 3,24 49,25 11,26 2,28 4,29 5,31 1,32 53,34 1,35 4.9,36 0.159,37 17,38 75,39 101.767,40 114.454,41 68.313,42 63.791,43 1,44 6.569}
{0 CHEMBL451024,1 7.598,2 41.7,3 46.9,4 1,5 1.121,6 0.675,7 0.633,8 729.41,9 4.2,10 28,11 96,13 31,14 56,16 101,17 40,18 1,20 27,21 13,22 3,24 45,25 11,26 2,28 4,29 5,31 1,32 51,34 1,35 5.2,36 0.149,37 15,38 73,39 95.999,40 107.623,41 64.79,42 60.737,43 1,44 6.222}
{0 CHEMBL451133,1 7.891,2 42.7,3 44.9,4 1.005,5 1.118,6 0.682,7 0.645,8 702.33,9 3.4,10 28,11 89,13 31,14 54,16 94,17 38,18 1,20 27,21 11,22 3,24 40,25 11,26 2,28 3,29 6,31 1,32 49,34 1,35 6.7,36 0.16,37 15,38 71,39 89.458,40 99.504,41 60.716,42 57.377,43 1.1,44 6.409}
{0 CHEMBL451642,1 7.64,2 43.9,3 45.8,4 0.998,5 1.116,6 0.685,7 0.643,8 817.52,9 3.7,10 34,11 107,13 38,14 64,16 113,17 47,18 1,20 34,21 13,22 4,24 49,25 11,26 2,28 4,29 5,31 1,32 58,34 1,35 4.7,36 0.142,37 16,38 85,39 106.767,40 119.454,41 73.313,42 68.791,43 0.9,44 8.222}
{0 CHEMBL452094,1 7.688,2 42.1,3 46.3,4 1.002,5 1.119,6 0.676,7 0.636,8 730.39,9 3.2,10 28,11 95,13 31,14 56,16 100,17 40,18 1,20 27,21 13,22 3,24 44,25 11,26 2,28 3,29 6,31 1,32 51,34 1,35 6.3,36 0.15,37 15,38 73,39 95.225,40 106.335,41 64.239,42 60.43,43 1.1,44 6.347}
{0 CHEMBL453714,1 8.468,2 46.4,3 41.7,4 1.004,5 1.106,6 0.719,7 0.676,8 711.35,9 2.4,10 34,11 84,13 37,14 54,16 89,17 39,18 1,20 33,21 6,22 3,24 35,25 10,26 3,28 2,29 5,31 2,32 49,34 1,35 6,36 0.169,37 15,38 74,39 84.338,40 92.886,41 60.381,42 56.774,43 1.2,44 6.721}
{0 CHEMBL455363,1 8.897,2 46.4,3 39.3,4 1.016,5 1.114,6 0.717,7 0.685,8 747.33,9 2.4,10 34,11 84,13 37,14 56,16 89,17 39,18 1,20 33,21 6,22 3,23 2,24 33,25 12,26 3,28 2,29 5,31 2,32 51,34 3,35 6,36 0.169,37 15,38 76,39 85.363,40 93.565,41 60.256,42 57.541,43 3.6,44 6.854}
{0 CHEMBL455572,1 7.937,2 43.3,3 44.4,4 1.005,5 1.117,6 0.686,7 0.649,8 714.34,9 3.3,10 28,11 90,13 31,14 56,16 96,17 39,18 1,20 27,21 12,22 3,24 40,25 11,26 2,28 3,29 6,31 1,32 50,34 1,35 6.7,36 0.156,37 15,38 73,39 90.458,40 100.504,41 61.716,42 58.377,43 1.1,44 6.602}
{0 CHEMBL463857,1 8.232,2 44.6,3 42.2,4 1.007,5 1.115,6 0.699,7 0.664,8 683.28,9 4.8,10 33,11 83,13 36,14 53,16 88,17 37,18 1,20 30,21 7,22 3,24 35,25 11,26 2,28 4,29 5,31 1,32 48,34 1,35 6,36 0.17,37 15,38 72.5,39 83.581,40 92.547,41 57.983,42 55.103,43 1.2,44 6.26}
{0 CHEMBL466695,1 7.891,2 42.7,3 44.9,4 1.005,5 1.118,6 0.682,7 0.645,8 702.33,9 3.4,10 28,11 89,13 31,14 54,16 94,17 38,18 1,20 27,21 11,22 3,24 40,25 11,26 2,28 3,29 6,31 1,32 49,34 1,35 6.7,36 0.16,37 15,38 71,39 89.458,40 99.504,41 60.716,42 57.377,43 1.1,44 6.155}
{0 CHEMBL468377,1 7.696,2 42.9,3 46.2,4 1,5 1.118,6 0.682,7 0.639,8 700.36,9 3.3,10 28,11 91,13 31,14 54,16 96,17 39,18 1,20 27,21 12,22 3,24 42,25 10,26 2,28 3,29 5,31 1,32 49,34 1,35 5.5,36 0.156,37 15,38 71,39 91.014,40 101.71,41 62.023,42 58.189,43 1.1,44 6.699}
{0 CHEMBL468442,1 8.385,2 44.6,3 42.4,4 1.008,5 1.11,6 0.704,7 0.666,8 771.41,9 2.2,10 34,11 92,13 37,14 58,16 97,17 41,18 1,20 33,21 8,22 3,24 39,25 12,26 3,28 2,29 7,31 2,32 53,34 1,35 7.6,36 0.175,37 17,38 78,39 92.76,40 102.135,41 64.813,42 61.257,43 1.1,44 6.481}
{0 CHEMBL474478,1 7.6,2 42.6,3 46.8,4 0.999,5 1.118,6 0.679,7 0.635,8 714.39,9 3.2,10 28,11 94,13 31,14 55,16 99,17 40,18 1,20 27,21 13,22 3,24 44,25 10,26 2,28 3,29 5,31 1,32 50,34 1,35 5.3,36 0.152,37 15,38 72,39 93.898,40 105.125,41 63.785,42 59.716,43 1.1,44 6.456}
{0 CHEMBL482775,1 6.927,2 41,3 49.2,4 0.998,5 1.125,6 0.647,7 0.611,8 422.57,9 3.3,10 16,11 61,13 18,14 33,16 63,17 25,20 15,21 10,22 2,24 30,25 6,28 2,29 4,32 31,35 6.6,36 0.206,37 13,38 43,39 60.883,40 68.647,41 39.489,42 37.277,44 7.585}
{0 CHEMBL482959,1 6.927,2 41,3 49.2,4 0.998,5 1.125,6 0.647,7 0.611,8 422.57,9 3.3,10 16,11 61,13 18,14 33,16 63,17 25,20 15,21 10,22 2,24 30,25 6,28 2,29 4,32 31,35 6.6,36 0.206,37 13,38 43,39 60.883,40 68.647,41 39.489,42 37.277,44 6.824}
{0 CHEMBL484413,1 6.927,2 41,3 49.2,4 0.998,5 1.125,6 0.647,7 0.611,8 422.57,9 3.3,10 16,11 61,13 18,14 33,16 63,17 25,20 15,21 10,22 2,24 30,25 6,28 2,29 4,32 31,35 6.6,36 0.206,37 13,38 43,39 60.883,40 68.647,41 39.489,42 37.277,44 8.301}
{0 CHEMBL484953,1 7.059,2 40,3 48.3,4 1.002,5 1.129,6 0.646,7 0.613,8 423.56,9 5,10 16,11 60,13 18,14 33,16 62,17 24,20 14,21 10,22 2,24 29,25 7,28 3,29 4,32 31,35 6.7,36 0.21,37 13,38 43,39 60.101,40 67.73,41 38.733,42 36.772,44 7.585}
{0 CHEMBL484954,1 7.059,2 40,3 48.3,4 1.002,5 1.129,6 0.646,7 0.613,8 423.56,9 5,10 16,11 60,13 18,14 33,16 62,17 24,20 14,21 10,22 2,24 29,25 7,28 3,29 4,32 31,35 6.7,36 0.21,37 13,38 43,39 60.101,40 67.73,41 38.733,42 36.772,44 7.796}
{0 CHEMBL488320,1 7.688,2 42.1,3 46.3,4 1.002,5 1.119,6 0.676,7 0.636,8 730.39,9 3.2,10 28,11 95,13 31,14 56,16 100,17 40,18 1,20 27,21 13,22 3,24 44,25 11,26 2,28 3,29 6,31 1,32 51,34 1,35 6.3,36 0.17,37 17,38 73,39 95.225,40 106.335,41 64.239,42 60.43,43 1.1,44 6.602}
{0 CHEMBL499284,1 7.928,2 42.4,3 44.6,4 1.006,5 1.12,6 0.682,7 0.646,8 729.36,9 4.3,10 28,11 92,13 32,14 56,16 97,17 39,18 1,20 28,21 11,22 4,24 41,25 12,26 2,28 4,29 6,31 1,32 51,34 1,35 6.5,36 0.155,37 15,38 74,39 92.56,40 103.002,41 62.722,42 59.398,43 1.1,44 6.699}
{0 CHEMBL501336,1 9.288,2 46.4,3 39.3,4 1.012,5 1.104,6 0.739,7 0.696,8 780.23,9 2.4,10 34,11 84,13 37,14 56,16 89,17 39,18 3,20 33,21 6,22 3,24 33,25 12,26 5,28 2,29 5,31 2,32 51,34 3,35 6,36 0.169,37 15,38 76,39 84.985,40 92.774,41 62.097,42 58.429,43 3.6,44 6.699}
{0 CHEMBL501496,1 8.072,2 42.7,3 44.9,4 1.002,5 1.115,6 0.696,7 0.65,8 718.4,9 3.4,10 28,11 89,13 31,14 54,16 94,17 38,18 1,20 27,21 11,22 3,24 40,25 11,26 3,28 3,29 5,31 2,32 49,34 1,35 5.6,36 0.16,37 15,38 71,39 89.207,40 99.215,41 61.909,42 57.849,43 1.1,44 6.77}
{0 CHEMBL501774,1 7.863,2 43.4,3 44.4,4 1.002,5 1.118,6 0.687,7 0.649,8 778.44,9 5.1,10 34,11 99,13 37,14 61,16 105,17 43,18 1,20 32,21 11,22 3,24 44,25 12,26 2,28 5,29 5,31 1,32 55,34 1,35 5.1,36 0.152,37 16,38 81,39 99.218,40 110.707,41 68.035,42 64.232,43 1,44 6.538}
{0 CHEMBL501852,1 7.6,2 42.6,3 46.8,4 0.999,5 1.118,6 0.679,7 0.635,8 714.39,9 3.2,10 28,11 94,13 31,14 55,16 99,17 40,18 1,20 27,21 13,22 3,24 44,25 10,26 2,28 3,29 5,31 1,32 50,34 1,35 5.3,36 0.152,37 15,38 72,39 93.898,40 105.125,41 63.785,42 59.716,43 1.1,44 6.921}
{0 CHEMBL502458,1 8.19,2 43,3 44.2,4 1.004,5 1.114,6 0.699,7 0.655,8 704.37,9 3.5,10 28,11 86,13 31,14 53,16 91,17 37,18 1,20 27,21 10,22 3,24 38,25 11,26 3,28 3,29 5,31 2,32 48,34 1,35 5.8,36 0.165,37 15,38 70,39 86.323,40 95.8,41 60.148,42 56.322,43 1.2,44 6.481}
{0 CHEMBL502901,1 8.216,2 45.6,3 43.3,4 1.001,5 1.108,6 0.71,7 0.665,8 739.41,9 2.2,10 34,11 90,13 37,14 56,16 95,17 41,18 1,20 33,21 8,22 3,24 39,25 10,26 3,28 2,29 5,31 2,32 51,34 1,35 5.6,36 0.158,37 15,38 76,39 90.105,40 99.716,41 63.904,42 59.828,43 1.1,44 6.481}
{0 CHEMBL502964,1 7.825,2 42.1,3 45.3,4 1.005,5 1.12,6 0.679,7 0.641,8 743.39,9 4.2,10 28,11 95,13 32,14 57,16 100,17 40,18 1,20 28,21 12,22 4,24 43,25 12,26 2,28 4,29 6,31 1,32 52,34 1,35 6.3,36 0.15,37 15,38 75,39 95.443,40 106.418,41 64.483,42 60.925,43 1.1,44 6.31}
{0 CHEMBL503141,1 9.093,2 46.4,3 39.3,4 1.014,5 1.109,6 0.728,7 0.69,8 763.78,9 2.4,10 34,11 84,13 37,14 56,16 89,17 39,18 2,20 33,21 6,22 3,23 1,24 33,25 12,26 4,28 2,29 5,31 2,32 51,34 3,35 6,36 0.169,37 15,38 76,39 85.174,40 93.17,41 61.176,42 57.985,43 3.6,44 6.77}
{0 CHEMBL503263,1 8.232,2 44.6,3 42.2,4 1.007,5 1.115,6 0.699,7 0.664,8 683.28,9 4.8,10 33,11 83,13 36,14 53,16 88,17 37,18 1,20 30,21 7,22 3,24 35,25 11,26 2,28 4,29 5,31 1,32 48,34 1,35 6,36 0.17,37 15,38 72.5,39 83.581,40 92.547,41 57.983,42 55.103,43 1.2,44 6.495}
{0 CHEMBL503626,1 7.338,2 42.4,3 48.5,4 0.993,5 1.119,6 0.675,7 0.627,8 726.45,9 3,10 28,11 99,13 31,14 56,16 104,17 42,18 1,20 27,21 15,22 3,24 48,25 9,26 2,28 3,29 4,31 1,32 51,34 1,35 4,36 0.144,37 15,38 73,39 98.338,40 110.746,41 66.853,42 62.054,43 1,44 7}
{0 CHEMBL503893,1 9.288,2 46.4,3 39.3,4 1.012,5 1.104,6 0.739,7 0.696,8 780.23,9 2.4,10 34,11 84,13 37,14 56,16 89,17 39,18 3,20 33,21 6,22 3,24 33,25 12,26 5,28 2,29 5,31 2,32 51,34 3,35 6,36 0.169,37 15,38 76,39 84.985,40 92.774,41 62.097,42 58.429,43 3.6,44 6.523}
{0 CHEMBL504084,1 7.795,2 44,3 45.1,4 0.999,5 1.116,6 0.69,7 0.648,8 709.37,9 4.4,10 33,11 91,13 36,14 55,16 96,17 40,18 1,20 30,21 10,22 3,24 41,25 10,26 2,28 4,29 4,31 1,32 50,34 1,35 4.4,36 0.156,37 15,38 74.5,39 90.905,40 101.584,41 62.813,42 58.969,43 1.1,44 6.523}
{0 CHEMBL504199,1 7.696,2 42.9,3 46.2,4 1,5 1.118,6 0.682,7 0.639,8 700.36,9 3.3,10 28,11 91,13 31,14 54,16 96,17 39,18 1,20 27,21 12,22 3,24 42,25 10,26 2,28 3,29 5,31 1,32 49,34 1,35 5.5,36 0.156,37 15,38 71,39 91.014,40 101.71,41 62.023,42 58.189,43 1.1,44 6.444}
{0 CHEMBL504280,1 8.107,2 47.1,3 42.5,4 1.002,5 1.108,6 0.707,7 0.668,8 705.32,9 2.3,10 34,11 87,13 38,14 55,16 92,17 41,18 1,20 34,21 7,22 4,24 37,25 9,26 2,28 2,29 5,31 1,32 50,34 1,35 5.7,36 0.163,37 15,38 76,39 87.145,40 96.381,41 61.495,42 58.114,43 1.1,44 6.699}
{0 CHEMBL504281,1 9.288,2 46.4,3 39.3,4 1.012,5 1.104,6 0.739,7 0.696,8 780.23,9 2.4,10 34,11 84,13 37,14 56,16 89,17 39,18 3,20 33,21 6,22 3,24 33,25 12,26 5,28 2,29 5,31 2,32 51,34 3,35 6,36 0.169,37 15,38 76,39 84.985,40 92.774,41 62.097,42 58.429,43 3.6,44 6.222}
{0 CHEMBL504617,1 7.603,2 44.1,3 46.1,4 0.996,5 1.116,6 0.687,7 0.643,8 775.48,9 3.9,10 34,11 102,13 37,14 61,16 108,17 45,18 1,20 33,21 12,22 3,24 47,25 10,26 2,28 4,29 4,31 1,32 55,34 1,35 3.9,36 0.148,37 16,38 81,39 101.556,40 113.829,41 70.097,42 65.549,43 1,44 7.886}
{0 CHEMBL504728,1 7.6,2 42.6,3 46.8,4 0.999,5 1.118,6 0.679,7 0.635,8 714.39,9 3.2,10 28,11 94,13 31,14 55,16 99,17 40,18 1,20 27,21 13,22 3,24 44,25 10,26 2,28 3,29 5,31 1,32 50,34 1,35 5.3,36 0.152,37 15,38 72,39 93.898,40 105.125,41 63.785,42 59.716,43 1.1,44 6.886}
{0 CHEMBL504730,1 7.696,2 42.9,3 46.2,4 1,5 1.118,6 0.682,7 0.639,8 700.36,9 3.3,10 28,11 91,13 31,14 54,16 96,17 39,18 1,20 27,21 12,22 3,24 42,25 10,26 2,28 3,29 5,31 1,32 49,34 1,35 5.5,36 0.156,37 15,38 71,39 91.014,40 101.71,41 62.023,42 58.189,43 1.1,44 6.658}
{0 CHEMBL504746,1 7.475,2 44.1,3 47.1,4 0.994,5 1.115,6 0.685,7 0.638,8 762.48,9 2.9,10 34,11 102,13 37,14 59,16 107,17 45,18 1,20 33,21 12,22 3,24 48,25 9,26 2,28 3,29 4,31 1,32 54,34 1,35 3.9,36 0.168,37 18,38 79,39 101.338,40 113.746,41 69.853,42 65.054,43 1,44 7.523}
{0 CHEMBL504912,1 7.993,2 43.8,3 43.8,4 1.004,5 1.117,6 0.691,7 0.653,8 711.34,9 4.5,10 33,11 89,13 36,14 55,16 94,17 39,18 1,20 30,21 9,22 3,24 39,25 11,26 2,28 4,29 5,31 1,32 50,34 1,35 5.6,36 0.16,37 15,38 74.5,39 89.349,40 99.378,41 61.506,42 58.157,43 1.1,44 6.347}
{0 CHEMBL505164,1 7.856,2 46.6,3 44.3,4 0.997,5 1.109,6 0.702,7 0.658,8 691.34,9 2.3,10 34,11 88,13 37,14 54,16 93,17 41,18 1,20 33,21 8,22 3,24 39,25 8,26 2,28 2,29 4,31 1,32 49,34 1,35 4.5,36 0.151,37 14,38 74,39 87.701,40 97.587,41 61.802,42 57.926,43 1.1,44 7.585}
{0 CHEMBL505593,1 7.519,2 43.8,3 46.7,4 0.995,5 1.117,6 0.684,7 0.639,8 789.51,9 3.8,10 34,11 105,13 37,14 62,16 111,17 46,18 1,20 33,21 13,22 3,24 49,25 10,26 2,28 4,29 4,31 1,32 56,34 1,35 3.8,36 0.144,37 16,38 82,39 104.439,40 117.244,41 71.859,42 67.076,43 1,44 7.699}
{0 CHEMBL506097,1 7.948,2 46.1,3 43.8,4 1,5 1.11,6 0.7,7 0.659,8 707.34,9 2.2,10 34,11 89,13 37,14 55,16 94,17 41,18 1,20 33,21 8,22 3,24 39,25 9,26 2,28 2,29 5,31 1,32 50,34 1,35 5.6,36 0.16,37 15,38 75,39 89.029,40 98.796,41 62.256,42 58.641,43 1.1,44 7.658}
{0 CHEMBL506138,1 7.799,2 43.2,3 45.5,4 1.001,5 1.117,6 0.685,7 0.644,8 686.33,9 3.4,10 28,11 88,13 31,14 53,16 93,17 38,18 1,20 27,21 11,22 3,24 40,25 10,26 2,28 3,29 5,31 1,32 48,34 1,35 5.7,36 0.161,37 15,38 70,39 88.13,40 98.295,41 60.262,42 56.662,43 1.1,44 6.456}
{0 CHEMBL507864,1 7.688,2 44.6,3 45.5,4 0.998,5 1.114,6 0.689,7 0.646,8 776.46,9 3,10 34,11 101,13 37,14 61,16 107,17 45,18 1,20 33,21 12,22 3,24 46,25 10,26 2,28 3,29 5,31 1,32 55,34 1,35 5,36 0.15,37 16,38 81,39 100.781,40 112.54,41 69.546,42 65.242,43 1,44 8}
{0 CHEMBL508499,1 8.342,2 43,3 43,4 1.006,5 1.115,6 0.702,7 0.661,8 717.37,9 4.7,10 28,11 86,13 32,14 54,16 91,17 37,18 1,20 28,21 9,22 4,24 37,25 12,26 3,28 4,29 5,31 2,32 49,34 1,35 5.8,36 0.165,37 15,38 72,39 86.541,40 95.883,41 60.392,42 56.817,43 1.2,44 6.125}
{0 CHEMBL508618,1 8.108,2 44.2,3 43,4 1.005,5 1.116,6 0.695,7 0.658,8 697.31,9 4.7,10 33,11 86,13 36,14 54,16 91,17 38,18 1,20 30,21 8,22 3,24 37,25 11,26 2,28 4,29 5,31 1,32 49,34 1,35 5.8,36 0.165,37 15,38 73.5,39 86.465,40 95.963,41 59.745,42 56.63,43 1.2,44 6.292}
{0 CHEMBL509488,1 7.787,2 42.4,3 45.7,4 1.004,5 1.119,6 0.679,7 0.64,8 716.36,9 3.3,10 28,11 92,13 31,14 55,16 97,17 39,18 1,20 27,21 12,22 3,24 42,25 11,26 2,28 3,29 6,31 1,32 50,34 1,35 6.5,36 0.155,37 15,38 72,39 92.341,40 102.919,41 62.478,42 58.904,43 1.1,44 6.456}
{0 CHEMBL509739,1 8.46,2 43.2,3 40.7,4 1.013,5 1.12,6 0.697,7 0.668,8 685.26,9 7.4,10 33,11 81,13 36,14 53,16 86,17 35,18 1,20 28,21 7,22 3,24 33,25 13,26 2,28 6,29 5,31 1,32 48,34 1,35 6.2,36 0.174,37 15,38 72.5,39 82.018,40 90.714,41 56.472,42 54.092,43 1.2,44 6.328}
{0 CHEMBL510044,1 9.367,2 45.9,3 38.8,4 1.015,5 1.106,6 0.736,7 0.696,8 796.23,9 2.4,10 34,11 85,13 38,14 57,16 90,17 39,18 3,20 33,21 6,22 4,24 33,25 13,26 5,28 2,29 6,31 2,32 52,34 3,35 7.1,36 0.167,37 15,38 78,39 86.313,40 93.983,41 62.551,42 59.144,43 3.5,44 6.745}
{0 CHEMBL510417,1 8.345,2 43.9,3 41.5,4 1.01,5 1.117,6 0.698,7 0.666,8 684.27,9 6.1,10 33,11 82,13 36,14 53,16 87,17 36,18 1,20 29,21 7,22 3,24 34,25 12,26 2,28 5,29 5,31 1,32 48,34 1,35 6.1,36 0.172,37 15,38 72.5,39 82.8,40 91.631,41 57.228,42 54.598,43 1.2,44 6.301}
{0 CHEMBL510461,1 8.46,2 43.2,3 40.7,4 1.013,5 1.12,6 0.697,7 0.668,8 685.26,9 7.4,10 33,11 81,13 36,14 53,16 86,17 35,18 1,20 28,21 7,22 3,24 33,25 13,26 2,28 6,29 5,31 1,32 48,34 1,35 6.2,36 0.174,37 15,38 72.5,39 82.018,40 90.714,41 56.472,42 54.092,43 1.2,44 6.42}
{0 CHEMBL510703,1 7.7,2 43.8,3 46.1,4 0.999,5 1.115,6 0.686,7 0.642,8 685.34,9 2.2,10 28,11 89,13 31,14 53,16 94,17 39,18 1,20 27,21 12,22 3,24 41,25 9,26 2,28 2,29 5,31 1,32 48,34 1,35 5.6,36 0.149,37 14,38 70,39 88.912,40 99.212,41 61.017,42 57.167,43 1.1,44 6.699}
{0 CHEMBL520836,1 6.927,2 41,3 49.2,4 0.998,5 1.125,6 0.647,7 0.611,8 422.57,9 3.3,10 16,11 61,13 18,14 33,16 63,17 25,20 15,21 10,22 2,24 30,25 6,28 2,29 4,32 31,35 6.6,36 0.206,37 13,38 43,39 60.883,40 68.647,41 39.489,42 37.277,44 7.071}
{0 CHEMBL590142,1 6.659,2 40.4,3 50.9,4 0.99,5 1.128,6 0.646,7 0.602,8 379.55,9 5.3,10 16,11 57,13 17,14 30,16 59,17 23,20 13,21 10,22 1,24 29,25 5,28 3,29 2,32 28,35 3.5,36 0.203,37 12,38 39,39 56.447,40 64.311,41 36.824,42 34.342,44 5.658}
{0 CHEMBL590143,1 6.527,2 41.4,3 51.7,4 0.987,5 1.125,6 0.648,7 0.601,8 378.56,9 3.4,10 16,11 58,13 17,14 30,16 60,17 24,20 14,21 10,22 1,24 30,25 4,28 2,29 2,32 28,35 3.4,36 0.2,37 12,38 39,39 57.229,40 65.228,41 37.58,42 34.848,44 5}
{0 CHEMBL592145,1 6.317,2 38.5,3 53.8,4 0.987,5 1.131,6 0.631,7 0.583,8 328.5,9 3.8,10 11,11 52,13 12,14 25,16 53,17 20,20 10,21 10,22 1,24 28,25 4,28 2,29 2,32 24,35 3.8,36 0.226,37 12,38 31.5,39 51.345,40 58.813,41 32.819,42 30.321,44 5}
{0 CHEMBL598361,1 6.773,2 38.2,3 50.9,4 1,5 1.131,6 0.631,7 0.595,8 372.51,9 3.6,10 11,11 55,13 13,14 28,16 56,17 21,20 11,21 10,22 2,24 28,25 6,28 2,29 4,32 27,35 7.3,36 0.232,37 13,38 35.5,39 55,40 62.232,41 34.728,42 32.75,44 5}
{0 CHEMBL598362,1 6.773,2 38.2,3 50.9,4 1,5 1.131,6 0.631,7 0.595,8 372.51,9 3.6,10 11,11 55,13 13,14 28,16 56,17 21,20 11,21 10,22 2,24 28,25 6,28 2,29 4,32 27,35 7.3,36 0.232,37 13,38 35.5,39 55,40 62.232,41 34.728,42 32.75,44 5.276}
{0 CHEMBL598567,1 6.773,2 38.2,3 50.9,4 1,5 1.131,6 0.631,7 0.595,8 372.51,9 3.6,10 11,11 55,13 13,14 28,16 56,17 21,20 11,21 10,22 2,24 28,25 6,28 2,29 4,32 27,35 7.3,36 0.232,37 13,38 35.5,39 55,40 62.232,41 34.728,42 32.75,44 5}
{0 CHEMBL598974,1 6.317,2 38.5,3 53.8,4 0.987,5 1.131,6 0.631,7 0.583,8 328.5,9 3.8,10 11,11 52,13 12,14 25,16 53,17 20,20 10,21 10,22 1,24 28,25 4,28 2,29 2,32 24,35 3.8,36 0.226,37 12,38 31.5,39 51.345,40 58.813,41 32.819,42 30.321,44 6.301}
{0 CHEMBL598976,1 6.634,2 39.3,3 51.8,4 0.996,5 1.128,6 0.634,7 0.594,8 371.52,9 1.8,10 11,11 56,13 13,14 28,16 57,17 22,20 12,21 10,22 2,24 29,25 5,28 1,29 4,32 27,35 7.1,36 0.228,37 13,38 35.5,39 55.781,40 63.149,41 35.483,42 33.256,44 5.301}
{0 CHEMBL603,1 7.78,2 41.9,3 44.6,4 1.008,5 1.12,6 0.673,7 0.641,8 575.74,9 4.1,10 22,11 74,13 26,14 45,16 78,17 31,20 22,21 9,22 4,24 33,25 10,26 1,28 3,29 6,31 1,32 41,35 8.1,36 0.115,37 9,38 60,39 74.6,40 82.899,41 49.813,42 47.442,44 4.071}
{0 CHEMBL608435,1 6.773,2 38.2,3 50.9,4 1,5 1.131,6 0.631,7 0.595,8 372.51,9 3.6,10 11,11 55,13 13,14 28,16 56,17 21,20 11,21 10,22 2,24 28,25 6,28 2,29 4,32 27,35 7.3,36 0.232,37 13,38 35.5,39 55,40 62.232,41 34.728,42 32.75,44 5.745}
{0 CHEMBL609913,1 6.773,2 38.2,3 50.9,4 1,5 1.131,6 0.631,7 0.595,8 372.51,9 3.6,10 11,11 55,13 13,14 28,16 56,17 21,20 11,21 10,22 2,24 28,25 6,28 2,29 4,32 27,35 7.3,36 0.232,37 13,38 35.5,39 55,40 62.232,41 34.728,42 32.75,44 5.086}
{0 CHEMBL63354,1 9.284,2 51.7,3 31,4 1.038,5 1.101,6 0.714,7 0.722,8 538.48,10 24,11 58,13 28,14 45,16 63,17 30,20 30,22 4,24 18,25 10,29 10,32 40,35 17.2,36 0.048,37 3,38 61,39 60.225,40 63.831,41 41.398,42 41.889,44 4}
{0 CHEMBL8970,1 8.05,2 46.5,3 41.6,4 1.008,5 1.118,6 0.694,7 0.665,8 813,9 4,10 30,11 101,13 36,14 65,16 107,17 47,20 37,21 10,22 6,23 2,24 42,25 12,26 1,28 4,29 5,31 1,32 59,34 2,35 5,36 0.121,37 13,38 86,39 101.818,40 112.944,41 70.046,42 67.149,43 2,44 8.208}
{0 CHEMBL8973,1 7.774,2 46.2,3 43.4,4 1.003,5 1.115,6 0.689,7 0.656,8 824.05,9 2.8,10 30,11 106,13 36,14 66,16 112,17 49,20 37,21 12,22 6,23 1,24 46,25 11,26 1,28 3,29 6,31 1,32 60,34 1,35 5.7,36 0.116,37 13,38 87,39 106.298,40 118.145,41 73.08,42 69.513,43 0.9,44 8.276}
{0 CHEMBL9021,1 6.281,2 37.3,3 55.9,4 0.996,5 1.147,6 0.61,7 0.565,8 370.55,11 59,13 5,14 25,16 58,17 22,20 9,21 13,22 5,23 3,24 33,25 4,29 1,32 26,34 3,35 1.7,36 0.259,37 15,38 30,39 58.77,40 67.702,41 35.972,42 33.347,43 5.1,44 6.377}
{0 CHEMBL9161,1 7.944,2 46.2,3 42.5,4 1.008,5 1.118,6 0.689,7 0.659,8 842.04,9 2.8,10 30,11 106,13 36,14 67,16 112,17 49,20 37,21 12,22 6,23 2,24 45,25 12,26 1,28 3,29 6,31 1,32 61,34 2,35 5.7,36 0.116,37 13,38 88,39 106.81,40 118.485,41 73.018,42 69.896,43 1.9,44 8.678}
{0 CHEMBL9277,1 8.408,2 48.9,3 38.6,4 1.011,5 1.11,6 0.71,7 0.686,8 739.87,9 3.4,10 30,11 88,13 36,14 60,16 94,17 43,20 37,21 6,22 6,23 1,24 34,25 11,26 1,28 3,29 6,31 1,32 54,34 1,35 6.8,36 0.117,37 11,38 81,39 88.996,40 97.654,41 62.512,42 60.352,43 1.1,44 7.108}
{0 CHEMBL95190,1 5.735,2 32.3,3 59.7,4 0.989,5 1.142,6 0.589,7 0.538,8 355.58,9 1.6,11 62,13 3,14 24,16 61,17 20,20 3,21 17,22 3,24 37,25 5,28 1,29 4,32 25,35 6.5,36 0.295,37 18,38 27,39 61.316,40 70.81,41 36.529,42 33.363,44 5.357}
