{
  "data_features": {
    "feature": [
      {
        "data_type": "nominal",
        "index": "0",
        "is_ignore": "false",
        "is_row_identifier": "true",
        "is_target": "false",
        "name": "molecule_id",
        "nominal_value": [
          "CHEMBL1086580",
          "CHEMBL1240703",
          "CHEMBL124660",
          "CHEMBL1257010",
          "CHEMBL1315989",
          "CHEMBL1319888",
          "CHEMBL1336",
          "CHEMBL1364326",
          "CHEMBL1418516",
          "CHEMBL1443282",
          "CHEMBL1474898",
          "CHEMBL147552",
          "CHEMBL1483505",
          "CHEMBL151",
          "CHEMBL1515576",
          "CHEMBL1552546",
          "CHEMBL1552719",
          "CHEMBL1599148",
          "CHEMBL1611739",
          "CHEMBL16751",
          "CHEMBL16861",
          "CHEMBL1724183",
          "CHEMBL1729169",
          "CHEMBL1867804",
          "CHEMBL1880061",
          "CHEMBL1898239",
          "CHEMBL1956162",
          "CHEMBL2016633",
          "CHEMBL2016634",
          "CHEMBL2016635",
          "CHEMBL2016636",
          "CHEMBL2016637",
          "CHEMBL2016638",
          "CHEMBL2016639",
          "CHEMBL2016863",
          "CHEMBL2030485",
          "CHEMBL2030486",
          "CHEMBL222556",
          "CHEMBL2309006",
          "CHEMBL2309609",
          "CHEMBL2314698",
          "CHEMBL2325495",
          "CHEMBL2325496",
          "CHEMBL2325497",
          "CHEMBL2325498",
          "CHEMBL2325499",
          "CHEMBL2325500",
          "CHEMBL2325501",
          "CHEMBL2325502",
          "CHEMBL2325503",
          "CHEMBL253786",
          "CHEMBL275638",
          "CHEMBL28",
          "CHEMBL301624",
          "CHEMBL535",
          "CHEMBL53738",
          "CHEMBL551249",
          "CHEMBL551505",
          "CHEMBL551775",
          "CHEMBL560509",
          "CHEMBL562310",
          "CHEMBL564157",
          "CHEMBL576982"
        ],
        "number_of_missing_values": "0"
      },
      {
        "data_type": "numeric",
        "index": "1",
        "is_ignore": "false",
        "is_row_identifier": "false",
        "is_target": "false",
        "name": "AMW",
        "number_of_missing_values": "0"
      },
      {
        "data_type": "numeric",
        "index": "2",
        "is_ignore": "false",
        "is_row_identifier": "false",
        "is_target": "false",
        "name": "C.",
        "number_of_missing_values": "0"
      },
      {
        "data_type": "numeric",
        "index": "3",
        "is_ignore": "false",
        "is_row_identifier": "false",
        "is_target": "true",
        "name": "pXC50",
        "number_of_missing_values": "0"
      }
    ]
  }
}