{
  "data_set_description": {
    "collection_date": "November 2013",
    "creator": "Dr Jeremy Besnard, Dr Ivan Olier, Dr Noureddin Sadawi, Dr Larisa Soldatova, Dr Crina Grosan, Prof Ross King, Dr Richard Bickerton, Prof Andrew Hopkins and Dr Willem van Hoorn",
    "default_target_attribute": "pXC50",
    "description": "This dataset contains QSAR data (from ChEMBL version 17) showing activity values (unit is pseudo-pCI50) of several compounds on drug target ChEMBL_ID: CHEMBL3501 (TID: 17120), and it has 731 rows and 133 features (not including molecule IDs and class feature: molecule_id and pXC50). The features represent Molecular Descriptors which were generated from SMILES strings. Missing value imputation was applied to this dataset (By choosing the Median). Feature selection was also applied.",
    "description_version": "1",
    "file_id": "3308798",
    "format": "ARFF",
    "id": "26643",
    "licence": "Public",
    "md5_checksum": "e19acb4039dd6c168e633b7b16f9a33b",
    "minio_url": "https://data.openml.org/datasets/0002/26643/dataset_26643.pq",
    "name": "QSAR-DATASET-FOR-DRUG-TARGET-CHEMBL3501",
    "original_data_url": "https://www.ebi.ac.uk/chembl/target/inspect/CHEMBL3501",
    "parquet_url": "https://data.openml.org/datasets/0002/26643/dataset_26643.pq",
    "processing_date": "2018-10-04 00:05:52",
    "row_id_attribute": "molecule_id",
    "status": "deactivated",
    "tag": [
      "MetaQSAR",
      "study_13"
    ],
    "upload_date": "2016-07-14T19:43:39",
    "url": "https://api.openml.org/data/v1/download/3308798/QSAR-DATASET-FOR-DRUG-TARGET-CHEMBL3501.arff",
    "version": "10",
    "visibility": "public"
  }
}