"molecule_id","FCFP4_1024b471","FCFP4_1024b72","FCFP4_1024b75","FCFP4_1024b71","FCFP4_1024b692","FCFP4_1024b792","FCFP4_1024b133","FCFP4_1024b25","FCFP4_1024b1002","FCFP4_1024b61","FCFP4_1024b902","FCFP4_1024b940","FCFP4_1024b954","FCFP4_1024b1","FCFP4_1024b10","FCFP4_1024b100","FCFP4_1024b1000","FCFP4_1024b1001","FCFP4_1024b1003","FCFP4_1024b1004","FCFP4_1024b1005","FCFP4_1024b1006","FCFP4_1024b1007","FCFP4_1024b1008","FCFP4_1024b1009","FCFP4_1024b101","FCFP4_1024b1010","FCFP4_1024b1011","FCFP4_1024b1012","FCFP4_1024b1013","FCFP4_1024b1014","FCFP4_1024b1015","FCFP4_1024b1016","FCFP4_1024b1017","FCFP4_1024b1018","FCFP4_1024b1019","FCFP4_1024b102","FCFP4_1024b1020","FCFP4_1024b1021","FCFP4_1024b1022","FCFP4_1024b1023","FCFP4_1024b1024","FCFP4_1024b103","FCFP4_1024b104","FCFP4_1024b105","FCFP4_1024b106","FCFP4_1024b107","FCFP4_1024b108","FCFP4_1024b109","FCFP4_1024b11","FCFP4_1024b110","pXC50"
{4 1,5 1,6 1,7 1,8 1,9 1,12 1,14 1,52 6.821}
{0 CHEMBL1223618,4 1,5 1,6 1,7 1,8 1,9 1,14 1,15 1,52 5.704}
{0 CHEMBL1223619,4 1,5 1,6 1,7 1,8 1,9 1,14 1,15 1,52 4.548}
{0 CHEMBL1223620,4 1,5 1,6 1,7 1,8 1,9 1,14 1,15 1,52 5.908}
{0 CHEMBL1223621,4 1,5 1,6 1,7 1,8 1,9 1,14 1,15 1,52 5.953}
{0 CHEMBL1223684,4 1,5 1,6 1,7 1,8 1,9 1,14 1,15 1,52 5.873}
{0 CHEMBL1223685,4 1,5 1,6 1,7 1,8 1,9 1,14 1,15 1,52 6.987}
{0 CHEMBL1223686,1 1,2 1,3 1,4 1,5 1,6 1,7 1,8 1,9 1,14 1,52 7.441}
{0 CHEMBL1223687,4 1,5 1,6 1,7 1,8 1,9 1,14 1,52 7.492}
{0 CHEMBL1224653,4 1,5 1,6 1,7 1,8 1,9 1,12 1,13 1,14 1,37 1,52 7.158}
{0 CHEMBL1224717,4 1,5 1,6 1,7 1,8 1,9 1,14 1,18 1,22 1,52 7.506}
{0 CHEMBL1224718,4 1,5 1,6 1,7 1,8 1,9 1,14 1,52 6.329}
{0 CHEMBL1224719,4 1,5 1,6 1,7 1,8 1,9 1,14 1,52 6.991}
{0 CHEMBL1224720,4 1,5 1,6 1,7 1,8 1,9 1,14 1,52 6.662}
{0 CHEMBL1224721,4 1,5 1,6 1,7 1,8 1,9 1,14 1,15 1,52 6.383}
{0 CHEMBL158286,8 1,9 1,14 1,15 1,23 1,52 5.194}
{0 CHEMBL161115,8 1,14 1,27 1,52 6.721}
{0 CHEMBL161465,52 5.699}
{0 CHEMBL161602,9 1,14 1,15 1,52 5}
{0 CHEMBL161714,14 1,23 1,52 5.367}
{0 CHEMBL161740,8 1,9 1,14 1,15 1,27 1,52 6.244}
{0 CHEMBL162188,52 5}
{0 CHEMBL18701,8 1,14 1,47 1,52 5.4}
{0 CHEMBL1916475,14 1,52 5.699}
{0 CHEMBL19449,8 1,14 1,52 6.622}
{0 CHEMBL196969,1 1,2 1,3 1,4 1,5 1,6 1,7 1,8 1,9 1,10 1,11 1,14 1,52 9.155}
{0 CHEMBL197386,1 1,2 1,3 1,4 1,5 1,6 1,7 1,8 1,9 1,10 1,11 1,14 1,52 8.42}
{0 CHEMBL197392,1 1,2 1,3 1,4 1,5 1,6 1,7 1,8 1,9 1,10 1,11 1,14 1,52 9.398}
{0 CHEMBL197494,4 1,5 1,6 1,7 1,8 1,9 1,10 1,11 1,14 1,52 8.244}
{0 CHEMBL198432,4 1,5 1,6 1,7 1,8 1,9 1,14 1,52 8.481}
{0 CHEMBL198464,4 1,5 1,6 1,7 1,8 1,9 1,14 1,21 1,44 1,52 7.167}
{0 CHEMBL198527,1 1,2 1,3 1,4 1,5 1,6 1,7 1,8 1,9 1,10 1,11 1,12 1,13 1,14 1,37 1,52 7.854}
{0 CHEMBL198564,4 1,5 1,6 1,7 1,8 1,9 1,14 1,52 6.975}
{0 CHEMBL198674,1 1,2 1,3 1,4 1,5 1,6 1,7 1,8 1,9 1,10 1,11 1,14 1,52 9.301}
{0 CHEMBL198722,1 1,2 1,3 1,4 1,5 1,6 1,7 1,8 1,9 1,10 1,11 1,14 1,52 7.959}
{0 CHEMBL198732,1 1,2 1,3 1,4 1,5 1,6 1,7 1,8 1,9 1,10 1,11 1,12 1,13 1,14 1,37 1,52 7.854}
{0 CHEMBL198853,1 1,2 1,3 1,4 1,5 1,6 1,7 1,8 1,9 1,10 1,11 1,12 1,13 1,14 1,15 1,52 7.943}
{0 CHEMBL199015,8 1,14 1,44 1,52 9}
{0 CHEMBL200906,8 1,14 1,47 1,52 4.796}
{0 CHEMBL204449,8 1,14 1,52 5.861}
{0 CHEMBL204522,1 1,2 1,3 1,4 1,5 1,6 1,7 1,8 1,9 1,12 1,13 1,14 1,37 1,52 7.387}
{0 CHEMBL206592,1 1,2 1,3 1,4 1,5 1,6 1,7 1,8 1,9 1,12 1,13 1,14 1,37 1,52 7.854}
{0 CHEMBL206968,1 1,2 1,3 1,4 1,5 1,6 1,7 1,8 1,9 1,12 1,13 1,14 1,15 1,52 9.046}
{0 CHEMBL207424,1 1,2 1,3 1,4 1,5 1,6 1,7 1,8 1,9 1,12 1,13 1,14 1,37 1,52 7.155}
{0 CHEMBL207559,1 1,2 1,3 1,4 1,5 1,6 1,7 1,8 1,9 1,12 1,13 1,14 1,37 1,52 7.602}
{0 CHEMBL207775,4 1,5 1,6 1,7 1,8 1,9 1,12 1,13 1,14 1,37 1,47 1,52 7.013}
{0 CHEMBL207996,4 1,5 1,6 1,7 1,8 1,9 1,12 1,13 1,14 1,37 1,47 1,52 8.26}
{0 CHEMBL208100,1 1,2 1,3 1,4 1,5 1,6 1,7 1,8 1,9 1,12 1,13 1,14 1,37 1,52 8.194}
{0 CHEMBL208149,1 1,2 1,3 1,4 1,5 1,6 1,7 1,8 1,9 1,12 1,13 1,14 1,37 1,47 1,52 7.585}
{0 CHEMBL208236,1 1,2 1,3 1,4 1,5 1,6 1,7 1,8 1,9 1,12 1,13 1,14 1,37 1,47 1,52 7.975}
{0 CHEMBL208382,1 1,2 1,3 1,4 1,5 1,6 1,7 1,8 1,9 1,12 1,13 1,14 1,37 1,52 7.607}
{0 CHEMBL209295,1 1,2 1,3 1,4 1,5 1,6 1,7 1,8 1,9 1,12 1,13 1,14 1,15 1,52 8.377}
{0 CHEMBL210840,4 1,5 1,6 1,7 1,8 1,9 1,12 1,13 1,14 1,37 1,52 6.31}
{0 CHEMBL2171452,8 1,11 1,14 1,19 1,52 8}
{0 CHEMBL2172707,52 5.433}
{0 CHEMBL2172710,8 1,14 1,19 1,36 1,52 6.686}
{0 CHEMBL2172734,8 1,14 1,19 1,36 1,52 6.297}
{0 CHEMBL217899,8 1,14 1,50 1,52 7}
{0 CHEMBL2179105,8 1,14 1,15 1,38 1,52 5}
{0 CHEMBL218103,8 1,12 1,14 1,50 1,52 7.398}
{0 CHEMBL218653,8 1,14 1,50 1,52 7.114}
{0 CHEMBL218793,8 1,14 1,50 1,52 5.613}
{0 CHEMBL218990,8 1,14 1,50 1,52 6.155}
{0 CHEMBL226630,14 1,52 5.62}
{0 CHEMBL252387,8 1,14 1,52 6.345}
{0 CHEMBL296435,14 1,38 1,52 4.796}
{0 CHEMBL307646,8 1,14 1,19 1,38 1,52 7.745}
{0 CHEMBL32442,8 1,14 1,21 1,52 8.347}
{0 CHEMBL345360,8 1,14 1,52 5}
{0 CHEMBL345812,38 1,52 5}
{0 CHEMBL351500,14 1,52 6.051}
{0 CHEMBL351613,52 6.215}
{0 CHEMBL351900,14 1,23 1,52 5.495}
{0 CHEMBL351915,52 5}
{0 CHEMBL370220,4 1,5 1,6 1,7 1,8 1,9 1,14 1,47 1,52 7.924}
{0 CHEMBL371037,1 1,2 1,3 1,4 1,5 1,6 1,7 1,8 1,9 1,10 1,11 1,12 1,13 1,14 1,15 1,52 8.167}
{0 CHEMBL371089,1 1,2 1,3 1,4 1,5 1,6 1,7 1,8 1,9 1,10 1,11 1,14 1,52 8.538}
{0 CHEMBL372575,1 1,2 1,3 1,4 1,5 1,6 1,7 1,8 1,9 1,10 1,11 1,12 1,13 1,14 1,37 1,52 8.041}
{0 CHEMBL377709,1 1,2 1,3 1,4 1,5 1,6 1,7 1,8 1,9 1,12 1,13 1,14 1,37 1,52 8.77}
{0 CHEMBL378681,1 1,2 1,3 1,4 1,5 1,6 1,7 1,8 1,9 1,12 1,13 1,14 1,15 1,52 8.022}
{0 CHEMBL379768,1 1,2 1,3 1,4 1,5 1,6 1,7 1,8 1,9 1,12 1,13 1,14 1,37 1,52 7.77}
{0 CHEMBL380321,1 1,2 1,3 1,4 1,5 1,6 1,7 1,8 1,9 1,12 1,13 1,14 1,15 1,47 1,52 10.301}
{0 CHEMBL380933,1 1,2 1,3 1,4 1,5 1,6 1,7 1,8 1,9 1,12 1,13 1,14 1,37 1,52 8.229}
{0 CHEMBL381681,1 1,2 1,3 1,4 1,5 1,6 1,7 1,8 1,9 1,10 1,11 1,14 1,52 8.921}
{0 CHEMBL382168,1 1,2 1,3 1,4 1,5 1,6 1,7 1,8 1,9 1,12 1,13 1,14 1,15 1,52 8.77}
{0 CHEMBL382545,4 1,5 1,6 1,7 1,8 1,9 1,14 1,21 1,52 7.658}
{0 CHEMBL383225,1 1,2 1,3 1,4 1,5 1,6 1,7 1,8 1,9 1,12 1,13 1,14 1,15 1,52 9}
{0 CHEMBL383762,8 1,14 1,44 1,52 6.87}
{0 CHEMBL383837,4 1,5 1,6 1,7 1,8 1,9 1,12 1,13 1,14 1,37 1,47 1,52 7.77}
{0 CHEMBL42126,4 1,8 1,14 1,47 1,52 7.854}
{0 CHEMBL430893,8 1,14 1,45 1,52 5.433}
{0 CHEMBL466068,8 1,14 1,15 1,52 5}
{0 CHEMBL466280,8 1,14 1,27 1,47 1,52 6}
{0 CHEMBL466481,14 1,47 1,52 5}
{0 CHEMBL511115,8 1,12 1,13 1,14 1,15 1,52 6.09}
{0 CHEMBL549560,14 1,52 6.975}
{0 CHEMBL551052,14 1,15 1,52 5.699}
{0 CHEMBL564209,8 1,14 1,52 7.337}
{0 CHEMBL567470,14 1,52 5.699}
{0 CHEMBL583914,7 1,8 1,14 1,15 1,38 1,52 6}
{0 CHEMBL591501,9 1,14 1,15 1,52 5.699}
{0 CHEMBL63,8 1,14 1,45 1,52 5.45}
{0 CHEMBL74078,8 1,14 1,27 1,52 7.167}
{0 CHEMBL77826,8 1,14 1,27 1,52 5.91}
{0 CHEMBL90375,4 1,8 1,14 1,52 6.9}
{0 CHEMBL91551,8 1,14 1,19 1,38 1,52 7.021}
{0 CHEMBL91571,4 1,8 1,14 1,52 7.815}
