{
  "data_set_description": {
    "collection_date": "November 2013",
    "creator": "Dr Jeremy Besnard, Dr Ivan Olier, Dr Noureddin Sadawi, Dr Larisa Soldatova, Dr Crina Grosan, Prof Ross King, Dr Richard Bickerton, Prof Andrew Hopkins and Dr Willem van Hoorn",
    "default_target_attribute": "pXC50",
    "description": "This dataset contains QSAR data (from ChEMBL version 17) showing activity values (unit is pseudo-pCI50) of several compounds on drug target ChEMBL_ID: CHEMBL5903 (TID: 101598), and it has 399 rows and 43 features (not including molecule IDs and class feature: molecule_id and pXC50). The features represent Basic Molecular Descriptors which were generated from SMILES strings.  Missing value imputation was applied to this dataset (By choosing the Median).",
    "description_version": "1",
    "file_id": "3307740",
    "format": "ARFF",
    "id": "26617",
    "licence": "Public",
    "md5_checksum": "c1bf46f9a359aec951208b6ded17c1f8",
    "minio_url": "https://data.openml.org/datasets/0002/26617/dataset_26617.pq",
    "name": "QSAR-DATASET-FOR-DRUG-TARGET-CHEMBL5903",
    "original_data_url": "https://www.ebi.ac.uk/chembl/target/inspect/CHEMBL5903",
    "parquet_url": "https://data.openml.org/datasets/0002/26617/dataset_26617.pq",
    "processing_date": "2018-10-03 23:53:07",
    "row_id_attribute": "molecule_id",
    "status": "deactivated",
    "tag": [
      "MetaQSAR",
      "study_13"
    ],
    "upload_date": "2016-07-14T19:39:48",
    "url": "https://api.openml.org/data/v1/download/3307740/QSAR-DATASET-FOR-DRUG-TARGET-CHEMBL5903.arff",
    "version": "8",
    "visibility": "public"
  }
}