"molecule_id","SaaNH","NaaNH","Chi0_EA.bo.","ON1","SpDiam_AEA.bo.","CATS2D_04_AA","NaasC","D.Dtr05","CATS2D_05_DL","CENT","Chi0_AEA.bo.","Chi0_AEA.dm.","Chi0_AEA.ed.","Chi0_AEA.ri.","Chi0_EA","Chi0_EA.ed.","Chi0_EA.ri.","Chi1_EA.bo.","Eig15_AEA.dm.","S2K","P_VSA_LogP_6","DLS_03","SsssN","SpMin2_Bh.s.","SpMax8_Bh.m.","ATSC7p","Eta_betaP","Hypertens.50","ATSC4e","CATS2D_01_DA","NaaaC","SaaaC","Psi_e_A","Psi_i_A","SpMaxA_EA.bo.","X1Per","ZM1Mad","nAB","MATS7p","JGI2","BLTA96","MLOGP","MLOGP2","Eta_beta","nROR","O.059","ATS5i","ATSC4v","ATSC5v","SpMin5_Bh.s.","piPC02","SM02_EA.bo.","ATSC5m","CATS2D_07_LL","SpMax1_Bh.p.","SpMAD_AEA.ri.","SpMAD_EA.ed.","SRW09","X1MulPer","ATSC7m","BLTD48","BLTF96","SpMAD_AEA.ed.","VvdwZAZ","Eta_beta_A","ATSC8e","VAR","H.051","JGI3","P_VSA_MR_7","GATS2v","Eta_sh_y","SpMax8_Bh.e.","Eig13_EA.ri.","CATS2D_05_AL","Ui","Eig05_EA.bo.","SM15_AEA.ri.","AAC","AECC","ALOGP","ALOGP2","AMR","AMW","ARR","ATS1e","ATS1i","ATS1m","ATS1p","ATS1s","ATS1v","ATS2e","ATS2i","ATS2m","ATS2p","ATS2s","ATS2v","ATS3e","ATS3i","ATS3m","ATS3p","ATS3s","ATS3v","ATS4e","ATS4i","ATS4m","ATS4p","ATS4s","ATS4v","ATS5e","ATS5m","ATS5p","ATS5s","ATS5v","ATS6e","ATS6i","ATS6m","ATS6p","ATS6s","ATS6v","ATS7e","ATS7i","ATS7m","ATS7p","ATS7s","ATS7v","ATS8e","ATS8i","ATS8m","ATS8p","ATS8s","ATS8v","ATSC1e","ATSC1i","ATSC1m","ATSC1p","ATSC1s","ATSC1v","ATSC2e","ATSC2i","ATSC2m","ATSC2p","ATSC2s","ATSC2v","ATSC3e","ATSC3i","ATSC3m","ATSC3p","ATSC3s","ATSC3v","ATSC4i","ATSC4m","ATSC4p","ATSC4s","ATSC5e","ATSC5i","ATSC5p","ATSC5s","ATSC6e","ATSC6i","ATSC6m","ATSC6p","ATSC6s","ATSC6v","ATSC7e","ATSC7i","ATSC7s","ATSC7v","ATSC8i","ATSC8m","ATSC8p","ATSC8s","ATSC8v","BAC","BBI","BIC0","BIC1","BIC2","BIC3","BIC4","BIC5","BID","BLI","C.","pXC50"
{3 13.635,4 5.208,5 5.612,6 5,7 4,8 38.662,9 2,10 762,11 15.704,12 15.704,13 15.704,14 15.704,15 15.704,16 9.022,17 16.25,18 9.389,19 -0.423,20 6.188,21 9.287,22 1,24 1.119,25 2.596,26 9.531,27 16,28 1,29 0.523,31 3,32 1.758,33 7.941,34 2.441,35 0.19,36 5.965,37 178.625,38 15,39 -0.256,40 0.063,41 -3.34,42 2.106,43 4.434,44 32.5,47 4.836,48 8.966,49 9.953,50 0.639,51 4.347,52 5.034,53 22.796,54 3,55 4.064,56 1.515,57 4.725,58 7.05,59 7.086,60 30.416,61 -3.32,62 -3.18,63 1.605,64 282.32,65 1.354,66 0.688,67 76,68 5,69 0.061,70 72.569,71 0.817,72 0.344,73 2.786,74 -0.431,75 4,76 3.392,77 2.963,78 2.963,79 1.806,80 7.708,81 2.515,82 6.327,83 90.706,84 8.127,85 0.577,86 3.881,87 3.988,88 3.685,89 3.382,90 4.953,91 3.358,92 4.441,93 4.615,94 3.941,95 3.72,96 5.761,97 3.704,98 4.587,99 4.783,100 3.981,101 3.81,102 5.757,103 3.803,104 4.6,105 4.792,106 4.085,107 3.888,108 5.779,109 3.863,110 4.658,111 4.115,112 3.984,113 5.791,114 3.92,115 4.785,116 4.982,117 4.061,118 3.997,119 5.985,120 3.919,121 4.779,122 4.994,123 3.696,124 3.865,125 5.945,126 3.723,127 4.664,128 4.94,129 3.265,130 3.56,131 5.608,132 3.366,133 0.119,134 0.699,135 11.027,136 3.91,137 15.855,138 4.752,139 0.539,140 1.054,141 21.521,142 6.568,143 61.736,144 8.329,145 0.573,146 1.202,147 21.817,148 5.89,149 61.791,150 8.145,151 1.293,152 21.226,153 6.333,154 39.567,155 0.505,156 1.345,157 7.646,158 33.206,159 0.564,160 1.365,161 30.416,162 9.403,163 53.877,164 12.067,165 0.711,166 1.202,167 86.606,168 12.157,169 0.907,170 31.44,171 8.493,172 77.083,173 11.273,174 50,175 39,176 0.313,177 0.639,178 0.832,179 0.84,180 0.84,181 0.84,182 3.23,183 1.088,184 34.9,185 6}
{0 CHEMBL1086110,3 11.857,4 4.5,5 5.554,6 3,7 4,8 31.278,10 456,11 13.602,12 13.602,13 13.602,14 13.602,15 13.602,16 7.888,17 14.049,18 7.969,19 -1.116,20 4.932,21 6.959,22 1,24 1.127,25 2.571,26 6.593,27 12.5,29 0.297,31 3,32 2.737,33 7.558,34 2.058,35 0.224,36 5.433,37 120.342,38 15,39 -0.258,40 0.069,41 -3.88,42 2.65,43 7.025,44 26.25,47 4.718,48 8.689,49 10.023,50 0.611,51 4.147,52 4.832,53 19.758,54 4,55 4.045,56 1.503,57 4.584,58 7.05,59 6.433,60 19.174,61 -3.84,62 -3.64,63 1.617,64 235.23,65 1.313,66 0.276,67 56,68 8,69 0.059,70 50.357,71 0.748,72 0.413,73 2.734,74 -0.791,75 5,76 3.087,77 2.377,78 2.377,79 1.52,80 7.05,81 2.875,82 8.268,83 76.149,84 7.115,85 0.682,86 3.739,87 3.866,88 3.284,89 3.234,90 4.798,91 3.219,92 4.285,93 4.489,94 3.663,95 3.589,96 5.281,97 3.565,98 4.402,99 4.615,100 3.754,101 3.696,102 5.423,103 3.677,104 4.475,105 4.683,106 3.748,107 3.773,108 5.486,109 3.729,110 4.509,111 3.572,112 3.791,113 5.456,114 3.691,115 4.572,116 4.839,117 3.374,118 3.692,119 5.413,120 3.549,121 4.41,122 4.679,123 3,124 3.483,125 5.224,126 3.299,127 4.271,128 4.572,129 2.359,130 3.147,131 4.997,132 2.897,133 0.007,134 0.585,135 8.265,136 3.251,137 6.212,138 4.597,139 0.213,140 0.913,141 16.015,142 5.192,143 18.204,144 7.681,145 0.223,146 1.059,147 18.019,148 5.078,149 22.347,150 7.928,151 1.131,152 19.305,153 5.643,154 22.626,155 0.208,156 1.106,157 6.752,158 22.7,159 0.255,160 1.037,161 22.431,162 7.352,163 26.409,164 11.125,165 0.18,166 0.835,167 23.958,168 9.728,169 0.617,170 17.832,171 5.586,172 26.9,173 8.16,174 22,175 32,176 0.273,177 0.58,178 0.777,179 0.796,180 0.805,181 0.833,182 3.061,183 0.934,184 39.5,185 5.301}
{0 CHEMBL1221434,3 19.836,4 7.292,5 5.455,7 6,9 2,10 2316,11 22.48,12 22.48,13 22.48,14 22.48,15 22.48,16 13.315,17 23.088,18 14.322,19 0.722,20 10.399,22 1,24 1.298,25 2.958,26 13.319,27 23,29 0.441,31 2,32 1.706,33 7.924,34 2.424,35 0.122,36 8.855,37 199.352,38 23,39 -0.044,40 0.056,41 -5.58,42 4.347,43 18.9,44 43.75,47 5.232,48 19.815,49 17.652,50 0.8,51 4.516,52 5.204,53 33.665,54 14,55 4.059,56 1.496,57 4.267,59 10.658,60 33.985,61 -5.45,62 -5.09,63 1.503,64 420.39,65 1.287,66 0.747,67 176,69 0.032,70 16.786,71 0.911,72 0.282,73 3.076,74 0.856,75 5,76 3.644,77 3.068,78 3.068,79 1.509,80 14.029,81 6.663,82 44.392,83 127.891,84 7.599,85 0.622,86 4.199,87 4.298,88 3.772,89 3.767,90 5.331,91 3.748,92 4.738,93 4.884,94 4.162,95 4.146,96 6.077,97 4.113,98 4.969,99 5.139,100 4.133,101 4.304,102 6.029,103 4.225,104 5.092,105 5.335,106 4.1,107 4.298,108 6.054,109 4.194,110 5.008,111 4.149,112 4.27,113 6.071,114 4.193,115 4.974,116 5.16,117 4.131,118 4.245,119 6.114,120 4.173,121 4.993,122 5.22,123 4.01,124 4.164,125 6.026,126 4.073,127 4.866,128 5.093,129 3.976,130 4.012,131 6.023,132 3.944,133 0.058,134 0.912,135 11.773,136 6.202,137 19.527,138 7.298,139 0.704,140 1.589,141 23.655,142 10.187,143 95.372,144 12.25,145 0.374,146 1.708,147 29.879,148 12.904,149 57.794,150 16.047,151 1.91,152 37.646,153 14.819,154 63.933,155 0.377,156 1.915,157 13.783,158 62.97,159 0.451,160 1.807,161 31.081,162 12.928,163 58.988,164 15.98,165 0.433,166 1.757,167 64.597,168 17.011,169 1.66,170 30.831,171 11.272,172 77.875,173 14.322,174 35,175 52,176 0.242,177 0.553,178 0.748,179 0.855,180 0.863,181 0.863,182 3.56,183 0.903,184 45.9,185 4.538}
{0 CHEMBL1779976,3 20.272,4 7.389,5 5.376,6 2,7 8,8 86.338,9 4,10 2188,11 23.239,12 23.239,13 23.239,14 23.239,15 23.239,16 13.837,17 23.482,18 14.416,19 1,20 9.824,21 5.449,22 1,23 2.275,24 1.083,25 2.873,26 13.66,27 23.5,29 0.493,33 7.598,34 2.098,35 0.108,36 9.223,37 196.442,38 23,39 0.046,40 0.063,41 -4.31,42 3.079,43 9.481,44 45.5,47 5.309,48 18.351,49 17.748,50 0.864,51 4.53,52 5.218,53 36.098,54 10,55 3.96,56 1.497,57 4.262,58 6.804,59 11.112,60 36.128,61 -4.25,62 -4.01,63 1.531,64 417.46,65 1.338,66 0.436,67 157,68 7,69 0.044,70 33.571,71 0.919,72 0.332,73 3.062,74 1.022,75 10,76 3.755,77 2.979,78 2.979,79 1.451,80 13,81 4,82 16.002,83 131.795,84 7.3,85 0.605,86 4.219,87 4.336,88 3.781,89 3.796,90 5.288,91 3.768,92 4.757,93 4.93,94 4.142,95 4.184,96 5.782,97 4.138,98 5.001,99 5.196,100 4.184,101 4.319,102 5.99,103 4.244,104 5.118,105 5.345,106 4.147,107 4.313,108 6.083,109 4.218,110 5.077,111 4.15,112 4.285,113 6.062,114 4.2,115 5.091,116 5.318,117 4.074,118 4.283,119 6.082,120 4.189,121 5.066,122 5.313,123 4.095,124 4.281,125 6.015,126 4.174,127 5.025,128 5.253,129 4.096,130 4.269,131 6.026,132 4.171,133 0.031,134 0.886,135 12.661,136 5.659,137 8.457,138 7.474,139 0.239,140 1.469,141 23.873,142 9.267,143 26.098,144 12.703,145 0.315,146 1.814,147 31.794,148 11.931,149 40.044,150 16.141,151 1.954,152 37.802,153 13.303,154 55.278,155 0.361,156 1.886,157 12.719,158 51.385,159 0.461,160 1.869,161 37.198,162 12.811,163 63.604,164 17.299,165 0.366,166 1.831,167 52.471,168 19.122,169 1.763,170 34.22,171 12.778,172 58.154,173 17.699,174 10,175 53,176 0.23,177 0.536,178 0.696,179 0.831,180 0.875,181 0.881,182 3.561,183 0.915,184 45.2,185 8.745}
{0 CHEMBL1779978,3 18.137,4 6.583,5 5.405,6 2,7 6,8 86.999,9 2,10 1580,11 20.378,12 20.378,13 20.378,14 20.378,15 20.378,16 12.208,17 20.629,18 12.988,19 0.162,20 9.442,21 5.449,22 1,23 2.304,24 1.083,25 2.857,26 11.452,27 17.5,29 0.56,33 7.6,34 2.1,35 0.124,36 8.387,37 170.442,38 17,39 -0.028,40 0.064,41 -3.72,42 2.485,43 6.177,44 37,47 5.181,48 16.703,49 15.56,50 0.848,51 4.321,52 5.007,53 32.232,54 8,55 3.9,56 1.484,57 4.122,58 6.804,59 10.091,60 32.326,61 -3.68,62 -3.5,63 1.517,64 379.44,65 1.233,66 0.441,67 126,68 7,69 0.043,70 33.571,71 0.975,72 0.308,73 3.052,74 1,75 7,76 3.392,77 2.558,78 2.558,79 1.468,80 13.133,81 3.259,82 10.622,83 116.014,84 6.975,85 0.515,86 4.142,87 4.268,88 3.66,89 3.676,90 5.173,91 3.645,92 4.702,93 4.893,94 4.006,95 4.059,96 5.683,97 4.004,98 4.956,99 5.179,100 4.013,101 4.176,102 5.895,103 4.086,104 5.037,105 5.288,106 3.932,107 4.136,108 5.966,109 4.027,110 4.933,111 3.919,112 4.09,113 5.861,114 3.992,115 4.948,116 5.188,117 3.853,118 4.097,119 5.875,120 3.989,121 4.935,122 5.192,123 3.831,124 4.081,125 5.838,126 3.953,127 4.893,128 5.145,129 3.754,130 4.036,131 5.814,132 3.899,133 0.032,134 0.849,135 12.758,136 5.351,137 7.745,138 7.366,139 0.246,140 1.378,141 24.073,142 8.662,143 25.872,144 12.49,145 0.35,146 1.664,147 32.292,148 10.977,149 39.749,150 15.77,151 1.687,152 36.444,153 11.463,154 57.425,155 0.363,156 1.554,157 10.631,158 45.645,159 0.41,160 1.552,161 32.919,162 10.737,163 50.426,164 15.371,165 0.378,166 1.528,167 46.96,168 16.507,169 1.448,170 31.07,171 10.945,172 52.994,173 15.827,174 10,175 45,176 0.239,177 0.551,178 0.742,179 0.849,180 0.871,181 0.871,182 3.44,183 0.957,184 41.4,185 8.745}
{0 CHEMBL1779984,3 19.454,4 7.083,5 5.405,6 2,7 6,8 93.575,9 3,10 1920,11 21.695,12 21.695,13 21.695,14 21.695,15 21.695,16 12.898,17 21.938,18 13.916,19 0.47,20 10.312,21 5.449,22 1,23 2.354,24 1.089,25 2.884,26 13.712,27 17.5,29 0.605,33 7.573,34 2.073,35 0.117,36 9.146,37 180.442,38 17,39 0.035,40 0.06,41 -4.13,42 2.897,43 8.394,44 38,47 5.377,48 20.063,49 19.335,50 0.955,51 4.36,52 5.047,53 38.941,54 9,55 3.904,56 1.481,57 4.149,58 6.804,59 10.951,60 40.297,61 -4.07,62 -3.85,63 1.525,64 414.04,65 1.188,66 0.513,67 141,68 7,69 0.046,70 33.571,71 0.982,72 0.321,73 3.085,74 1,75 8,76 3.392,77 2.608,78 2.608,79 1.434,80 13.031,81 4.035,82 16.279,83 125.087,84 6.76,85 0.486,86 4.23,87 4.36,88 3.718,89 3.762,90 5.237,91 3.722,92 4.8,93 4.997,94 4.068,95 4.153,96 5.745,97 4.087,98 5.069,99 5.295,100 4.1,101 4.294,102 5.971,103 4.193,104 5.191,105 5.451,106 4.048,107 4.289,108 6.067,109 4.168,110 5.12,111 4.062,112 4.27,113 5.997,114 4.158,115 5.154,116 5.402,117 4.014,118 4.279,119 6.076,120 4.162,121 5.146,122 5.411,123 4.008,124 4.266,125 6.043,126 4.137,127 5.095,128 5.343,129 3.949,130 4.245,131 5.999,132 4.108,133 0.046,134 0.927,135 14.557,136 6.031,137 9.169,138 8.436,139 0.27,140 1.508,141 27.179,142 9.824,143 28.414,144 14.336,145 0.366,146 1.854,147 36.461,148 12.619,149 39.954,150 18.361,151 1.955,152 42.504,153 13.507,154 61.857,155 0.401,156 1.859,157 13.005,158 45.685,159 0.484,160 1.878,161 40.733,162 13.251,163 62.866,164 19.296,165 0.493,166 1.859,167 62.173,168 20.067,169 1.772,170 38.005,171 13.354,172 59.405,173 19.368,174 18,175 48,176 0.229,177 0.542,178 0.758,179 0.853,180 0.873,181 0.873,182 3.502,183 0.982,184 40.6,185 8.745}
{0 CHEMBL1911559,3 21.838,4 7.806,5 5.598,6 3,7 5,9 1,10 2602,11 24.292,12 24.292,13 24.292,14 24.292,15 24.292,16 14.162,17 24.843,18 15.775,19 1.256,20 10.369,21 26.731,22 0.83,23 3.703,24 1.191,25 3.062,26 10.123,27 22,29 1.127,33 8.04,34 2.54,35 0.102,36 8.966,37 231.698,38 12,39 0.025,40 0.082,41 -3.1,42 1.871,43 3.5,44 46.25,45 1,46 1,47 5.232,48 14.98,49 16.089,50 0.825,51 4.533,52 5.22,53 33.687,54 5,55 3.927,56 1.507,57 4.396,59 10.982,60 28.926,61 -3.1,62 -2.98,63 1.56,64 443.52,65 1.285,66 1.142,67 196,69 0.042,70 63.615,71 0.886,72 0.372,73 3.111,74 1,75 7,76 3.7,77 2.941,78 2.941,79 1.784,80 13.333,81 2.15,82 4.624,83 136.668,84 8.775,85 0.3,86 4.189,87 4.289,88 3.886,89 3.742,90 5.378,91 3.751,92 4.726,93 4.866,94 4.283,95 4.14,96 5.942,97 4.138,98 5.006,99 5.177,100 4.42,101 4.309,102 6.227,103 4.284,104 5.061,105 5.245,106 4.404,107 4.296,108 6.404,109 4.25,110 5.03,111 4.314,112 4.272,113 6.296,114 4.22,115 4.986,116 5.174,117 4.332,118 4.217,119 6.258,120 4.192,121 4.901,122 5.067,123 4.38,124 4.136,125 6.341,126 4.136,127 4.845,128 5.007,129 4.325,130 4.057,131 6.425,132 4.053,133 0.16,134 0.911,135 8.526,136 4.974,137 15.868,138 5.541,139 0.498,140 1.477,141 18.409,142 8.341,143 35.462,144 9.442,145 0.79,146 1.874,147 29.486,148 11.552,149 73.32,150 13.27,151 1.913,152 36.483,153 12.716,154 123.779,155 0.869,156 1.782,157 12.952,158 108.985,159 0.801,160 1.72,161 32.416,162 11.939,163 100.036,164 13.76,165 0.937,166 1.658,167 112.018,168 11.262,169 1.552,170 29.605,171 9.501,172 159.042,173 10.337,174 26,175 57,176 0.287,177 0.647,178 0.789,179 0.849,180 0.86,181 0.86,182 3.616,183 0.879,184 44.8,185 6}
{0 CHEMBL1911572,3 21.01,4 7.806,5 5.535,6 3,7 5,9 1,10 2401,11 23.463,12 23.463,13 23.463,14 23.463,15 23.463,16 13.463,17 23.926,18 14.613,19 1,20 10.569,21 26.731,22 1,23 3.688,24 1.184,25 3.055,26 10.441,27 22,29 1.006,33 8.041,34 2.541,35 0.107,36 8.909,37 218.819,38 12,39 0.036,40 0.091,41 -3.85,42 2.619,43 6.861,44 44.75,47 5.312,48 15.289,49 18.219,50 0.869,51 4.5,52 5.187,53 37.433,54 5,55 3.926,56 1.492,57 4.383,59 10.758,60 31.189,61 -3.81,62 -3.62,63 1.586,64 447.09,65 1.279,66 1.045,67 177,69 0.046,70 63.615,71 0.871,72 0.38,73 3.126,74 1,75 5,76 3.7,77 2.933,78 2.933,79 1.73,80 12.571,81 3.16,82 9.987,83 137.089,84 8.39,85 0.316,86 4.178,87 4.289,88 3.834,89 3.738,90 5.365,91 3.729,92 4.697,93 4.858,94 4.227,95 4.12,96 5.9,97 4.099,98 4.975,99 5.158,100 4.394,101 4.289,102 6.195,103 4.26,104 5.06,105 5.238,106 4.404,107 4.316,108 6.415,109 4.265,110 5.095,111 4.29,112 4.319,113 6.325,114 4.241,115 5.053,116 5.273,117 4.3,118 4.248,119 6.265,120 4.194,121 4.913,122 5.093,123 4.363,124 4.144,125 6.336,126 4.131,127 4.85,128 5.017,129 4.307,130 4.06,131 6.423,132 4.051,133 0.102,134 0.917,135 9.669,136 5.096,137 11.932,138 6.126,139 0.338,140 1.465,141 19.843,142 8.436,143 29.862,144 10.598,145 0.57,146 1.845,147 30.55,148 11.293,149 65.546,150 13.803,151 1.928,152 36.991,153 12.724,154 118.464,155 0.772,156 1.886,157 14.109,158 108.466,159 0.673,160 1.809,161 37.824,162 13.208,163 101.909,164 16.57,165 0.807,166 1.678,167 109.551,168 12.437,169 1.56,170 31.296,171 9.493,172 157.516,173 10.744,174 55,175 54,176 0.279,177 0.629,178 0.775,179 0.834,180 0.845,181 0.845,182 3.589,183 0.912,184 44.1,185 5.301}
{0 CHEMBL1915888,3 13.815,4 5.222,5 5.529,6 3,7 6,8 36.545,10 772,11 16.301,12 16.301,13 16.301,14 16.301,15 16.301,16 9.322,17 16.741,18 9.448,19 -0.5,20 5.483,21 6.959,22 1,24 1.119,25 2.694,26 8.275,27 18.5,29 0.277,31 3,32 2.586,33 7.563,34 2.063,35 0.183,36 6.215,37 146.342,38 21,39 -0.379,40 0.072,41 -4.88,42 3.648,43 13.308,44 34.75,47 4.892,48 9.535,49 11.132,50 0.606,51 4.391,52 5.078,53 22.444,54 10,55 4.069,56 1.524,57 4.692,58 7.066,59 7.403,60 20.492,61 -4.79,62 -4.49,63 1.619,64 273.25,65 1.448,66 0.289,67 76,68 6,69 0.053,70 50.357,71 0.684,72 0.429,73 2.833,74 -0.174,75 8,76 3.524,77 2.952,78 2.952,79 1.493,80 7.75,81 3.903,82 15.232,83 92.135,84 7.581,85 0.778,86 3.851,87 3.966,88 3.456,89 3.414,90 4.963,91 3.401,92 4.367,93 4.545,94 3.849,95 3.782,96 5.426,97 3.766,98 4.487,99 4.654,100 3.958,101 3.912,102 5.576,103 3.895,104 4.624,105 4.815,106 3.962,107 3.979,108 5.675,109 3.938,110 4.681,111 3.871,112 4.01,113 5.667,114 3.935,115 4.686,116 4.914,117 3.797,118 3.977,119 5.638,120 3.884,121 4.596,122 4.806,123 3.581,124 3.882,125 5.565,126 3.757,127 4.609,128 4.878,129 3.096,130 3.642,131 5.449,132 3.448,133 0.006,134 0.631,135 8.101,136 3.622,137 6.516,138 4.706,139 0.206,140 1.021,141 15.88,142 5.955,143 18.193,144 8.003,145 0.166,146 1.209,147 17.085,148 6.103,149 19.621,150 8.243,151 1.36,152 20.473,153 6.901,154 23.587,155 0.249,156 1.366,157 7.998,158 26.435,159 0.237,160 1.311,161 23.4,162 8.681,163 25.993,164 12.123,165 0.12,166 1.187,167 24.229,168 11.301,169 1.059,170 24.125,171 8.632,172 36.072,173 11.808,174 18,175 40,176 0.258,177 0.579,178 0.705,179 0.811,180 0.828,181 0.852,182 3.231,183 0.874,184 45.2,185 5}
{0 CHEMBL1915891,3 14.238,4 5.389,5 5.537,6 3,7 7,8 38.495,10 861,11 16.748,12 16.748,13 16.748,14 16.748,15 16.748,16 9.461,17 17.435,18 9.859,19 -0.167,20 6.042,21 6.959,22 1,24 1.061,25 2.834,26 7.732,27 18.5,29 0.479,31 3,32 2.313,33 7.716,34 2.216,35 0.177,36 6.012,37 183.381,38 21,39 -0.255,40 0.074,41 -5.64,42 4.412,43 19.461,44 35.75,47 4.718,48 6.407,49 8.293,50 0.579,51 4.428,52 5.115,53 19.279,54 8,55 4.068,56 1.535,57 4.755,58 7.066,59 7.251,60 20.745,61 -5.51,62 -5.14,63 1.634,64 286.37,65 1.43,66 0.596,67 81,68 6,69 0.052,70 128.654,71 0.599,72 0.437,73 2.832,74 -0.107,75 9,76 3.524,77 2.964,78 2.964,79 1.738,80 7.84,81 4.745,82 22.519,83 96.703,84 9.571,85 0.75,86 3.802,87 3.897,88 3.59,89 3.412,90 4.97,91 3.405,92 4.311,93 4.458,94 4.031,95 3.796,96 5.47,97 3.785,98 4.448,99 4.586,100 4.16,101 3.93,102 5.646,103 3.911,104 4.534,105 4.689,106 4.168,107 3.958,108 5.707,109 3.93,110 4.558,111 4.224,112 4.001,113 5.708,114 3.936,115 4.599,116 4.8,117 4.103,118 3.969,119 5.681,120 3.889,121 4.506,122 4.679,123 4.015,124 3.884,125 5.645,126 3.77,127 4.437,128 4.638,129 3.66,130 3.625,131 5.524,132 3.462,133 0.065,134 0.568,135 4.414,136 3.023,137 4.765,138 3.454,139 0.29,140 0.924,141 12.206,142 5.436,143 18.354,144 6.298,145 0.322,146 1.077,147 15.61,148 5.744,149 24.436,150 6.143,151 1.17,152 17.781,153 5.995,154 27.059,155 0.4,156 1.138,157 7.062,158 28.222,159 0.408,160 1.136,161 20.549,162 7.941,163 30.888,164 9.677,165 0.343,166 0.953,167 30.362,168 9.205,169 0.779,170 28.962,171 8.045,172 47.053,173 8.839,174 27,175 42,176 0.304,177 0.636,178 0.746,179 0.816,180 0.834,181 0.861,182 3.269,183 0.901,184 46.2,185 6}
{0 CHEMBL1915892,3 14.238,4 5.389,5 5.535,6 3,7 7,8 39.155,10 868,11 16.748,12 16.748,13 16.748,14 16.748,15 16.748,16 9.456,17 17.361,18 9.859,19 -0.167,20 5.851,21 21.919,22 1,24 1.051,25 2.761,26 7.77,27 18.5,29 0.607,31 3,32 2.169,33 7.871,34 2.371,35 0.177,36 6.012,37 171.692,38 21,39 -0.336,40 0.074,41 -5.53,42 4.298,43 18.476,44 35.75,47 4.723,48 6.356,49 8.501,50 0.578,51 4.428,52 5.115,53 16.521,54 8,55 4.066,56 1.534,57 4.743,58 7.066,59 7.251,60 20.565,61 -5.4,62 -5.04,63 1.634,64 277.23,65 1.43,66 0.639,67 84,68 6,69 0.054,70 89.505,71 0.633,72 0.453,73 2.856,74 -0.111,75 5,76 3.524,77 2.969,78 2.969,79 1.789,80 8.4,81 4.287,82 18.374,83 92.115,84 9.149,85 0.75,86 3.807,87 3.905,88 3.552,89 3.382,90 5.014,91 3.39,92 4.316,93 4.467,94 3.981,95 3.754,96 5.534,97 3.764,98 4.457,99 4.604,100 4.112,101 3.879,102 5.719,103 3.888,104 4.541,105 4.701,106 4.169,107 3.915,108 5.821,109 3.911,110 4.551,111 4,112 3.96,113 5.652,114 3.901,115 4.601,116 4.808,117 4.015,118 3.917,119 5.748,120 3.85,121 4.508,122 4.691,123 3.87,124 3.814,125 5.68,126 3.723,127 4.436,128 4.657,129 3.479,130 3.503,131 5.606,132 3.386,133 0.089,134 0.652,135 4.968,136 3.203,137 5.768,138 3.533,139 0.328,140 1.043,141 12.45,142 5.473,143 20.94,144 6.273,145 0.397,146 1.252,147 14.452,148 5.762,149 34.94,150 5.943,151 1.262,152 17.978,153 6.002,154 43.918,155 0.355,156 1.208,157 7.153,158 26.087,159 0.538,160 1.244,161 20.653,162 7.808,163 40.795,164 9.855,165 0.375,166 1.097,167 32.974,168 9.117,169 0.961,170 24.879,171 7.613,172 52.42,173 8.681,174 27,175 42,176 0.313,177 0.653,178 0.764,179 0.825,180 0.834,181 0.861,182 3.269,183 0.86,184 46.2,185 6}
{0 CHEMBL1915896,3 14.906,4 5.639,5 5.544,6 3,7 6,8 41.366,9 1,10 976,11 17.455,12 17.455,13 17.455,14 17.455,15 17.455,16 9.928,17 17.875,18 10.233,19 -0.167,20 6.078,21 6.959,22 1,24 1.087,25 2.694,26 7.885,27 20,28 1,29 0.415,31 3,32 2.267,33 7.814,34 2.314,35 0.171,36 6.409,37 159.583,38 21,39 -0.227,40 0.072,41 -3.95,42 2.717,43 7.382,44 37.75,47 4.87,48 8.254,49 10.637,50 0.58,51 4.451,52 5.139,53 20.458,54 8,55 4.067,56 1.536,57 4.708,58 7.066,59 7.68,60 20.217,61 -3.9,62 -3.7,63 1.618,64 290.4,65 1.452,66 0.421,67 86,68 6,69 0.049,70 50.357,71 0.699,72 0.444,73 2.833,74 -0.106,75 9,76 3.644,77 2.981,78 2.981,79 1.617,80 8.538,81 2.419,82 5.851,83 95.674,84 8.079,85 0.724,86 3.89,87 4.003,88 3.53,89 3.428,90 5.092,91 3.436,92 4.384,93 4.544,94 3.93,95 3.798,96 5.596,97 3.802,98 4.527,99 4.682,100 4.032,101 3.924,102 5.746,103 3.929,104 4.645,105 4.824,106 4.03,107 3.983,108 5.817,109 3.969,110 4.68,111 3.952,112 4.013,113 5.78,114 3.958,115 4.708,116 4.931,117 3.894,118 3.964,119 5.812,120 3.898,121 4.613,122 4.821,123 3.75,124 3.874,125 5.691,126 3.798,127 4.572,128 4.792,129 3.512,130 3.69,131 5.688,132 3.591,133 0.06,134 0.673,135 7.449,136 3.461,137 8.891,138 4.208,139 0.299,140 1.05,141 14.779,142 5.778,143 30.549,144 7.4,145 0.272,146 1.25,147 16.262,148 6.043,149 30.282,150 7.5,151 1.378,152 19.393,153 6.503,154 35.183,155 0.282,156 1.358,157 8.061,158 31.04,159 0.493,160 1.341,161 23.333,162 8.234,163 46.634,164 11.203,165 0.237,166 1.2,167 27.429,168 10.453,169 1.046,170 21.435,171 7.748,172 43.685,173 9.969,174 30,175 43,176 0.277,177 0.641,178 0.754,179 0.824,180 0.84,181 0.864,182 3.306,183 0.838,184 44.2,185 5}
{0 CHEMBL1915906,3 13.238,4 4.972,5 5.557,6 3,7 6,8 80.613,10 681,11 15.593,12 15.593,13 15.593,14 15.593,15 15.593,16 8.822,17 16.226,18 9.115,19 -0.501,20 5.274,21 20.088,22 1,24 0.947,25 2.585,26 8.215,27 16.5,29 0.273,31 3,32 2.623,33 7.558,34 2.058,35 0.19,36 5.773,37 164.625,38 20,39 -0.462,40 0.074,41 -4.75,42 3.522,43 12.403,44 32.25,47 4.744,48 8.236,49 9.181,50 0.629,51 4.363,52 5.05,53 19.758,54 7,55 4.085,56 1.54,57 4.793,58 7.535,59 6.895,60 21.491,61 -4.67,62 -4.38,63 1.629,64 259.8,65 1.402,66 0.278,67 71,68 6,69 0.054,70 50.357,71 0.619,72 0.435,73 2.775,74 -0.368,75 5,76 3.459,77 2.952,78 2.952,79 1.658,80 7.261,81 3.856,82 14.87,83 90.969,84 8.319,85 0.769,86 3.791,87 3.896,88 3.522,89 3.399,90 4.901,91 3.362,92 4.309,93 4.477,94 3.927,95 3.774,96 5.368,97 3.732,98 4.378,99 4.529,100 4,101 3.84,102 5.483,103 3.811,104 4.518,105 4.689,106 4.014,107 3.941,108 5.586,109 3.875,110 4.552,111 3.95,112 3.963,113 5.557,114 3.871,115 4.577,116 4.787,117 3.879,118 3.934,119 5.531,120 3.804,121 4.454,122 4.647,123 3.571,124 3.781,125 5.422,126 3.627,127 4.43,128 4.697,129 2.94,130 3.459,131 5.251,132 3.236,133 0.009,134 0.603,135 7.14,136 3.534,137 5.417,138 4.187,139 0.219,140 0.994,141 16.268,142 6.235,143 16.737,144 7.382,145 0.193,146 1.136,147 16.007,148 5.555,149 16.815,150 6.677,151 1.283,152 20.372,153 7.144,154 19.723,155 0.26,156 1.254,157 7.354,158 22.374,159 0.24,160 1.237,161 24.917,162 9.061,163 21.427,164 11.008,165 0.152,166 1.071,167 19.523,168 9.702,169 0.906,170 21.944,171 7.905,172 30.449,173 9.952,174 18,175 39,176 0.291,177 0.625,178 0.738,179 0.806,180 0.815,181 0.842,182 3.191,183 0.949,184 43.6,185 5}
{0 CHEMBL1915910,3 14.132,4 5.361,5 5.576,6 7,7 7,8 90.927,10 846,11 16.593,12 16.593,13 16.593,14 16.593,15 16.593,16 9.205,17 17.139,18 9.896,19 -0.241,20 5.532,21 9.715,22 1,24 1,25 2.81,26 8.138,27 16.5,28 1,29 0.405,31 3,32 2.521,33 7.587,34 2.087,35 0.177,36 6.349,37 158.478,38 20,39 -0.436,40 0.078,41 -4,42 2.772,43 7.685,44 34,47 5.027,48 10.624,49 12.772,50 0.681,51 4.437,52 5.124,53 26.081,54 5,55 4.064,56 1.547,57 4.929,58 7.719,59 7.54,60 23.402,61 -3.95,62 -3.75,63 1.678,64 280.59,65 1.36,66 0.502,67 81,68 12,69 0.066,70 67.02,71 0.569,72 0.494,73 3.059,74 -0.118,75 4,76 3.459,77 2.963,78 2.963,79 1.558,80 7.8,81 2.495,82 6.223,83 95.11,84 7.476,85 0.714,86 3.927,87 4.056,88 3.518,89 3.415,90 5.029,91 3.413,92 4.464,93 4.669,94 3.933,95 3.783,96 5.502,97 3.789,98 4.533,99 4.704,100 4.03,101 3.923,102 5.644,103 3.93,104 4.723,105 4.911,106 4.054,107 4.054,108 5.781,109 4.015,110 4.807,111 3.966,112 4.083,113 5.776,114 4.009,115 4.871,116 5.133,117 3.922,118 4.045,119 5.779,120 3.955,121 4.712,122 4.925,123 3.744,124 3.943,125 5.703,126 3.84,127 4.763,128 5.037,129 3.278,130 3.746,131 5.631,132 3.565,133 0.035,134 0.731,135 9.213,136 3.676,137 7.412,138 5.073,139 0.268,140 1.139,141 18.555,142 5.658,143 20.736,144 8.393,145 0.25,146 1.317,147 18.431,148 5.331,149 22.495,150 7.875,151 1.515,152 22.852,153 7.341,154 26.139,155 0.294,156 1.524,157 8.595,158 29.847,159 0.391,160 1.496,161 29.966,162 9.57,163 33.994,164 14.45,165 0.232,166 1.344,167 27.391,168 11.762,169 1.152,170 28.216,171 8.493,172 44.202,173 12.593,174 38,175 43,176 0.266,177 0.571,178 0.705,179 0.768,180 0.807,181 0.829,182 3.27,183 0.871,184 40,185 5}
{0 CHEMBL1915912,3 13.66,4 5.139,5 5.559,6 5,7 7,8 86.076,10 770,11 16.041,12 16.041,13 16.041,14 16.041,15 16.041,16 9.008,17 16.758,18 9.531,19 -0.423,20 5.488,21 8.317,22 1,24 0.897,25 2.756,26 8.323,27 16.5,28 1,29 0.321,31 3,32 2.554,33 7.583,34 2.083,35 0.183,36 5.971,37 176.575,38 20,39 -0.443,40 0.07,41 -3.98,42 2.75,43 7.561,44 33.25,47 4.775,48 8.543,49 9.778,50 0.681,51 4.401,52 5.088,53 19.767,54 5,55 4.074,56 1.548,57 4.863,58 7.627,59 7.127,60 22.535,61 -3.93,62 -3.73,63 1.655,64 270.8,65 1.385,66 0.373,67 76,68 12,69 0.061,70 67.142,71 0.569,72 0.463,73 2.812,74 -0.367,75 6,76 3.459,77 2.961,78 2.961,79 1.685,80 7.75,81 2.707,82 7.327,83 93.156,84 8.28,85 0.741,86 3.841,87 3.951,88 3.563,89 3.419,90 4.955,91 3.388,92 4.366,93 4.546,94 4.011,95 3.79,96 5.434,97 3.757,98 4.418,99 4.571,100 4.047,101 3.871,102 5.543,103 3.848,104 4.546,105 4.707,106 4.06,107 3.983,108 5.627,109 3.92,110 4.596,111 4.009,112 4.004,113 5.622,114 3.915,115 4.698,116 4.937,117 3.955,118 3.974,119 5.642,120 3.855,121 4.521,122 4.712,123 3.702,124 3.836,125 5.518,126 3.705,127 4.505,128 4.754,129 3.182,130 3.582,131 5.403,132 3.397,133 0.019,134 0.662,135 7.614,136 3.672,137 5.302,138 4.398,139 0.252,140 1.075,141 17.435,142 6.214,143 18.33,144 7.679,145 0.267,146 1.219,147 18.825,148 5.673,149 20.425,150 6.564,151 1.34,152 20.308,153 7.297,154 18.581,155 0.229,156 1.328,157 7.704,158 20.838,159 0.375,160 1.381,161 29.406,162 9.574,163 29.163,164 12.036,165 0.202,166 1.166,167 20.403,168 9.976,169 0.992,170 22.158,171 7.641,172 33.495,173 9.725,174 27,175 41,176 0.293,177 0.578,178 0.691,179 0.761,180 0.805,181 0.83,182 3.231,183 0.94,184 41.5,185 5}
{0 CHEMBL1916091,3 13.815,4 5.222,5 5.529,6 5,7 6,8 36.545,10 772,11 16.301,12 16.301,13 16.301,14 16.301,15 16.301,16 9.322,17 16.806,18 9.448,19 -0.5,20 5.448,21 6.959,22 1,24 1.063,25 2.694,26 7.481,27 18.5,28 1,29 0.335,31 3,32 2.51,33 7.604,34 2.104,35 0.183,36 6.081,37 147.73,38 21,39 -0.37,40 0.072,41 -3.87,42 2.644,43 6.989,44 35.25,47 4.874,48 8.882,49 10.303,50 0.582,51 4.391,52 5.078,53 21.629,54 6,55 4.061,56 1.524,57 4.692,58 7.066,59 7.248,60 19.693,61 -3.83,62 -3.64,63 1.619,64 266.95,65 1.469,66 0.39,67 76,68 6,69 0.053,70 67.142,71 0.635,72 0.432,73 2.833,74 -0.17,75 5,76 3.524,77 2.952,78 2.952,79 1.549,80 7.75,81 2.752,82 7.575,83 89.978,84 7.79,85 0.778,86 3.838,87 3.954,88 3.463,89 3.376,90 4.977,91 3.376,92 4.351,93 4.532,94 3.853,95 3.74,96 5.433,97 3.739,98 4.45,99 4.611,100 3.961,101 3.872,102 5.571,103 3.87,104 4.602,105 4.791,106 3.969,107 3.945,108 5.684,109 3.914,110 4.661,111 3.876,112 3.966,113 5.67,114 3.904,115 4.641,116 4.864,117 3.806,118 3.92,119 5.639,120 3.844,121 4.567,122 4.782,123 3.591,124 3.814,125 5.578,126 3.707,127 4.552,128 4.82,129 3.099,130 3.563,131 5.44,132 3.387,133 0.012,134 0.648,135 7.582,136 3.376,137 6.026,138 4.345,139 0.237,140 1.026,141 15.391,142 5.448,143 18.485,144 7.322,145 0.18,146 1.197,147 15.621,148 5.495,149 17.753,150 7.307,151 1.349,152 19.353,153 6.508,154 23.466,155 0.279,156 1.347,157 7.39,158 25.945,159 0.274,160 1.272,161 21.815,162 7.854,163 25.429,164 10.93,165 0.182,166 1.166,167 25.642,168 10.235,169 0.982,170 22.905,171 7.573,172 38.645,173 10.422,174 18,175 40,176 0.269,177 0.607,178 0.743,179 0.815,180 0.823,181 0.848,182 3.231,183 0.857,184 43.9,185 5}
{0 CHEMBL1916106,3 15.047,4 5.597,5 5.641,6 2,7 6,8 45.276,10 1096,11 17.533,12 17.533,13 17.533,14 17.533,15 17.533,16 9.92,17 18.24,18 11.064,19 0.073,20 6.124,21 4.288,22 1,24 1.066,25 2.731,26 9.19,27 18.5,29 0.579,31 3,32 1.807,33 8.194,34 2.694,35 0.165,36 6.448,37 183.68,38 21,39 -0.381,40 0.068,41 -3.59,42 2.364,43 5.586,44 37,47 4.961,48 8.652,49 9.566,50 0.576,51 4.463,52 5.15,53 21.419,54 5,55 4.091,56 1.555,57 4.865,58 7.066,59 7.786,60 20.496,61 -3.57,62 -3.4,63 1.614,64 291.46,65 1.37,66 0.994,67 86,68 6,69 0.06,70 50.357,71 0.695,72 0.399,73 2.854,74 -0.158,75 2,76 3.524,77 3.102,78 3.102,79 1.772,80 8.667,81 5.441,82 29.6,83 92.98,84 8.866,85 0.7,86 3.883,87 3.985,88 3.588,89 3.408,90 5.107,91 3.439,92 4.436,93 4.586,94 4.095,95 3.78,96 6.183,97 3.813,98 4.504,99 4.655,100 4.034,101 3.93,102 5.68,103 3.936,104 4.676,105 4.852,106 4.115,107 4.011,108 5.915,109 4.009,110 4.766,111 4.056,112 4.04,113 6.014,114 4.016,115 4.734,116 4.935,117 4.002,118 4.007,119 5.91,120 3.952,121 4.7,122 4.905,123 3.924,124 3.884,125 5.983,126 3.83,127 4.696,128 4.954,129 3.722,130 3.564,131 6.007,132 3.533,133 0.171,134 0.86,135 5.647,136 3.714,137 21.185,138 3.889,139 1.184,140 1.608,141 14.944,142 6.045,143 154.745,144 6.87,145 0.433,146 1.406,147 13.055,148 6.268,149 34.971,150 7.048,151 1.676,152 17.199,153 7.497,154 36.084,155 0.832,156 1.797,157 8.837,158 84.389,159 0.745,160 1.649,161 21.71,162 9.697,163 70.194,164 12.001,165 0.652,166 1.614,167 66.439,168 11.491,169 1.479,170 27.154,171 8.417,172 98.195,173 10.565,174 39,175 46,176 0.306,177 0.634,178 0.736,179 0.82,180 0.828,181 0.852,182 3.342,183 0.821,184 45.2,185 5}
{0 CHEMBL1916108,3 14.455,4 5.389,5 5.537,6 1,7 6,8 41.999,10 960,11 16.903,12 16.903,13 16.903,14 16.903,15 16.903,16 9.46,17 17.423,18 10.563,19 0.051,20 5.62,21 4.288,22 1,24 1.068,25 2.679,26 9.341,27 18,29 0.651,31 3,32 1.601,33 8.163,34 2.663,35 0.171,36 6.323,37 173.648,38 21,39 -0.376,40 0.084,41 -4.38,42 3.151,43 9.93,44 35.5,47 4.9,48 8.521,49 9.46,50 0.58,51 4.451,52 5.139,53 20.074,54 6,55 4.097,56 1.565,57 4.977,58 7.066,59 7.64,60 20.955,61 -4.31,62 -4.07,63 1.639,64 282.67,65 1.365,66 0.572,67 76,68 6,69 0.056,70 50.357,71 0.699,72 0.41,73 2.794,74 -0.165,75 3,76 3.524,77 3.103,78 3.103,79 1.649,80 7.923,81 4.263,82 18.173,83 91.379,84 8.692,85 0.724,86 3.849,87 3.958,88 3.541,89 3.411,90 5.056,91 3.425,92 4.399,93 4.562,94 4.04,95 3.794,96 6.062,97 3.816,98 4.516,99 4.672,100 4.069,101 3.939,102 5.802,103 3.949,104 4.706,105 4.898,106 4.08,107 3.994,108 5.974,109 3.992,110 4.7,111 4.004,112 4.017,113 5.9,114 3.975,115 4.696,116 4.897,117 3.999,118 4.006,119 5.947,120 3.947,121 4.689,122 4.901,123 3.909,124 3.874,125 6.014,126 3.815,127 4.622,128 4.898,129 3.566,130 3.548,131 5.884,132 3.468,133 0.117,134 0.856,135 5.76,136 3.625,137 18.123,138 3.981,139 0.803,140 1.707,141 14.267,142 6.085,143 135.059,144 6.993,145 0.344,146 1.567,147 13.576,148 6.482,149 25.466,150 7.319,151 1.794,152 20.144,153 7.822,154 72.393,155 0.712,156 1.707,157 8.043,158 58.291,159 0.523,160 1.732,161 20.482,162 9.568,163 65.852,164 12.066,165 0.562,166 1.754,167 66.905,168 11.564,169 1.473,170 24.707,171 8.669,172 60.405,173 11.282,174 38,175 45,176 0.286,177 0.615,178 0.729,179 0.815,180 0.823,181 0.848,182 3.306,183 0.832,184 46.3,185 5.301}
{0 CHEMBL1916113,3 14.27,4 5.417,5 5.547,6 2,7 7,8 38.406,10 838,11 16.801,12 16.801,13 16.801,14 16.801,15 16.801,16 9.553,17 17.301,18 9.851,19 -0.176,20 5.696,21 19.248,22 1,24 1.065,25 2.725,26 9.87,27 18.5,29 0.496,31 3,32 2.12,33 7.787,34 2.287,35 0.178,36 6.248,37 155.341,38 21,39 -0.419,40 0.074,41 -3.64,42 2.406,43 5.791,44 35.5,47 4.949,48 9.479,49 10.774,50 0.59,51 4.428,52 5.115,53 22.898,54 4,55 4.091,56 1.53,57 4.772,58 7.066,59 7.477,60 23.21,61 -3.61,62 -3.44,63 1.643,64 279.32,65 1.42,66 0.65,67 71,68 6,69 0.056,70 50.357,71 0.635,72 0.461,73 2.883,74 -0.161,75 2,76 3.524,77 2.914,78 2.914,79 1.626,80 7.8,81 3.51,82 12.319,83 92.085,84 8.01,85 0.75,86 3.862,87 3.972,88 3.502,89 3.412,90 5.036,91 3.414,92 4.379,93 4.552,94 3.903,95 3.782,96 5.513,97 3.788,98 4.51,99 4.66,100 4.036,101 3.931,102 5.702,103 3.937,104 4.669,105 4.846,106 4.092,107 4.021,108 5.847,109 4.001,110 4.75,111 4.014,112 4.068,113 5.88,114 4.019,115 4.761,116 4.961,117 3.921,118 4.043,119 5.886,120 3.964,121 4.707,122 4.934,123 3.698,124 3.908,125 5.76,126 3.788,127 4.71,128 5.009,129 3.277,130 3.547,131 5.783,132 3.409,133 0.039,134 0.704,135 7.321,136 3.653,137 5.704,138 4.425,139 0.216,140 1.123,141 15.306,142 5.915,143 20.442,144 7.45,145 0.299,146 1.359,147 16.187,148 6.285,149 27.637,150 7.475,151 1.512,152 20.055,153 7.305,154 32.211,155 0.441,156 1.614,157 8.492,158 38.797,159 0.428,160 1.598,161 24.226,162 10.109,163 46.19,164 12.578,165 0.183,166 1.419,167 27.886,168 13.167,169 1.354,170 29.824,171 8.994,172 81.675,173 11.541,174 27,175 42,176 0.281,177 0.623,178 0.75,179 0.82,180 0.828,181 0.852,182 3.27,183 0.852,184 45.2,185 5}
{0 CHEMBL1916114,3 14.27,4 5.417,5 5.547,6 4,7 7,8 38.406,10 838,11 16.801,12 16.801,13 16.801,14 16.801,15 16.801,16 9.553,17 17.307,18 9.851,19 -0.176,20 5.696,21 19.248,22 1,24 1.039,25 2.727,26 9.529,27 18.5,28 1,29 0.503,31 3,32 2.101,33 7.787,34 2.287,35 0.178,36 6.254,37 155.674,38 21,39 -0.351,40 0.074,41 -3.64,42 2.406,43 5.791,44 35.5,47 4.957,48 9.228,49 10.955,50 0.606,51 4.428,52 5.115,53 23.189,54 4,55 4.09,56 1.53,57 4.772,58 7.066,59 7.493,60 23.432,61 -3.61,62 -3.44,63 1.643,64 279.32,65 1.42,66 0.695,67 71,68 9,69 0.056,70 50.357,71 0.654,72 0.461,73 2.886,74 -0.161,75 2,76 3.524,77 2.914,78 2.914,79 1.626,80 7.8,81 3.306,82 10.931,83 91.635,84 8.01,85 0.75,86 3.862,87 3.972,88 3.502,89 3.412,90 5.034,91 3.414,92 4.379,93 4.551,94 3.906,95 3.776,96 5.518,97 3.784,98 4.515,99 4.672,100 4.035,101 3.918,102 5.709,103 3.929,104 4.643,105 4.809,106 4.095,107 4.017,108 5.842,109 3.998,110 4.755,111 4.015,112 4.06,113 5.877,114 4.012,115 4.757,116 4.959,117 3.923,118 4.024,119 5.892,120 3.952,121 4.704,122 4.936,123 3.698,124 3.892,125 5.769,126 3.777,127 4.675,128 4.963,129 3.273,130 3.558,131 5.78,132 3.415,133 0.039,134 0.704,135 7.321,136 3.653,137 5.57,138 4.425,139 0.208,140 1.124,141 15.264,142 5.912,143 20.013,144 7.465,145 0.332,146 1.362,147 16.623,148 6.048,149 30.342,150 7.21,151 1.495,152 18.953,153 7.234,154 30.289,155 0.393,156 1.613,157 8.525,158 37.751,159 0.448,160 1.597,161 24.282,162 9.777,163 47.456,164 12.168,165 0.24,166 1.42,167 31.667,168 12.704,169 1.327,170 28.34,171 8.805,172 84.333,173 11.263,174 27,175 42,176 0.281,177 0.606,178 0.733,179 0.786,180 0.828,181 0.852,182 3.27,183 0.853,184 45.2,185 5}
{0 CHEMBL1916123,3 15.193,4 5.75,5 5.548,6 6,7 7,8 41.133,10 944,11 17.671,12 17.671,13 17.671,14 17.671,15 17.671,16 10.06,17 18.287,18 10.274,19 -0.148,20 6.258,21 4.288,22 1,24 1.07,25 2.822,26 10.825,27 19,28 1,29 0.413,31 3,32 2.658,33 7.603,34 2.103,35 0.172,36 6.575,37 158.389,38 21,39 -0.359,40 0.072,41 -2.98,42 1.748,43 3.054,44 36.75,47 5.085,48 11.537,49 13.066,50 0.586,51 4.44,52 5.127,53 28.006,54 4,55 4.09,56 1.516,57 4.707,58 7.066,59 7.819,60 27.689,61 -2.98,62 -2.88,63 1.638,64 299.34,65 1.413,66 0.595,67 78,68 6,69 0.054,70 50.357,71 0.596,72 0.44,73 3.049,74 -0.086,75 2,76 3.524,77 2.969,78 2.969,79 1.548,80 7.885,81 3.288,82 10.81,83 98.332,84 7.575,85 0.724,86 3.943,87 4.054,88 3.541,89 3.468,90 5.071,91 3.464,92 4.465,93 4.643,94 3.92,95 3.831,96 5.508,97 3.831,98 4.557,99 4.698,100 4.066,101 3.998,102 5.663,103 3.993,104 4.75,105 4.923,106 4.127,107 4.112,108 5.827,109 4.074,110 4.872,111 4.067,112 4.144,113 5.862,114 4.088,115 4.843,116 5.027,117 3.998,118 4.13,119 5.852,120 4.058,121 4.857,122 5.083,123 3.803,124 4.068,125 5.807,126 3.941,127 4.865,128 5.146,129 3.42,130 3.813,131 5.734,132 3.646,133 0.011,134 0.684,135 9.036,136 4.04,137 7.901,138 5.163,139 0.232,140 1.081,141 18.166,142 6.395,143 20.906,144 8.41,145 0.231,146 1.267,147 18.132,148 6.679,149 19.474,150 8.708,151 1.502,152 22.981,153 8.445,154 26.77,155 0.36,156 1.59,157 9.432,158 32.966,159 0.408,160 1.475,161 26.832,162 10.114,163 32.216,164 13.167,165 0.193,166 1.494,167 31.865,168 15.057,169 1.306,170 32.589,171 10.294,172 54.497,173 14.462,174 30,175 43,176 0.263,177 0.581,178 0.72,179 0.79,180 0.805,181 0.849,182 3.306,183 0.866,184 43.5,185 5}
{0 CHEMBL1916124,3 15.193,4 5.75,5 5.548,6 4,7 7,8 41.133,10 944,11 17.671,12 17.671,13 17.671,14 17.671,15 17.671,16 10.06,17 18.287,18 10.274,19 -0.148,20 6.258,21 4.288,22 1,24 1.066,25 2.812,26 11.169,27 19,28 1,29 0.392,31 3,32 2.677,33 7.603,34 2.103,35 0.172,36 6.575,37 158.389,38 21,39 -0.417,40 0.072,41 -2.98,42 1.748,43 3.054,44 36.75,47 5.07,48 11.313,49 13.193,50 0.591,51 4.44,52 5.127,53 27.416,54 4,55 4.091,56 1.516,57 4.707,58 7.066,59 7.819,60 27.499,61 -2.98,62 -2.88,63 1.638,64 299.34,65 1.413,66 0.554,67 78,68 6,69 0.054,70 50.357,71 0.596,72 0.44,73 3.04,74 -0.086,75 2,76 3.524,77 2.969,78 2.969,79 1.548,80 7.885,81 3.288,82 10.81,83 98.332,84 7.575,85 0.724,86 3.943,87 4.054,88 3.541,89 3.468,90 5.071,91 3.464,92 4.465,93 4.643,94 3.92,95 3.831,96 5.508,97 3.831,98 4.557,99 4.698,100 4.066,101 3.998,102 5.665,103 3.993,104 4.751,105 4.925,106 4.122,107 4.112,108 5.819,109 4.077,110 4.864,111 4.067,112 4.162,113 5.86,114 4.1,115 4.867,116 5.056,117 3.997,118 4.153,119 5.854,120 4.072,121 4.86,122 5.081,123 3.803,124 4.082,125 5.799,126 3.95,127 4.895,128 5.185,129 3.425,130 3.805,131 5.751,132 3.642,133 0.011,134 0.684,135 9.036,136 4.04,137 7.901,138 5.163,139 0.232,140 1.081,141 18.166,142 6.395,143 20.906,144 8.41,145 0.231,146 1.267,147 18.132,148 6.679,149 19.807,150 8.708,151 1.498,152 23.076,153 8.229,154 26.345,155 0.387,156 1.585,157 9.688,158 32.854,159 0.4,160 1.494,161 27.687,162 10.721,163 31.66,164 14.013,165 0.131,166 1.489,167 28.815,168 15.504,169 1.35,170 33.945,171 10.404,172 55.007,173 14.698,174 30,175 43,176 0.263,177 0.581,178 0.72,179 0.79,180 0.805,181 0.849,182 3.306,183 0.866,184 43.5,185 5}
{0 CHEMBL1916125,3 15.193,4 5.75,5 5.548,6 6,7 7,8 41.133,10 944,11 17.671,12 17.671,13 17.671,14 17.671,15 17.671,16 10.06,17 18.294,18 10.274,19 -0.148,20 6.258,21 4.288,22 1,24 1.04,25 2.812,26 10.825,27 19,28 1,29 0.41,31 3,32 2.658,33 7.603,34 2.103,35 0.172,36 6.581,37 158.722,38 21,39 -0.359,40 0.072,41 -2.98,42 1.748,43 3.054,44 36.75,47 5.077,48 11.09,49 13.333,50 0.606,51 4.44,52 5.127,53 27.636,54 4,55 4.09,56 1.516,57 4.707,58 7.066,59 7.835,60 27.689,61 -2.98,62 -2.88,63 1.638,64 299.34,65 1.413,66 0.595,67 78,68 9,69 0.054,70 50.357,71 0.614,72 0.44,73 3.042,74 -0.086,75 2,76 3.524,77 2.969,78 2.969,79 1.548,80 7.885,81 3.084,82 9.513,83 97.882,84 7.575,85 0.724,86 3.943,87 4.054,88 3.541,89 3.468,90 5.069,91 3.464,92 4.465,93 4.642,94 3.924,95 3.826,96 5.513,97 3.827,98 4.561,99 4.71,100 4.065,101 3.985,102 5.671,103 3.986,104 4.727,105 4.891,106 4.125,107 4.108,108 5.814,109 4.073,110 4.868,111 4.068,112 4.154,113 5.856,114 4.094,115 4.864,116 5.055,117 3.999,118 4.137,119 5.86,120 4.062,121 4.857,122 5.083,123 3.803,124 4.068,125 5.807,126 3.941,127 4.865,128 5.146,129 3.42,130 3.813,131 5.734,132 3.646,133 0.011,134 0.684,135 9.036,136 4.04,137 7.568,138 5.163,139 0.223,140 1.083,141 18.137,142 6.386,143 20.867,144 8.417,145 0.263,146 1.274,147 18.502,148 6.426,149 21.83,150 8.441,151 1.479,152 22.114,153 8.195,154 25.644,155 0.328,156 1.583,157 9.685,158 30.942,159 0.419,160 1.496,161 27.728,162 10.373,163 33.381,164 13.606,165 0.193,166 1.494,167 31.865,168 15.057,169 1.306,170 32.589,171 10.294,172 54.497,173 14.462,174 30,175 43,176 0.263,177 0.566,178 0.705,179 0.76,180 0.805,181 0.849,182 3.306,183 0.867,184 43.5,185 5}
{0 CHEMBL1916130,3 15.833,4 5.917,5 5.56,6 2,7 7,8 46.588,10 1138,11 18.273,12 18.273,13 18.273,14 18.273,15 18.273,16 10.204,17 18.962,18 11.389,19 0.32,20 6.373,21 4.288,22 1,24 1.069,25 2.825,26 11.826,27 18.5,29 0.748,31 3,32 1.324,33 8.158,34 2.658,35 0.161,36 6.71,37 186.527,38 21,39 -0.271,40 0.083,41 -4.08,42 2.852,43 8.136,44 37.5,47 5.043,48 9.544,49 10.956,50 0.591,51 4.497,52 5.185,53 23.853,54 5,55 4.098,56 1.556,57 4.975,58 7.066,59 8.083,60 29.787,61 -4.03,62 -3.81,63 1.655,64 308.76,65 1.339,66 0.821,67 86,68 6,69 0.054,70 50.357,71 0.624,72 0.422,73 3.018,74 -0.025,75 3,76 3.524,77 3.152,78 3.152,79 1.743,80 8.036,81 4.247,82 18.034,83 97.842,84 8.587,85 0.677,86 3.941,87 4.047,88 3.62,89 3.465,90 5.151,91 3.486,92 4.495,93 4.659,94 4.105,95 3.84,96 6.115,97 3.873,98 4.584,99 4.723,100 4.172,101 4.003,102 5.885,103 4.026,104 4.804,105 4.982,106 4.221,107 4.091,108 6.054,109 4.102,110 4.859,111 4.242,112 4.142,113 6.161,114 4.123,115 4.881,116 5.065,117 4.215,118 4.154,119 6.185,120 4.12,121 4.937,122 5.156,123 4.077,124 4.044,125 6.272,126 3.996,127 4.822,128 5.088,129 3.77,130 3.747,131 6.042,132 3.682,133 0.15,134 0.897,135 6.689,136 4.058,137 17.824,138 4.441,139 0.929,140 1.754,141 16.956,142 6.633,143 142.789,144 7.577,145 0.432,146 1.642,147 14.623,148 7,149 25.88,150 7.79,151 1.921,152 22.014,153 8.638,154 77.423,155 1.114,156 1.887,157 9.144,158 74.036,159 0.745,160 2.091,161 24.334,162 11.158,163 69.59,164 13.259,165 1.005,166 2.162,167 126.432,168 13.701,169 1.65,170 30.438,171 10.027,172 74.91,173 12.912,174 54,175 48,176 0.297,177 0.626,178 0.751,179 0.815,180 0.823,181 0.846,182 3.377,183 0.83,184 44.4,185 6.301}
{0 CHEMBL1916131,3 14.27,4 5.417,5 5.546,6 2,7 7,8 38.731,10 850,11 16.801,12 16.801,13 16.801,14 16.801,15 16.801,16 9.536,17 17.357,18 9.846,19 -0.2,20 5.886,21 4.288,22 1,24 1.066,25 2.794,26 9.307,27 18.5,29 0.377,31 3,32 2.595,33 7.631,34 2.131,35 0.178,36 6.249,37 167.029,38 21,39 -0.287,40 0.074,41 -3.75,42 2.52,43 6.348,44 35.5,47 4.927,48 9.599,49 11.445,50 0.588,51 4.428,52 5.115,53 24.462,54 7,55 4.096,56 1.53,57 4.769,58 7.066,59 7.477,60 22.354,61 -3.71,62 -3.53,63 1.643,64 288.46,65 1.42,66 0.475,67 77,68 6,69 0.056,70 89.505,71 0.6,72 0.445,73 2.83,74 -0.158,75 1,76 3.524,77 2.966,78 2.966,79 1.626,80 7.8,81 3.969,82 15.751,83 96.674,84 8.401,85 0.75,86 3.858,87 3.965,88 3.542,89 3.442,90 4.993,91 3.428,92 4.374,93 4.543,94 3.957,95 3.823,96 5.447,97 3.808,98 4.502,99 4.643,100 4.116,101 3.983,102 5.637,103 3.962,104 4.66,105 4.834,106 4.177,107 4.064,108 5.758,109 4.019,110 4.728,111 4.089,112 4.112,113 5.754,114 4.027,115 4.717,116 4.905,117 4.01,118 4.088,119 5.743,120 3.976,121 4.663,122 4.878,123 3.806,124 3.945,125 5.648,126 3.815,127 4.657,128 4.92,129 3.472,130 3.685,131 5.607,132 3.504,133 0.02,134 0.62,135 6.908,136 3.525,137 5.399,138 4.382,139 0.181,140 1.001,141 15.424,142 5.982,143 15.672,144 7.548,145 0.235,146 1.165,147 17.107,148 6.253,149 19.148,150 7.638,151 1.343,152 21.133,153 7.485,154 24.081,155 0.361,156 1.372,157 8.834,158 27.509,159 0.302,160 1.243,161 29.48,162 10.095,163 27.892,164 13.042,165 0.144,166 1.218,167 22.805,168 12.4,169 1.074,170 31.698,171 9.221,172 47.842,173 11.728,174 27,175 42,176 0.281,177 0.623,178 0.75,179 0.82,180 0.828,181 0.852,182 3.269,183 0.892,184 45.2,185 6}
{0 CHEMBL1916132,3 14.91,4 5.583,5 5.556,6 1,7 7,8 44.185,10 1040,11 17.403,12 17.403,13 17.403,14 17.403,15 17.403,16 9.679,17 18.032,18 10.961,19 0.057,20 6.018,21 4.288,22 1,24 1.068,25 2.808,26 9.537,27 18,29 0.78,31 3,32 1.242,33 8.205,34 2.705,35 0.166,36 6.384,37 195.168,38 21,39 -0.281,40 0.085,41 -4.87,42 3.64,43 13.25,44 36.25,47 4.897,48 8.046,49 8.883,50 0.579,51 4.486,52 5.173,53 22.706,54 8,55 4.103,56 1.576,57 5.052,58 7.066,59 7.741,60 19.588,61 -4.78,62 -4.48,63 1.657,64 297.88,65 1.343,66 0.758,67 81,68 6,69 0.057,70 89.505,71 0.64,72 0.426,73 2.805,74 -0.158,75 2,76 3.524,77 3.146,78 3.146,79 1.778,80 7.963,81 4.927,82 24.279,83 96.184,84 9.532,85 0.7,86 3.856,87 3.957,88 3.621,89 3.439,90 5.079,91 3.451,92 4.407,93 4.561,94 4.136,95 3.831,96 6.083,97 3.852,98 4.531,99 4.669,100 4.217,101 3.988,102 5.862,103 3.996,104 4.718,105 4.897,106 4.264,107 4.05,108 6.003,109 4.048,110 4.724,111 4.347,112 4.082,113 6.123,114 4.053,115 4.713,116 4.894,117 4.164,118 4.064,119 6.016,120 4.003,121 4.698,122 4.9,123 4.068,124 3.926,125 6.049,126 3.868,127 4.643,128 4.895,129 3.805,130 3.654,131 5.96,132 3.568,133 0.16,134 0.842,135 4.399,136 3.503,137 22.367,138 3.667,139 0.854,140 1.688,141 13.03,142 6.143,143 139.996,144 6.672,145 0.455,146 1.533,147 12.881,148 6.513,149 35.473,150 6.763,151 1.762,152 18.885,153 8.024,154 90.419,155 0.975,156 1.613,157 8.428,158 85.996,159 0.68,160 1.695,161 22.714,162 9.82,163 79.327,164 11.762,165 0.676,166 1.732,167 78.747,168 11.396,169 1.44,170 29.562,171 9.455,172 79.324,173 11.42,174 51,175 47,176 0.308,177 0.645,178 0.743,179 0.815,180 0.823,181 0.848,182 3.342,183 0.853,184 46.3,185 6}
{0 CHEMBL1916475,3 21.036,4 7.472,5 5.553,6 3,7 5,10 2283,11 22.67,12 22.67,13 22.67,14 22.67,15 22.67,16 13.623,17 23.371,18 15.028,19 0.994,20 11.016,21 9.09,22 0.83,23 1.579,24 1.16,25 3.034,26 9.043,27 16,29 0.77,33 7.768,34 2.268,35 0.116,36 9.08,37 192.425,38 12,39 -0.075,40 0.073,41 -3.44,42 2.207,43 4.869,44 38.25,45 1,46 1,47 5.286,48 16.755,49 15.521,50 0.825,51 4.317,52 5.004,53 36.383,54 3,55 3.893,56 1.461,57 4.125,59 10.959,60 33.002,61 -3.42,62 -3.27,63 1.522,64 415.26,65 1.159,66 0.745,67 169,69 0.033,70 50.112,71 0.983,72 0.322,73 3.168,74 0.956,75 8,76 3.17,77 2.779,78 2.779,79 1.616,80 11.97,81 2.718,82 7.388,83 123.064,84 7.216,85 0.333,86 4.245,87 4.369,88 3.778,89 3.69,90 5.325,91 3.688,92 4.817,93 5.002,94 4.12,95 4.078,96 5.861,97 4.049,98 5.079,99 5.308,100 4.217,101 4.226,102 6.074,103 4.175,104 5.113,105 5.356,106 4.165,107 4.201,108 6.146,109 4.139,110 5.044,111 4.156,112 4.155,113 6.119,114 4.102,115 4.964,116 5.185,117 4.179,118 4.138,119 6.031,120 4.108,121 4.986,122 5.182,123 4.199,124 4.171,125 6.137,126 4.143,127 5.046,128 5.258,129 4.114,130 4.17,131 6.182,132 4.112,133 0.101,134 0.945,135 13.87,136 5.482,137 13.604,138 7.555,139 0.521,140 1.462,141 27.353,142 8.86,143 42.503,144 12.843,145 0.629,146 1.766,147 37.094,148 10.96,149 54.974,150 16.666,151 1.769,152 39.197,153 10.85,154 76.212,155 0.785,156 1.685,157 9.631,158 81.499,159 0.616,160 1.629,161 32.658,162 8.888,163 52.267,164 14.007,165 0.687,166 1.666,167 67.388,168 13.855,169 1.668,170 35.733,171 10.097,172 86.198,173 15.165,174 25,175 49,176 0.26,177 0.604,178 0.8,179 0.867,180 0.867,181 0.867,182 3.532,183 0.95,184 36.5,185 5.699}
{0 CHEMBL192,3 20.068,4 7.25,5 5.938,6 3,7 6,8 77.981,9 2,10 1981,11 21.944,12 21.944,13 21.944,14 21.944,15 21.944,16 12.712,17 22.642,18 14.493,19 0.756,20 9.549,21 2.757,22 1,23 3.591,24 1.207,25 2.97,26 13.005,27 17,29 0.879,33 7.856,34 2.356,35 0.132,36 8.838,37 240.414,38 11,39 -0.05,40 0.096,41 -2.74,42 1.51,43 2.28,44 39.25,47 5.349,48 17.934,49 16.925,50 0.86,51 4.463,52 5.15,53 42.379,54 3,55 4.088,56 1.515,57 4.647,58 7.034,59 10.628,60 43.223,61 -2.75,62 -2.67,63 1.608,64 419.11,65 1.189,66 0.97,67 152,68 2,69 0.059,70 22.47,71 0.791,72 0.334,73 3.111,74 0.952,75 7,76 3.392,77 2.862,78 2.862,79 1.71,80 11.424,81 2.772,82 7.683,83 126.942,84 7.534,85 0.306,86 4.246,87 4.366,88 3.947,89 3.731,90 5.261,91 3.7,92 4.84,93 5.036,94 4.287,95 4.127,96 5.995,97 4.087,98 5.055,99 5.252,100 4.406,101 4.318,102 6.146,103 4.25,104 5.174,105 5.372,106 4.406,107 4.343,108 6.374,109 4.279,110 5.139,111 4.339,112 4.305,113 6.265,114 4.24,115 5.109,116 5.312,117 4.349,118 4.318,119 6.318,120 4.229,121 5.126,122 5.338,123 4.316,124 4.28,125 6.222,126 4.201,127 5.097,128 5.295,129 4.267,130 4.209,131 6.363,132 4.147,133 0.132,134 0.995,135 16.619,136 5.789,137 16.528,138 7.65,139 0.607,140 1.556,141 29.833,142 9.149,143 59.782,144 12.776,145 0.618,146 1.858,147 42.238,148 13.054,149 55.413,150 16.653,151 1.931,152 46.625,153 13.512,154 106.887,155 0.833,156 1.865,157 11.932,158 93.873,159 1.004,160 1.85,161 42.386,162 13.452,163 102.001,164 18.027,165 0.724,166 1.8,167 86.977,168 17.46,169 1.72,170 42.709,171 11.445,172 139.834,173 15.649,174 58,175 53,176 0.274,177 0.587,178 0.776,179 0.839,180 0.839,181 0.839,182 3.533,183 1.051,184 34.9,185 5}
{0 CHEMBL1939912,1 3.05,2 1,3 14.441,4 5.167,5 5.724,7 4,8 91.071,9 4,10 806,11 16.196,12 16.196,13 16.196,14 16.196,15 16.196,16 9.221,17 16.644,18 10.484,19 -0.286,20 5.904,22 1,23 2.292,24 1.158,25 2.665,26 9.655,27 12.5,28 1,29 0.213,30 1,31 4,32 3.978,33 7.611,34 2.111,35 0.179,36 6.507,37 146.615,38 15,39 -0.152,40 0.067,41 -3.03,42 1.797,43 3.228,44 28.5,47 5.03,48 14.235,49 13.588,50 0.683,51 4.266,52 4.952,53 27.652,54 4,55 4.097,56 1.529,57 4.661,58 7.38,59 7.853,60 32.529,61 -3.03,62 -2.92,63 1.61,64 283.56,65 1.188,66 0.528,67 78,68 3,69 0.056,70 33.449,71 0.769,72 0.435,73 2.906,74 -0.253,75 5,76 3.087,77 2.659,78 2.659,79 1.542,80 7.792,81 1.916,82 3.67,83 93.445,84 7.097,85 0.556,86 3.944,87 4.069,88 3.479,89 3.439,90 4.989,91 3.424,92 4.513,93 4.704,94 3.866,95 3.86,96 5.479,97 3.832,98 4.702,99 4.892,100 3.911,101 4.008,102 5.695,103 3.944,104 4.813,105 5.051,106 3.886,107 4.045,108 5.678,109 3.953,110 4.805,111 3.904,112 4.038,113 5.719,114 3.953,115 4.816,116 5.03,117 3.898,118 4.066,119 5.716,120 3.972,121 4.928,122 5.194,123 3.754,124 3.984,125 5.811,126 3.86,127 4.771,128 5.034,129 3.349,130 3.703,131 5.734,132 3.541,133 0.055,134 0.703,135 10.382,136 4.187,137 10.528,138 5.698,139 0.213,140 1.137,141 20.011,142 6.773,143 20.077,144 9.699,145 0.29,146 1.335,147 24.213,148 8.502,149 31.158,150 12.095,151 1.429,152 27.756,153 9.537,154 28.314,155 0.384,156 1.425,157 9.346,158 33.367,159 0.231,160 1.464,161 27.289,162 9.502,163 23.459,164 14.026,165 0.421,166 1.461,167 40.536,168 14.945,169 1.103,170 28.73,171 8.538,172 55.763,173 12.563,174 18,175 40,176 0.265,177 0.624,178 0.821,179 0.866,180 0.866,181 0.866,182 3.231,183 0.921,184 39.1,185 5}
{0 CHEMBL1939914,1 3.078,2 1,3 14.7,4 5.25,5 5.791,7 4,8 40.092,9 3,10 808,11 16.455,12 16.455,13 16.455,14 16.455,15 16.455,16 9.588,17 17.03,18 10.5,19 -0.337,20 6.226,22 1,23 2.43,24 1.192,25 2.815,26 9.843,27 12.5,28 1,29 0.145,30 1,31 4,32 4.142,33 7.514,34 2.014,35 0.179,36 6.484,37 145.389,38 15,39 -0.166,40 0.063,41 -3.03,42 1.797,43 3.228,44 28.75,45 1,46 1,47 5.103,48 14.459,49 14.573,50 0.717,51 4.252,52 4.938,53 29.706,54 2,55 4.096,56 1.509,57 4.511,58 6.823,59 7.84,60 32.944,61 -3.03,62 -2.92,63 1.575,64 283.56,65 1.198,66 0.56,67 76,68 3,69 0.045,70 33.449,71 0.722,72 0.391,73 3.029,74 -0.216,75 6,76 3.087,77 2.471,78 2.471,79 1.542,80 7.792,81 2.233,82 4.987,83 93.66,84 7.097,85 0.556,86 3.944,87 4.068,88 3.488,89 3.428,90 4.964,91 3.417,92 4.522,93 4.715,94 3.847,95 3.828,96 5.463,97 3.806,98 4.666,99 4.852,100 3.918,101 4.003,102 5.606,103 3.945,104 4.801,105 5.028,106 3.893,107 4.072,108 5.64,109 3.974,110 4.862,111 3.905,112 4.058,113 5.718,114 3.964,115 4.809,116 5.018,117 3.899,118 4.067,119 5.691,120 3.974,121 4.942,122 5.207,123 3.758,124 3.998,125 5.776,126 3.871,127 4.798,128 5.066,129 3.357,130 3.715,131 5.641,132 3.553,133 0.036,134 0.699,135 10.349,136 4.173,137 7.441,138 5.688,139 0.274,140 1.111,141 20.606,142 6.592,143 21.039,144 9.373,145 0.296,146 1.318,147 23.243,148 8.147,149 23.899,150 11.605,151 1.452,152 26.83,153 9.753,154 20.531,155 0.412,156 1.469,157 9.915,158 32.625,159 0.224,160 1.463,161 26.982,162 9.453,163 22.767,164 13.916,165 0.421,166 1.481,167 36.725,168 15.216,169 1.134,170 29.655,171 8.533,172 43.186,173 12.702,174 11,175 39,176 0.265,177 0.595,178 0.784,179 0.814,180 0.814,181 0.814,182 3.231,183 0.921,184 39.1,185 5}
{0 CHEMBL1939915,1 3.087,2 1,3 15.148,4 5.417,5 5.791,7 4,8 42.129,9 3,10 914,11 16.903,12 16.903,13 16.903,14 16.903,15 16.903,16 9.708,17 17.469,18 10.984,19 -0.254,20 6.468,22 1,23 2.448,24 1.22,25 2.823,26 10.46,27 12.5,28 1,29 0.19,30 1,31 4,32 4.134,33 7.507,34 2.007,35 0.173,36 6.823,37 152.054,38 15,39 -0.133,40 0.065,41 -3.26,42 2.029,43 4.117,44 29.25,45 1,46 1,47 5.189,48 15.875,49 16.232,50 0.724,51 4.28,52 4.966,53 32.386,54 3,55 4.096,56 1.514,57 4.577,58 6.823,59 8.215,60 34.112,61 -3.25,62 -3.11,63 1.6,64 300.86,65 1.17,66 0.527,67 77,68 3,69 0.05,70 33.449,71 0.738,72 0.416,73 3.039,74 -0.213,75 6,76 3.087,77 2.617,78 2.617,79 1.518,80 7.88,81 2.611,82 6.816,83 98.078,84 6.948,85 0.536,86 3.999,87 4.125,88 3.523,89 3.484,90 5.006,91 3.466,92 4.582,93 4.778,94 3.899,95 3.886,96 5.513,97 3.86,98 4.752,99 4.938,100 3.971,101 4.067,102 5.686,103 4.006,104 4.893,105 5.129,106 3.944,107 4.145,108 5.71,109 4.04,110 4.945,111 3.94,112 4.137,113 5.782,114 4.028,115 4.914,116 5.147,117 3.942,118 4.135,119 5.754,120 4.031,121 4.983,122 5.242,123 3.851,124 4.082,125 5.82,126 3.962,127 4.89,128 5.144,129 3.576,130 3.89,131 5.755,132 3.741,133 0.043,134 0.738,135 11.276,136 4.507,137 8.808,138 6.222,139 0.261,140 1.174,141 22.106,142 7.146,143 22.269,144 10.294,145 0.349,146 1.407,147 25.951,148 8.874,149 28.06,150 12.687,151 1.573,152 29.906,153 10.553,154 23.118,155 0.418,156 1.585,157 10.986,158 34.134,159 0.268,160 1.573,161 30.83,162 10.609,163 26.409,164 15.892,165 0.421,166 1.569,167 37.538,168 16.106,169 1.306,170 31.807,171 9.698,172 44.754,173 14.383,174 18,175 41,176 0.257,177 0.592,178 0.817,179 0.859,180 0.859,181 0.859,182 3.269,183 0.935,184 38.8,185 5}
{0 CHEMBL1940053,1 3.09,2 1,3 15.407,4 5.5,5 5.737,7 4,8 41.742,9 3,10 914,11 17.162,12 17.162,13 17.162,14 17.162,15 17.162,16 10.088,17 17.734,18 11,19 -0.102,20 6.811,22 1,23 2.461,24 1.204,25 2.886,26 10.648,27 12.5,28 1,29 0.218,30 1,31 4,32 4.154,33 7.493,34 1.993,35 0.173,36 6.898,37 149.389,38 15,39 -0.147,40 0.061,41 -3.26,42 2.029,43 4.117,44 29.25,45 1,46 1,47 5.204,48 16.419,49 16.268,50 0.714,51 4.266,52 4.952,53 32.811,54 4,55 4.096,56 1.49,57 4.417,58 6.969,59 8.33,60 34.529,61 -3.25,62 -3.11,63 1.565,64 300.86,65 1.17,66 0.557,67 77,68 3,69 0.042,70 33.449,71 0.767,72 0.374,73 3.079,74 -0.077,75 6,76 3.087,77 2.46,78 2.46,79 1.518,80 7.88,81 2.296,82 5.27,83 98.526,84 6.948,85 0.536,86 3.999,87 4.125,88 3.523,89 3.484,90 5,91 3.466,92 4.582,93 4.778,94 3.875,95 3.885,96 5.502,97 3.853,98 4.772,99 4.964,100 4.01,101 4.094,102 5.686,103 4.034,104 4.93,105 5.166,106 3.935,107 4.161,108 5.738,109 4.049,110 4.949,111 3.933,112 4.12,113 5.771,114 4.012,115 4.868,116 5.084,117 3.943,118 4.123,119 5.732,120 4.025,121 4.996,122 5.255,123 3.854,124 4.095,125 5.828,126 3.972,127 4.914,128 5.172,129 3.582,130 3.899,131 5.762,132 3.751,133 0.043,134 0.738,135 11.276,136 4.507,137 7.619,138 6.222,139 0.276,140 1.174,141 22.125,142 7.153,143 21.277,144 10.306,145 0.312,146 1.446,147 26.353,148 9.132,149 25.182,150 13.179,151 1.604,152 31.225,153 10.989,154 23.955,155 0.437,156 1.569,157 10.933,158 34.539,159 0.243,160 1.54,161 29.082,162 10.149,163 24.082,164 15.078,165 0.422,166 1.589,167 36.315,168 16.376,169 1.336,170 32.715,171 9.689,172 43.367,173 14.522,174 11,175 40,176 0.257,177 0.585,178 0.806,179 0.862,180 0.862,181 0.862,182 3.269,183 0.942,184 38.8,185 5}
{0 CHEMBL1940056,1 3.057,2 1,3 14.485,4 5.167,5 5.736,7 4,8 38.576,9 3,10 808,11 16.292,12 16.292,13 16.292,14 16.292,15 16.292,16 9.581,17 16.725,18 10.578,19 -0.125,20 6.226,21 2.757,22 1,23 2.41,24 1.202,25 2.777,26 9.288,27 12.5,28 1,29 0.242,30 1,31 4,32 3.732,33 7.597,34 2.097,35 0.179,36 6.615,37 144.615,38 15,39 -0.232,40 0.063,41 -3.03,42 1.797,43 3.228,44 28.5,45 1,46 1,47 5.089,48 15.64,49 14.288,50 0.73,51 4.252,52 4.938,53 29.322,54 4,55 4.094,56 1.506,57 4.474,58 6.969,59 8.019,60 29.634,61 -3.03,62 -2.92,63 1.57,64 283.56,65 1.188,66 0.544,67 69,68 3,69 0.044,70 33.449,71 0.82,72 0.391,73 2.944,74 -0.32,75 6,76 3.087,77 2.46,78 2.46,79 1.542,80 7.458,81 2.181,82 4.756,83 92.314,84 7.097,85 0.556,86 3.944,87 4.069,88 3.479,89 3.439,90 4.981,91 3.424,92 4.513,93 4.704,94 3.849,95 3.852,96 5.482,97 3.82,98 4.745,99 4.939,100 3.971,101 4.056,102 5.693,103 3.995,104 4.901,105 5.15,106 3.884,107 4.095,108 5.738,109 3.985,110 4.846,111 3.865,112 4.027,113 5.77,114 3.929,115 4.79,116 5.016,117 3.863,118 4.018,119 5.702,120 3.927,121 4.859,122 5.101,123 3.771,124 3.985,125 5.797,126 3.873,127 4.83,128 5.091,129 3.41,130 3.772,131 5.759,132 3.608,133 0.055,134 0.703,135 10.382,136 4.187,137 8.444,138 5.698,139 0.21,140 1.133,141 20.002,142 6.765,143 20.021,144 9.698,145 0.301,146 1.399,147 25.346,148 8.878,149 26.571,150 12.682,151 1.53,152 30.601,153 10.39,154 27.808,155 0.408,156 1.438,157 9.689,158 41.149,159 0.257,160 1.403,161 26.97,162 9.103,163 27.912,164 13.554,165 0.364,166 1.412,167 38.276,168 14.003,169 1.192,170 30.329,171 8.957,172 56.481,173 13.273,174 10,175 39,176 0.265,177 0.616,178 0.809,179 0.869,180 0.869,181 0.869,182 3.231,183 0.934,184 39.1,185 5}
{0 CHEMBL1940057,1 3.102,2 1,3 17.529,4 6.25,5 5.737,7 4,8 52.044,9 3,10 1312,11 19.284,12 19.284,13 19.284,14 19.284,15 19.284,16 11.718,17 20.015,18 12.561,19 0.167,20 8.641,22 1,23 2.46,24 1.204,25 2.945,26 12.403,27 12.5,28 1,29 0.233,30 1,31 4,32 4.097,33 7.512,34 2.012,35 0.156,36 7.73,37 164.268,38 15,39 -0.22,40 0.057,41 -2.95,42 1.72,43 2.96,44 31.25,45 2,46 2,47 5.311,48 18.268,49 17.977,50 0.922,51 4.307,52 4.994,53 36.942,54 4,55 4.097,56 1.471,57 4.239,58 6.969,59 9.36,60 38.669,61 -2.95,62 -2.85,63 1.534,64 344.25,65 1.116,66 0.709,67 134,68 3,69 0.04,70 33.449,71 0.802,72 0.336,73 3.134,74 0.347,75 8,76 3.087,77 2.46,78 2.46,79 1.529,80 10.036,81 2.165,82 4.686,83 109.569,84 6.867,85 0.484,86 4.126,87 4.25,88 3.635,89 3.584,90 5.119,91 3.569,92 4.717,93 4.912,94 3.964,95 3.972,96 5.634,97 3.941,98 4.899,99 5.095,100 4.09,101 4.174,102 5.815,103 4.113,104 5.031,105 5.27,106 4.031,107 4.246,108 5.831,109 4.135,110 5.061,111 4.05,112 4.221,113 5.893,114 4.121,115 4.994,116 5.206,117 4.091,118 4.25,119 5.855,120 4.161,121 5.12,122 5.359,123 4.052,124 4.263,125 5.973,126 4.151,127 5.134,128 5.39,129 3.865,130 4.13,131 5.975,132 3.996,133 0.036,134 0.819,135 13.137,136 5.198,137 7.661,138 7.168,139 0.358,140 1.283,141 25.903,142 8.077,143 25.781,144 11.641,145 0.505,146 1.569,147 30.778,148 10.24,149 34.168,150 14.86,151 1.734,152 34.827,153 12.133,154 26.308,155 0.507,156 1.709,157 12.101,158 41.071,159 0.287,160 1.717,161 33.354,162 11.6,163 26.864,164 17.176,165 0.398,166 1.817,167 38.415,168 18.878,169 1.638,170 40.847,171 11.979,172 52.938,173 18.123,174 14,175 43,176 0.252,177 0.552,178 0.787,179 0.87,180 0.87,181 0.87,182 3.376,183 0.955,184 37.5,185 5}
{0 CHEMBL1940058,1 3.108,2 1,3 16.399,4 5.833,5 5.737,7 4,8 48.37,9 3,10 1146,11 18.154,12 18.154,13 18.154,14 18.154,15 18.154,16 10.738,17 18.704,18 12.106,19 -0.027,20 7.647,22 1,23 2.471,24 1.205,25 2.944,26 12.527,27 12.5,28 1,29 0.254,30 1,31 4,32 4.173,33 7.469,34 1.969,35 0.161,36 7.684,37 160.718,38 15,39 -0.254,40 0.057,41 -3.71,42 2.48,43 6.148,44 30.25,45 1,46 1,47 5.271,48 18.445,49 18.121,50 0.926,51 4.307,52 4.994,53 35.303,54 6,55 4.097,56 1.499,57 4.416,58 6.969,59 9.252,60 38.245,61 -3.68,62 -3.5,63 1.563,64 335.46,65 1.12,66 0.636,67 92,68 3,69 0.046,70 33.449,71 0.833,72 0.384,73 3.133,74 -0.005,75 6,76 3.087,77 2.461,78 2.461,79 1.475,80 8.667,81 3.022,82 9.132,83 107.692,84 6.701,85 0.5,86 4.099,87 4.23,88 3.59,89 3.586,90 5.067,91 3.557,92 4.691,93 4.894,94 3.958,95 3.983,96 5.598,97 3.941,98 4.918,99 5.121,100 4.064,101 4.181,102 5.812,103 4.113,104 5.026,105 5.272,106 4.015,107 4.251,108 5.811,109 4.135,110 5.029,111 4.026,112 4.242,113 5.863,114 4.13,115 5.026,116 5.258,117 4.063,118 4.273,119 5.844,120 4.165,121 5.109,122 5.348,123 4.007,124 4.27,125 5.954,126 4.144,127 5.139,128 5.412,129 3.779,130 4.13,131 5.942,132 3.97,133 0.061,134 0.814,135 13.085,136 5.178,137 8.601,138 7.276,139 0.259,140 1.296,141 25.076,142 8.25,143 23.703,144 12.096,145 0.444,146 1.586,147 31.765,148 10.444,149 34.169,150 15.195,151 1.743,152 34.785,153 12.227,154 26.56,155 0.431,156 1.735,157 12.226,158 37.244,159 0.294,160 1.77,161 34.733,162 12.244,163 27.51,164 18.362,165 0.405,166 1.841,167 38.551,168 19.104,169 1.684,170 40.796,171 12.131,172 51.062,173 18.662,174 19,175 43,176 0.244,177 0.56,178 0.792,179 0.841,180 0.841,181 0.841,182 3.341,183 0.977,184 38.2,185 5}
{0 CHEMBL200906,3 12.985,4 4.694,5 5.585,6 3,7 3,8 133.797,9 1,10 608,11 14.93,12 14.93,13 14.93,14 14.93,15 14.93,16 8.575,17 15.348,18 9.26,19 -0.519,20 4.97,21 16.607,22 1,23 1.492,24 0.866,25 2.479,26 4.971,27 16,29 0.596,31 2,32 1.541,33 7.992,34 2.492,35 0.179,36 5.132,37 163.555,38 15,39 0.091,40 0.072,41 -2.2,42 0.974,43 0.948,44 31.25,47 4.5,48 5.842,49 6.161,50 0.416,51 4.212,52 4.898,53 15.818,54 1,55 4.043,56 1.532,57 4.668,58 7.861,59 6.244,60 13.145,61 -2.25,62 -2.22,63 1.571,64 236.38,65 1.42,66 0.333,67 62,68 1,69 0.072,70 33.326,71 0.774,72 0.422,73 2.439,74 -0.443,75 4,76 3.392,77 2.61,78 2.61,79 1.898,80 7.864,81 0.564,82 0.318,83 81.172,84 9.823,85 0.6,86 3.651,87 3.733,88 3.498,89 3.24,90 4.91,91 3.246,92 4.149,93 4.26,94 3.917,95 3.633,96 5.385,97 3.641,98 4.29,99 4.411,100 3.81,101 3.662,102 5.595,103 3.666,104 4.374,105 4.51,106 3.857,107 3.653,108 5.842,109 3.639,110 4.327,111 3.751,112 3.526,113 5.652,114 3.514,115 4.188,116 4.333,117 3.751,118 3.423,119 5.645,120 3.398,121 4.033,122 4.217,123 3.498,124 3.235,125 5.361,126 3.184,127 3.685,128 3.87,129 3.046,130 2.924,131 4.875,132 2.818,133 0.144,134 0.527,135 3.438,136 2.699,137 8.364,138 2.388,139 0.349,140 0.858,141 9.908,142 4.422,143 22.599,144 4.157,145 0.432,146 0.886,147 10.045,148 5.365,149 42.803,150 4.647,151 0.929,152 11.521,153 6.004,154 67.874,155 0.563,156 0.87,157 6.206,158 56.763,159 0.643,160 0.792,161 12.159,162 4.968,163 61.95,164 4.307,165 0.43,166 0.676,167 33.609,168 4.834,169 0.512,170 13.165,171 3.795,172 33.404,173 2.839,174 10,175 37,176 0.347,177 0.74,178 0.847,179 0.886,180 0.886,181 0.886,182 3.149,183 0.886,184 43.8,185 4.796}
{0 CHEMBL204449,3 13.99,4 5.333,5 5.249,6 2,7 5,8 70.956,10 880,11 16.206,12 16.206,13 16.206,14 16.206,15 16.206,16 9.733,17 16.689,18 9.593,19 -0.463,20 7.54,21 32.904,22 1,24 1.029,25 2.682,26 7.177,27 18,29 0.583,33 7.965,34 2.465,35 0.152,36 5.889,37 158.42,38 17,39 -0.052,40 0.076,41 -4.87,42 3.638,43 13.236,44 33,47 4.56,48 7.482,49 7.287,50 0.443,51 4.163,52 4.848,53 16.874,54 5,55 3.934,56 1.471,57 4.056,58 6.293,59 7.09,60 19.323,61 -4.78,62 -4.48,63 1.509,64 290.58,65 1.375,66 0.26,67 90,69 0.039,70 16.786,71 0.969,72 0.302,73 2.667,74 -0.269,75 4,76 3.392,77 2.606,78 2.606,79 1.756,80 10,81 4.107,82 16.865,83 92.014,84 8.78,85 0.654,86 3.773,87 3.864,88 3.522,89 3.403,90 4.992,91 3.37,92 4.245,93 4.37,94 3.871,95 3.741,96 5.5,97 3.691,98 4.466,99 4.64,100 3.842,101 3.738,102 5.677,103 3.691,104 4.436,105 4.6,106 3.766,107 3.672,108 5.761,109 3.626,110 4.384,111 3.736,112 3.683,113 5.641,114 3.629,115 4.366,116 4.544,117 3.735,118 3.715,119 5.582,120 3.651,121 4.405,122 4.59,123 3.72,124 3.678,125 5.628,126 3.594,127 4.276,128 4.488,129 3.493,130 3.523,131 5.42,132 3.417,133 0.065,134 0.595,135 6.1,136 3.648,137 6.953,138 3.92,139 0.216,140 0.948,141 12.576,142 6.142,143 18.172,144 6.66,145 0.361,146 1.159,147 20.947,148 7.809,149 42.5,150 8.107,151 1.071,152 21.126,153 7.519,154 59.448,155 0.476,156 0.955,157 6.588,158 52.003,159 0.257,160 0.963,161 15.408,162 6.769,163 31.981,164 7.838,165 0.43,166 1.049,167 48.125,168 7.808,169 0.935,170 16.941,171 6.845,172 32.428,173 7.91,174 10,175 35,176 0.31,177 0.639,178 0.786,179 0.876,180 0.876,181 0.876,182 3.228,183 0.951,184 46.2,185 4.796}
{0 CHEMBL2070735,3 14.546,4 5.167,5 5.626,6 4,7 3,8 113.543,10 768,11 16.394,12 16.394,13 16.394,14 16.394,15 16.394,16 9.705,17 17.177,18 10.655,19 -0.244,20 6.668,21 14.099,22 1,23 2.348,24 1.019,25 2.6,26 5.924,27 12.5,29 0.47,31 2,32 1.191,33 7.646,34 2.146,35 0.17,36 6.071,37 171.396,38 15,39 -0.114,40 0.053,41 -2.23,42 1,43 1,44 29.75,45 1,46 1,47 4.922,48 10.843,49 10.219,50 0.623,51 4.182,52 4.868,53 29.385,55 3.873,56 1.489,57 4.274,58 7.286,59 7.414,60 21.85,61 -2.27,62 -2.24,63 1.509,64 268.08,65 1.24,66 0.462,67 76,68 3,69 0.053,70 83.56,71 0.839,72 0.334,73 2.691,74 -0.126,75 2,76 3.087,77 2.635,78 2.635,79 1.765,80 9.625,81 -0.029,82 0.001,83 92.222,84 8.249,85 0.556,86 3.888,87 4.022,88 3.595,89 3.356,90 4.988,91 3.347,92 4.442,93 4.633,94 3.967,95 3.731,96 5.477,97 3.711,98 4.611,99 4.829,100 3.854,101 3.78,102 5.614,103 3.729,104 4.653,105 4.899,106 3.837,107 3.81,108 5.593,109 3.717,110 4.667,111 3.762,112 3.782,113 5.575,114 3.674,115 4.573,116 4.822,117 3.688,118 3.705,119 5.492,120 3.6,121 4.439,122 4.689,123 3.556,124 3.544,125 5.393,126 3.455,127 4.305,128 4.551,129 3.401,130 3.385,131 5.274,132 3.291,133 0.123,134 0.734,135 8.442,136 3.42,137 9.697,138 4.388,139 0.387,140 1.111,141 19.172,142 5.481,143 21.699,144 7.357,145 0.641,146 1.175,147 24.72,148 6.303,149 37.752,150 8.756,151 1.19,152 23.48,153 7.48,154 33.454,155 0.603,156 1.14,157 7.429,158 38.748,159 0.502,160 1.053,161 25.826,162 6.743,163 35.034,164 9.334,165 0.418,166 0.889,167 33.355,168 8.629,169 0.783,170 18.205,171 4.606,172 31.545,173 6.59,174 5,175 38,176 0.309,177 0.665,178 0.834,179 0.874,180 0.874,181 0.874,182 3.229,183 0.958,184 33.3,185 8.721}
{0 CHEMBL2178115,3 18.37,4 6.833,5 5.562,6 3,7 6,8 75.959,9 2,10 1675,11 20.886,12 20.886,13 20.886,14 20.886,15 20.886,16 12.133,17 21.45,18 12.774,19 0.601,20 8.997,21 1.899,22 1,24 1.077,25 2.979,26 7.379,27 22,29 0.841,33 7.934,34 2.434,35 0.127,36 7.491,37 199.732,38 17,39 -0.071,40 0.079,41 -4.14,42 2.906,43 8.447,44 43,47 4.952,48 9.732,49 10.661,50 0.575,51 4.434,52 5.121,53 25.688,55 3.921,56 1.498,57 4.342,58 6.862,59 9.014,60 24.486,61 -4.08,62 -3.86,63 1.566,64 368.26,65 1.387,66 0.6,67 164,69 0.044,70 55.812,71 0.869,72 0.37,73 2.985,74 0.82,75 6,76 3.644,77 2.904,78 2.904,79 1.78,80 13.097,81 3.246,82 10.537,83 114.484,84 8.778,85 0.5,86 4.044,87 4.157,88 3.74,89 3.559,90 5.259,91 3.574,92 4.534,93 4.683,94 4.128,95 3.926,96 5.761,97 3.928,98 4.756,99 4.932,100 4.231,101 4.019,102 6.01,103 4.017,104 4.796,105 4.987,106 4.186,107 3.996,108 6.101,109 3.975,110 4.743,111 4.104,112 3.979,113 5.967,114 3.934,115 4.706,116 4.899,117 4.008,118 3.93,119 5.902,120 3.892,121 4.694,122 4.894,123 4.056,124 3.836,125 6.094,126 3.81,127 4.597,128 4.812,129 3.797,130 3.744,131 5.806,132 3.695,133 0.154,134 0.784,135 7.585,136 3.904,137 9.283,138 4.514,139 0.435,140 1.202,141 15.473,142 6.586,143 31.965,144 7.92,145 0.626,146 1.398,147 23.39,148 7.643,149 51.354,150 9.142,151 1.389,152 27.083,153 8.021,154 75.561,155 0.695,156 1.319,157 8.282,158 65.043,159 0.522,160 1.262,161 23.1,162 8.036,163 55.634,164 9.826,165 0.882,166 1.206,167 97.937,168 9.341,169 1.088,170 23.411,171 7.18,172 58.07,173 9.072,174 27,175 48,176 0.296,177 0.663,178 0.792,179 0.865,180 0.881,181 0.881,182 3.472,183 0.863,184 42,185 4}
{0 CHEMBL2180945,3 19.149,4 7.028,5 5.938,6 2,7 3,9 2,10 1738,11 20.659,12 20.659,13 20.659,14 20.659,15 20.659,16 12.001,17 21.196,18 13.405,19 0.368,20 10.157,22 1,23 3.613,24 1.212,25 2.89,26 13.825,27 14,29 0.791,33 7.841,34 2.341,35 0.145,36 8.672,37 218.279,38 6,39 -0.051,40 0.104,41 -3.47,42 2.243,43 5.033,44 34,47 5.375,48 18.359,49 18.381,50 0.944,51 4.311,52 4.997,53 44.589,54 5,55 4.086,56 1.485,57 4.439,59 10.374,60 43.858,61 -3.45,62 -3.3,63 1.589,64 423.01,65 1.097,66 0.85,67 136,69 0.052,70 8.564,71 0.869,72 0.291,73 3.111,74 0.368,75 3,76 3.17,77 2.51,78 2.51,79 1.626,80 10.774,81 3.312,82 10.971,83 122.958,84 7.121,85 0.182,86 4.218,87 4.338,88 3.873,89 3.719,90 5.193,91 3.667,92 4.817,93 5.017,94 4.188,95 4.106,96 5.936,97 4.035,98 5.051,99 5.258,100 4.328,101 4.301,102 6.092,103 4.212,104 5.172,105 5.371,106 4.315,107 4.323,108 6.336,109 4.241,110 5.158,111 4.28,112 4.304,113 6.265,114 4.217,115 5.112,116 5.328,117 4.267,118 4.309,119 6.283,120 4.192,121 5.119,122 5.343,123 4.223,124 4.272,125 6.137,126 4.163,127 5.089,128 5.29,129 4.175,130 4.217,131 6.295,132 4.12,133 0.081,134 0.941,135 17.642,136 6.112,137 14.878,138 8.216,139 0.518,140 1.473,141 30.534,142 9.918,143 58.02,144 13.723,145 0.376,146 1.791,147 43.216,148 13.635,149 48.034,150 17.725,151 1.864,152 47.895,153 13.775,154 104.936,155 0.731,156 1.842,157 12.894,158 93.82,159 0.94,160 1.804,161 43.903,162 14.363,163 105.088,164 19.275,165 0.475,166 1.762,167 72.018,168 18.706,169 1.7,170 43.666,171 12.45,172 128.674,173 16.609,174 61,175 47,176 0.263,177 0.553,178 0.755,179 0.825,180 0.84,181 0.84,182 3.472,183 1.121,184 34.9,185 5}
{0 CHEMBL296435,3 12.28,4 4.639,5 5.549,6 1,7 1,8 43.256,9 1,10 526,11 13.458,12 13.458,13 13.458,14 13.458,15 13.458,16 8.239,17 13.813,18 8.559,19 -1.21,20 6.889,21 2.328,22 1,24 1.214,25 2.34,26 6.051,27 8.5,29 0.339,31 2,32 1.297,33 7.708,34 2.208,35 0.218,36 5.876,37 109.262,38 10,39 -0.131,40 0.087,41 -3.83,42 2.603,43 6.774,44 21.75,47 5.043,48 12.462,49 12.815,50 0.648,51 3.855,52 4.538,53 27.503,54 1,55 3.912,56 1.456,57 4.07,58 6.862,59 6.964,60 22.51,61 -3.79,62 -3.6,63 1.55,64 257.47,65 1.088,66 0.326,67 78,69 0.053,70 50.357,71 1.072,72 0.311,73 2.655,74 -0.885,75 5,76 2.585,77 1.768,78 1.768,79 1.497,80 8.6,81 2.189,82 4.79,83 79.585,84 6.452,85 0.476,86 3.833,87 3.986,88 3.258,89 3.257,90 4.87,91 3.225,92 4.391,93 4.615,94 3.581,95 3.641,96 5.338,97 3.57,98 4.66,99 4.926,100 3.641,101 3.769,102 5.572,103 3.666,104 4.73,105 5.005,106 3.624,107 3.819,108 5.623,109 3.702,110 4.761,111 3.489,112 3.797,113 5.664,114 3.648,115 4.675,116 4.97,117 3.346,118 3.689,119 5.503,120 3.534,121 4.558,122 4.843,123 3.238,124 3.551,125 5.53,126 3.395,127 4.468,128 4.784,129 2.873,130 3.367,131 5.332,132 3.179,133 0.05,134 0.637,135 10.547,136 3.45,137 11.99,138 5.5,139 0.223,140 0.95,141 18.818,142 5.924,143 23.091,144 9.301,145 0.354,146 1.082,147 24.833,148 7.201,149 38.476,150 11.692,151 1.129,152 26.594,153 7.641,154 37.337,155 0.404,156 1.078,157 7.823,158 49.55,159 0.288,160 0.973,161 25.105,162 6.971,163 36.079,164 11.64,165 0.357,166 0.852,167 50.381,168 10.17,169 0.713,170 20.671,171 4.969,172 41.611,173 8.744,174 26,175 28,176 0.267,177 0.563,178 0.737,179 0.838,180 0.877,181 0.877,182 3.058,183 1.037,184 32.6,185 4.796}
{0 CHEMBL466068,1 2.95,2 1,3 17.874,4 6.389,5 5.649,7 5,8 66.997,9 5,10 1429,11 19.775,12 19.775,13 19.775,14 19.775,15 19.775,16 11.844,17 20.402,18 12.906,19 0.213,20 9.077,22 1,23 2.344,24 1.211,25 2.866,26 8.834,27 15,28 1,29 0.454,31 2,32 1.06,33 7.638,34 2.138,35 0.144,36 7.958,37 170.322,38 16,39 -0.012,40 0.066,41 -2.8,42 1.566,43 2.453,44 34.5,45 1,46 1,47 5.193,48 15.983,49 14.66,50 0.877,51 4.301,52 4.987,53 33.301,54 3,55 3.95,56 1.488,57 4.192,58 6.862,59 9.639,60 28.158,61 -2.81,62 -2.72,63 1.522,64 352.61,65 1.19,66 0.429,67 130,68 3,69 0.041,70 50.112,71 0.937,72 0.326,73 3.046,74 0.751,75 6,76 3.17,77 2.521,78 2.521,79 1.575,80 11.759,81 2.904,82 8.431,83 109.885,84 7.099,85 0.5,86 4.132,87 4.256,88 3.659,89 3.59,90 5.186,91 3.582,92 4.697,93 4.884,94 4,95 3.974,96 5.678,97 3.946,98 4.926,99 5.146,100 4.046,101 4.1,102 5.913,103 4.037,104 4.974,105 5.219,106 3.975,107 4.095,108 5.92,109 4.003,110 4.941,111 3.849,112 4.02,113 5.841,114 3.923,115 4.815,116 5.04,117 3.875,118 3.968,119 5.791,120 3.898,121 4.808,122 5.027,123 3.849,124 3.999,125 5.828,126 3.919,127 4.872,128 5.126,129 3.824,130 4.026,131 5.759,132 3.909,133 0.072,134 0.84,135 12.657,136 4.978,137 10.984,138 6.84,139 0.327,140 1.31,141 24.359,142 7.871,143 26.081,144 11.432,145 0.614,146 1.534,147 31.859,148 9.723,149 47.174,150 14.352,151 1.544,152 33.601,153 10.549,154 48.34,155 0.587,156 1.436,157 9.609,158 51.041,159 0.474,160 1.322,161 28.675,162 8.83,163 41.936,164 13.045,165 0.483,166 1.35,167 52.185,168 13.001,169 1.378,170 30.339,171 10.508,172 41.542,173 15.436,174 11,175 44,176 0.26,177 0.593,178 0.759,179 0.807,180 0.829,181 0.829,182 3.408,183 0.944,184 37.5,185 5}
{0 CHEMBL466280,1 2.852,2 1,3 20.008,4 7.194,5 5.648,6 2,7 6,8 81.06,9 5,10 2050,11 21.988,12 21.988,13 21.988,14 21.988,15 21.988,16 12.541,17 22.633,18 15.093,19 0.531,20 9.439,21 1.899,22 1,24 1.185,25 2.97,26 11.193,27 16.5,29 1.314,31 2,32 0.807,33 8.346,34 2.846,35 0.125,36 8.679,37 221.259,38 16,39 -0.127,40 0.081,41 -4.14,42 2.912,43 8.477,44 39.5,47 5.363,48 15.956,49 13.989,50 0.806,51 4.474,52 5.162,53 39.507,54 6,55 3.942,56 1.542,57 4.674,58 6.862,59 10.523,60 33.4,61 -4.09,62 -3.86,63 1.589,64 390.18,65 1.162,66 1.454,67 127,68 3,69 0.055,70 101.693,71 1.018,72 0.396,73 3.111,74 1.002,75 10,76 3.322,77 3.022,78 3.022,79 1.868,80 11.971,81 4.311,82 18.586,83 115.937,84 8.268,85 0.432,86 4.192,87 4.312,88 3.811,89 3.628,90 5.404,91 3.658,92 4.766,93 4.938,94 4.282,95 4.049,96 6.339,97 4.057,98 5.043,99 5.265,100 4.319,101 4.199,102 6.252,103 4.176,104 5.158,105 5.401,106 4.359,107 4.191,108 6.404,109 4.18,110 5.125,111 4.336,112 4.123,113 6.716,114 4.11,115 4.979,116 5.204,117 4.095,118 4.116,119 6.103,120 4.076,121 5.047,122 5.259,123 4.129,124 4.168,125 6.183,126 4.116,127 5.127,128 5.375,129 4.183,130 4.123,131 6.295,132 4.09,133 0.313,134 1.108,135 10.323,136 4.94,137 48.013,138 5.962,139 1.144,140 2.035,141 22.499,142 8.658,143 192.846,144 11.309,145 1.056,146 1.925,147 32.676,148 10.162,149 126.087,150 15.088,151 2.081,152 39.51,153 10.556,154 158.409,155 2.097,156 1.909,157 9.176,158 307.54,159 1.119,160 1.737,161 31.251,162 9.103,163 140.344,164 12.754,165 1.213,166 1.875,167 167.394,168 14.508,169 2.056,170 41.053,171 11.944,172 224.898,173 15.788,174 74,175 55,176 0.305,177 0.64,178 0.809,179 0.854,180 0.865,181 0.865,182 3.561,183 0.886,184 36.2,185 6}
{0 CHEMBL466481,1 3.017,2 1,3 16.46,4 5.889,5 5.648,7 4,8 60.13,9 5,10 1079,11 18.361,12 18.361,13 18.361,14 18.361,15 18.361,16 10.912,17 18.772,18 11.982,19 -0.046,20 7.773,21 1.899,22 1,24 1.185,25 2.769,26 9.793,27 15,28 1,29 0.483,31 2,32 1.14,33 7.63,34 2.13,35 0.154,36 7.698,37 159.481,38 16,39 -0.147,40 0.063,41 -3.56,42 2.334,43 5.446,44 33.25,47 5.176,48 15.487,49 13.811,50 0.799,51 4.259,52 4.945,53 31.749,54 6,55 3.94,56 1.501,57 4.302,58 6.862,59 9.237,60 31.635,61 -3.54,62 -3.37,63 1.534,64 322.43,65 1.231,66 0.382,67 99,68 3,69 0.042,70 101.693,71 1.064,72 0.356,73 2.914,74 0.251,75 10,76 3.17,77 2.7,78 2.7,79 1.538,80 10.259,81 3.336,82 11.129,83 103.576,84 7.067,85 0.533,86 4.056,87 4.197,88 3.579,89 3.537,90 5.117,91 3.52,92 4.617,93 4.816,94 3.948,95 3.958,96 5.597,97 3.904,98 4.924,99 5.176,100 3.994,101 4.088,102 5.849,103 4.002,104 4.992,105 5.271,106 3.942,107 4.068,108 5.898,109 3.971,110 4.909,111 3.856,112 4.028,113 5.79,114 3.933,115 4.856,116 5.094,117 3.88,118 4.032,119 5.812,120 3.951,121 4.912,122 5.15,123 3.791,124 4.039,125 5.888,126 3.921,127 4.888,128 5.182,129 3.668,130 3.909,131 5.73,132 3.771,133 0.064,134 0.838,135 11.729,136 4.31,137 12.197,138 6.344,139 0.221,140 1.325,141 21.795,142 7.64,143 24.606,144 11.53,145 0.374,146 1.569,147 31.54,148 9.336,149 45.376,150 14.968,151 1.571,152 34.802,153 9.193,154 53.244,155 0.453,156 1.495,157 8.317,158 46.317,159 0.346,160 1.463,161 29.38,162 8.074,163 43.621,164 13.041,165 0.533,166 1.439,167 60.873,168 14.611,169 1.303,170 31.9,171 9.392,172 47.983,173 14.941,174 11,175 42,176 0.257,177 0.606,178 0.788,179 0.833,180 0.846,181 0.846,182 3.34,183 0.959,184 36.5,185 5}
{0 CHEMBL551052,3 22.002,4 7.806,5 5.529,6 2,7 5,9 1,10 2484,11 23.637,12 23.637,13 23.637,14 23.637,15 23.637,16 14.454,17 24.561,18 15.527,19 1,20 12.225,21 4.815,22 0.83,23 4.03,24 1.168,25 3.042,26 10.082,27 16.5,29 0.508,33 7.667,34 2.167,35 0.112,36 9.271,37 195.061,38 12,39 -0.065,40 0.068,41 -2.43,42 1.2,43 1.439,44 40.25,45 2,46 2,47 5.395,48 17.853,49 17.99,50 0.97,51 4.317,52 5.004,53 40.482,54 1,55 3.91,56 1.446,57 3.978,59 11.225,60 33.795,61 -2.46,62 -2.41,63 1.501,64 432.56,65 1.184,66 0.753,67 180,69 0.032,70 33.571,71 0.884,72 0.273,73 3.203,74 0.946,75 4,76 3.17,77 2.583,78 2.583,79 1.597,80 13.206,81 1.448,82 2.098,83 127.861,84 7.1,85 0.324,86 4.288,87 4.413,88 3.815,89 3.713,90 5.329,91 3.713,92 4.868,93 5.065,94 4.123,95 4.073,96 5.86,97 4.054,98 5.066,99 5.292,100 4.216,101 4.235,102 6.069,103 4.181,104 5.099,105 5.329,106 4.136,107 4.257,108 6.054,109 4.175,110 5.142,111 4.131,112 4.222,113 6.119,114 4.14,115 5.073,116 5.322,117 4.144,118 4.166,119 6.075,120 4.102,121 4.998,122 5.211,123 4.165,124 4.177,125 6.028,126 4.132,127 5.079,128 5.293,129 4.16,130 4.205,131 6.17,132 4.153,133 0.05,134 0.98,135 14.805,136 5.528,137 8.665,138 7.913,139 0.578,140 1.49,141 29.847,142 8.318,143 36.857,144 12.596,145 0.787,146 1.755,147 36.936,148 10.9,149 55.288,150 16.438,151 1.79,152 37.688,153 11.815,154 50.42,155 0.687,156 1.783,157 11.43,158 69.139,159 0.852,160 1.673,161 38.023,162 10.394,163 65.243,164 16.372,165 0.483,166 1.654,167 47.54,168 15.305,169 1.717,170 37.461,171 10.316,172 77.203,173 15.676,174 18,175 49,176 0.255,177 0.568,178 0.761,179 0.851,180 0.864,181 0.864,182 3.561,183 0.95,184 36.4,185 5.699}
{0 CHEMBL567470,3 21.036,4 7.472,5 5.531,6 2,7 5,9 1,10 2198,11 22.67,12 22.67,13 22.67,14 22.67,15 22.67,16 13.609,17 23.351,18 15.02,19 1,20 11.06,21 4.815,22 0.83,23 1.708,24 1.168,25 2.995,26 10.929,27 16.5,29 0.607,33 7.737,34 2.237,35 0.115,36 9.177,37 190.538,38 12,39 -0.064,40 0.073,41 -3.16,42 1.93,43 3.727,44 38.75,45 1,46 1,47 5.31,48 17.657,49 16.876,50 0.825,51 4.317,52 5.004,53 37.171,54 3,55 3.914,56 1.461,57 4.123,59 11.079,60 34.234,61 -3.15,62 -3.03,63 1.527,64 421.56,65 1.174,66 0.678,67 171,69 0.033,70 33.571,71 0.98,72 0.32,73 3.138,74 0.956,75 10,76 3.17,77 2.65,78 2.65,79 1.575,80 12.545,81 2.243,82 5.032,83 123.449,84 7.087,85 0.333,86 4.254,87 4.376,88 3.772,89 3.715,90 5.312,91 3.705,92 4.829,93 5.014,94 4.113,95 4.101,96 5.84,97 4.067,98 5.097,99 5.325,100 4.22,101 4.255,102 6.119,103 4.195,104 5.122,105 5.361,106 4.132,107 4.243,108 6.105,109 4.166,110 5.072,111 4.155,112 4.206,113 6.112,114 4.139,115 5.044,116 5.272,117 4.17,118 4.183,119 6.106,120 4.135,121 5.015,122 5.214,123 4.167,124 4.226,125 6.089,126 4.171,127 5.102,128 5.319,129 4.115,130 4.249,131 6.199,132 4.161,133 0.057,134 0.942,135 14.297,136 5.699,137 12.386,138 7.858,139 0.425,140 1.482,141 27.929,142 9.162,143 35.434,144 13.223,145 0.681,146 1.801,147 38.046,148 11.633,149 65.401,150 17.319,151 1.797,152 39.396,153 11.766,154 68.725,155 0.602,156 1.744,157 10.971,158 68.695,159 0.726,160 1.692,161 36.369,162 10.149,163 69.969,164 15.482,165 0.547,166 1.696,167 63.383,168 15.783,169 1.766,170 37.892,171 12,172 89.851,173 17.709,174 25,175 49,176 0.253,177 0.602,178 0.804,179 0.869,180 0.869,181 0.869,182 3.532,183 0.96,184 37.5,185 5.699}
{0 CHEMBL591501,3 21.983,4 7.833,5 5.553,6 2,7 5,10 2388,11 23.593,12 23.593,13 23.593,14 23.593,15 23.593,16 14.274,17 24.441,18 15.495,19 1,20 11.715,21 4.815,22 0.83,23 5.96,24 1.166,25 3.044,26 11.334,27 16.5,29 0.503,33 7.725,34 2.225,35 0.112,36 9.26,37 196.316,38 12,39 -0.12,40 0.076,41 -2.43,42 1.2,43 1.439,44 40.25,45 1,46 1,47 5.463,48 18.736,49 18.94,50 0.944,51 4.331,52 5.017,53 43.883,54 1,55 3.914,56 1.456,57 4.106,59 11.218,60 36.319,61 -2.46,62 -2.41,63 1.532,64 432.56,65 1.184,66 0.783,67 186,69 0.031,70 33.571,71 0.867,72 0.299,73 3.205,74 0.956,75 5,76 3.17,77 2.683,78 2.683,79 1.597,80 13.029,81 1.576,82 2.483,83 128.404,84 7.1,85 0.324,86 4.288,87 4.413,88 3.811,89 3.715,90 5.345,91 3.714,92 4.865,93 5.065,94 4.135,95 4.088,96 5.861,97 4.068,98 5.083,99 5.308,100 4.261,101 4.276,102 6.087,103 4.224,104 5.149,105 5.374,106 4.228,107 4.322,108 6.123,109 4.248,110 5.22,111 4.229,112 4.299,113 6.246,114 4.229,115 5.139,116 5.376,117 4.204,118 4.25,119 6.167,120 4.184,121 5.072,122 5.294,123 4.175,124 4.25,125 6.059,126 4.181,127 5.14,128 5.374,129 4.129,130 4.222,131 6.179,132 4.148,133 0.06,134 0.986,135 14.821,136 5.508,137 10.871,138 7.916,139 0.555,140 1.523,141 29.571,142 8.212,143 37.357,144 12.665,145 0.757,146 1.826,147 37.253,148 11.178,149 53.3,150 16.925,151 1.904,152 39.402,153 12.453,154 51.682,155 0.794,156 1.91,157 12.242,158 86.054,159 0.915,160 1.793,161 40.415,162 11.434,163 76.981,164 17.539,165 0.467,166 1.772,167 48.782,168 17.208,169 1.749,170 40.39,171 11.306,172 80.914,173 17.281,174 33,175 50,176 0.255,177 0.571,178 0.769,179 0.864,180 0.864,181 0.864,182 3.561,183 0.95,184 36.4,185 5.699}
{0 CHEMBL63,3 12.894,4 4.472,5 5.261,7 3,8 108.808,9 1,10 496,11 13.748,12 13.748,13 13.748,14 13.748,15 13.748,16 8.164,17 14.063,18 9.381,19 -0.863,20 6.044,22 1,24 1.211,25 2.578,26 7.247,27 8.5,29 0.276,33 7.642,34 2.142,35 0.179,36 5.866,37 115.021,38 6,39 -0.133,40 0.067,41 -3.32,42 2.094,43 4.384,44 21.25,47 4.688,48 10.899,49 10.347,50 0.704,51 3.773,52 4.454,53 20.347,54 6,55 3.911,56 1.475,57 4.133,58 7.111,59 7.113,60 20.38,61 -3.31,62 -3.17,63 1.506,64 264.19,65 1.063,66 0.241,67 56,68 2,69 0.039,71 1.048,72 0.319,73 2.803,74 -0.849,75 6,76 2.322,77 1.982,78 1.982,79 1.431,80 7.9,81 2.35,82 5.522,83 76.163,84 6.717,85 0.273,86 3.804,87 3.919,88 3.287,89 3.31,90 4.776,91 3.279,92 4.41,93 4.585,94 3.634,95 3.726,96 5.335,97 3.665,98 4.681,99 4.906,100 3.579,101 3.789,102 5.579,103 3.682,104 4.553,105 4.789,106 3.478,107 3.69,108 5.443,109 3.589,110 4.482,111 3.496,112 3.694,113 5.391,114 3.599,115 4.529,116 4.742,117 3.456,118 3.642,119 5.448,120 3.549,121 4.461,122 4.679,123 3.258,124 3.588,125 5.351,126 3.447,127 4.516,128 4.813,129 2.957,130 3.54,131 5.204,132 3.304,133 0.015,134 0.558,135 9.63,136 4.203,137 5.606,138 5.561,139 0.183,140 0.921,141 18.682,142 7.156,143 19.521,144 9.716,145 0.386,146 1.071,147 25.486,148 8.765,149 36.972,150 12.183,151 0.946,152 22.335,153 7.857,154 34.743,155 0.183,156 0.936,157 7.492,158 24.521,159 0.329,160 0.913,161 21.966,162 7.454,163 32.154,164 10.181,165 0.398,166 0.864,167 36.085,168 10.039,169 0.915,170 21.227,171 7.713,172 28.274,173 11.641,174 6,175 30,176 0.258,177 0.565,178 0.773,179 0.838,180 0.838,181 0.838,182 3.058,183 1.005,184 39,185 4.796}
{0 CHEMBL932,3 24.097,4 8.444,5 5.695,6 4,7 4,10 2336,11 25.223,12 25.223,13 25.223,14 25.223,15 25.223,16 15.689,17 26.03,18 17.249,19 1.077,20 13.61,21 8.454,22 0.5,23 8.077,24 1.394,25 3.174,26 14.262,27 12,29 0.626,31 2,32 1.306,33 7.75,34 2.25,35 0.119,36 10.509,37 206.074,38 11,39 -0.083,40 0.068,41 -3.26,42 2.029,43 4.117,44 37.5,47 5.613,48 21.219,49 21.814,50 0.955,51 4.311,52 4.997,53 52.653,55 3.92,56 1.461,57 4.078,59 12.826,60 61.8,61 -3.25,62 -3.11,63 1.525,64 462.48,65 1.042,66 1.36,67 138,69 0.029,70 67.142,71 1.05,72 0.278,73 3.259,74 0.983,75 6,76 2.7,77 2.561,78 2.561,79 1.578,80 9.889,81 2.484,82 6.169,83 142.778,84 6.641,85 0.282,86 4.424,87 4.564,88 3.874,89 3.8,90 5.428,91 3.79,92 5.024,93 5.244,94 4.202,95 4.213,96 5.958,97 4.162,98 5.312,99 5.579,100 4.347,101 4.4,102 6.185,103 4.319,104 5.328,105 5.589,106 4.434,107 4.441,108 6.233,109 4.385,110 5.384,111 4.582,112 4.519,113 6.505,114 4.483,115 5.436,116 5.648,117 4.618,118 4.601,119 6.504,120 4.569,121 5.553,122 5.779,123 4.631,124 4.701,125 6.506,126 4.647,127 5.722,128 5.965,129 4.601,130 4.831,131 6.658,132 4.709,133 0.103,134 1.12,135 18.884,136 6.051,137 15.408,138 9.52,139 0.603,140 1.732,141 35.971,142 9.959,143 44.089,144 16.048,145 0.879,146 2.095,147 48.334,148 12.599,149 64.243,150 21.458,151 2.215,152 48.812,153 11.974,154 49.11,155 1.268,156 2.369,157 13.196,158 120.583,159 0.901,160 2.602,161 54.757,162 12.837,163 101.757,164 22.762,165 1.112,166 2.859,167 69.403,168 25.329,169 3.039,170 72.5,171 20.853,172 111.138,173 33.579,174 53,175 52,176 0.247,177 0.418,178 0.575,179 0.631,180 0.631,181 0.631,182 3.617,183 1.018,184 31.6,185 5.1}
