"molecule_id","Si","N.","pXC50"
{1 81.268,2 5.6,3 7.91}
{0 CHEMBL226533,1 84.012,2 10.8,3 8.5}
{0 CHEMBL226583,1 84.85,2 8,3 8.35}
{0 CHEMBL226620,1 82.268,2 5.5,3 8.15}
{0 CHEMBL226673,1 84.683,2 5.3,3 8.28}
{0 CHEMBL227254,1 89.926,2 11.4,3 8.33}
{0 CHEMBL227276,1 85.85,2 7.9,3 8.35}
{0 CHEMBL227330,1 89.099,2 5.1,3 8.37}
{0 CHEMBL227333,1 86.603,2 5.2,3 8.32}
{0 CHEMBL387948,1 85.683,2 5.3,3 8.2}
{0 CHEMBL389639,1 85.603,2 5.3,3 8.24}
{0 CHEMBL389711,1 89.182,2 6.3,3 8.62}
{0 CHEMBL390276,1 81.853,2 5.5,3 7.58}
{0 CHEMBL390519,1 78.976,2 4.3,3 7.94}
