"molecule_id","Sp","MW","Se","nCL","Sv","nAT","pXC50"
{1 54.716,2 614.75,3 80.298,5 52.562,6 80,7 6.071}
{0 CHEMBL1256274,1 60.978,2 664.87,3 93.043,5 57.91,6 93,7 5.208}
{0 CHEMBL1256276,1 56.694,2 634.79,3 85.392,5 54.33,6 85,7 6.097}
{0 CHEMBL1256277,1 56.023,2 612.78,3 81.854,5 53.374,6 82,7 6.62}
{0 CHEMBL1256278,1 53.785,2 578.77,3 80.738,5 50.9,6 81,7 6.244}
{0 CHEMBL1256279,1 60.023,2 660.82,3 85.854,5 57.374,6 86,7 7.046}
{0 CHEMBL1256280,1 51.171,2 582.71,3 77.625,5 49.276,6 77,7 6.071}
{0 CHEMBL1258992,1 39.301,2 423.55,3 56.68,5 37.289,6 57,7 6.652}
{0 CHEMBL1259009,1 41.614,2 436.6,3 60.338,5 39.122,6 61,7 5.388}
{0 CHEMBL1259010,1 42.37,2 435.61,3 61.12,5 39.627,6 62,7 6.453}
{0 CHEMBL1259027,1 42.37,2 435.61,3 61.12,5 39.627,6 62,7 7.252}
{0 CHEMBL1259028,1 41.466,2 456.02,3 58.56,4 1,5 38.928,6 59,7 6.914}
{0 CHEMBL1259030,1 41.017,2 492.43,3 57.327,4 2,5 38.944,6 57,7 4.108}
{0 CHEMBL1259046,1 41.466,2 456.02,3 58.56,4 1,5 38.928,6 59,7 7.31}
{0 CHEMBL1259047,1 47.654,2 477.7,3 69.77,5 44.208,6 71,7 7.143}
{0 CHEMBL1259066,1 41.404,2 474.01,3 59.072,4 1,5 39.311,6 59,7 7.137}
{0 CHEMBL1259067,1 42.517,2 465.59,3 61.891,5 40.53,6 62,7 6.523}
{0 CHEMBL1259068,1 40.546,2 439.57,3 58.749,5 38.484,6 59,7 5.48}
{0 CHEMBL1259069,1 44.069,2 467.63,3 64.516,5 41.537,6 65,7 5.836}
{0 CHEMBL1259084,1 41.063,2 437.58,3 59.563,5 38.815,6 60,7 6.365}
{0 CHEMBL1259085,1 47.074,2 633.39,3 65.905,4 2,5 44.601,6 65,7 4.699}
{0 CHEMBL1259102,1 41.586,2 429.61,3 62.33,5 38.869,6 63,7 4.678}
{0 CHEMBL1259103,1 39.301,2 423.55,3 56.68,5 37.289,6 57,7 5.706}
{0 CHEMBL1259104,1 43.165,2 497.03,3 61.105,4 1,5 41.137,6 61,7 7.62}
{0 CHEMBL1259114,1 40.142,2 445.64,3 62.061,5 37.486,6 62,7 6.523}
{0 CHEMBL1259117,1 39.063,2 413.56,3 57.563,5 36.815,6 58,7 4.036}
{0 CHEMBL1259118,1 48.313,2 564.56,3 70.181,4 2,5 45.567,6 70,7 6.449}
{0 CHEMBL1259119,1 41.648,2 522.9,3 60.738,4 3,5 39.341,6 60,7 6.943}
{0 CHEMBL1259130,1 33.211,2 371.48,3 52.334,5 31.718,6 52,7 5.921}
{0 CHEMBL1259131,1 50.262,2 550.71,3 74.97,5 47.847,6 75,7 5.301}
{0 CHEMBL1259134,1 41.245,2 504.46,3 61.742,4 2,5 39.228,6 61,7 6.081}
{0 CHEMBL1259135,1 45.921,2 532.64,3 69.785,5 44.372,6 69,7 7.678}
{0 CHEMBL1259149,1 50.074,2 578.59,3 73.065,4 2,5 47.094,6 73,7 7.377}
{0 CHEMBL1259160,1 43.415,2 528.48,3 60.792,5 40.841,6 61,7 4.569}
{0 CHEMBL1259162,1 50.074,2 578.59,3 73.065,4 2,5 47.094,6 73,7 7.149}
{0 CHEMBL1259175,1 50.148,2 568.75,3 73.163,5 47.507,6 73,7 5.36}
{0 CHEMBL1259176,1 43.824,2 463.62,3 63.447,5 41.342,6 64,7 4.495}
{0 CHEMBL1259178,1 48.881,2 501.74,3 75.185,5 45.492,6 76,7 8.427}
{0 CHEMBL1259179,1 48.33,2 502.72,3 74.41,5 45.186,6 75,7 8.398}
{0 CHEMBL1259193,1 42.921,2 484.03,3 60.887,4 1,5 40.643,6 61,7 4.638}
{0 CHEMBL1259194,1 50.074,2 578.59,3 73.065,4 2,5 47.094,6 73,7 9}
{0 CHEMBL1259195,1 40.79,2 488.46,3 60.414,4 2,5 38.513,6 60,7 7.303}
{0 CHEMBL1259207,1 42.551,2 502.49,3 63.298,4 2,5 40.04,6 63,7 8.151}
{0 CHEMBL1259208,1 49.461,2 597.56,3 72.803,4 2,5 47.17,6 72,7 8.699}
{0 CHEMBL1259218,1 49.262,2 538.7,3 73.97,5 46.847,6 74,7 7.167}
{0 CHEMBL1259219,1 39.756,2 439.55,3 58.007,5 38.003,6 58,7 4.131}
{0 CHEMBL1259221,1 42,2 503.47,3 62.523,4 2,5 39.733,6 62,7 7.454}
{0 CHEMBL1259222,1 49.773,2 595.58,3 73.611,4 2,5 47.303,6 73,7 8.228}
{0 CHEMBL1259234,1 50.569,2 536.73,3 75.527,5 47.659,6 76,7 6.399}
{0 CHEMBL1259235,1 40.307,2 438.57,3 58.781,5 38.31,6 59,7 6.286}
{0 CHEMBL1259238,1 44.313,2 516.52,3 66.181,4 2,5 41.567,6 66,7 7.665}
{0 CHEMBL142600,1 26.381,2 241.41,3 39.821,5 23.816,6 41,7 5.37}
{0 CHEMBL1684277,1 41.091,2 471.47,3 59.869,4 2,5 38.304,6 60,7 8}
{0 CHEMBL1684278,1 42.853,2 485.5,3 62.752,4 2,5 39.831,6 63,7 7.602}
{0 CHEMBL1684280,1 37.568,2 443.41,3 54.102,4 2,5 35.25,6 54,7 6.851}
{0 CHEMBL1684281,1 40.336,2 472.46,3 59.087,4 2,5 37.798,6 59,7 7.796}
{0 CHEMBL1684282,1 38.58,2 461.44,3 57.305,4 2,5 36.293,6 57,7 7.745}
{0 CHEMBL1684283,1 38.58,2 461.44,3 57.305,4 2,5 36.293,6 57,7 7.469}
{0 CHEMBL1684284,1 38.58,2 461.44,3 57.305,4 2,5 36.293,6 57,7 7.658}
{0 CHEMBL1684285,1 38.58,2 461.44,3 57.305,4 2,5 36.293,6 57,7 6.889}
{0 CHEMBL1684286,1 38.58,2 461.44,3 57.305,4 2,5 36.293,6 57,7 6.81}
{0 CHEMBL1684287,1 37.824,2 462.43,3 56.523,4 2,5 35.788,6 56,7 7.377}
{0 CHEMBL1684288,1 37.824,2 462.43,3 56.523,4 2,5 35.788,6 56,7 7.149}
{0 CHEMBL1684289,1 37.068,2 463.42,3 55.742,4 2,5 35.282,6 55,7 7.523}
{0 CHEMBL1684290,1 37.273,2 463.41,3 55.749,4 2,5 35.481,6 55,7 7.194}
{0 CHEMBL1684291,1 40.336,2 472.46,3 59.087,4 2,5 37.798,6 59,7 7.678}
{0 CHEMBL1684292,1 39.58,2 473.45,3 58.305,4 2,5 37.293,6 58,7 7.032}
{0 CHEMBL1684293,1 39.58,2 473.45,3 58.305,4 2,5 37.293,6 58,7 7.357}
{0 CHEMBL1684294,1 39.58,2 473.45,3 58.305,4 2,5 37.293,6 58,7 7.62}
{0 CHEMBL1684295,1 44.04,2 540.5,3 64.734,4 2,5 42.029,6 64,7 7.921}
{0 CHEMBL1684296,1 44.04,2 540.5,3 64.734,4 2,5 42.029,6 64,7 7.745}
{0 CHEMBL1684297,1 44.04,2 540.5,3 64.734,4 2,5 42.029,6 64,7 8.77}
{0 CHEMBL1684298,1 43.284,2 541.49,3 63.952,4 2,5 41.524,6 63,7 7.886}
{0 CHEMBL1684299,1 43.284,2 541.49,3 63.952,4 2,5 41.524,6 63,7 7.721}
{0 CHEMBL1684300,1 48.801,2 590.56,3 70.618,4 2,5 46.556,6 70,7 8.432}
{0 CHEMBL1684301,1 49.114,2 617.61,3 72.131,4 2,5 46.678,6 71,7 8.638}
{0 CHEMBL1684302,1 46.705,2 583.52,3 69.171,4 2,5 44.964,6 68,7 7.77}
{0 CHEMBL1684303,1 48.807,2 631.59,3 71.574,4 2,5 46.866,6 70,7 8.071}
{0 CHEMBL1684304,1 51.086,2 596.62,3 76.269,4 2,5 48.136,6 76,7 7.824}
{0 CHEMBL1684305,1 48.87,2 566.59,3 72.058,4 2,5 45.895,6 72,7 8.328}
{0 CHEMBL1684306,1 47.108,2 552.56,3 69.174,4 2,5 44.368,6 69,7 8.907}
{0 CHEMBL1684307,1 47.108,2 552.56,3 69.174,4 2,5 44.368,6 69,7 7.495}
{0 CHEMBL1684308,1 45.347,2 538.53,3 66.291,4 2,5 42.841,6 66,7 7.569}
{0 CHEMBL1684309,1 51.324,2 597.62,3 76.236,4 2,5 48.31,6 76,7 7.602}
{0 CHEMBL1684310,1 53.296,2 623.64,3 79.378,4 2,5 50.357,6 79,7 8.155}
{0 CHEMBL1938484,1 37.313,2 405.55,3 56.883,5 35.331,6 57,7 5.818}
{0 CHEMBL1938486,1 37.25,2 423.54,3 57.396,5 35.715,6 57,7 6.504}
{0 CHEMBL1938487,1 37.25,2 423.54,3 57.396,5 35.715,6 57,7 5.06}
{0 CHEMBL1938488,1 38.171,2 439.99,3 57.207,4 1,5 36.159,6 57,7 6.821}
{0 CHEMBL1938489,1 41.694,2 468.05,3 62.974,4 1,5 39.212,6 63,7 7.678}
{0 CHEMBL1938490,1 38.046,2 475.97,3 58.232,4 1,5 36.925,6 57,7 6.983}
{0 CHEMBL1938491,1 37.983,2 493.96,3 58.745,4 1,5 37.309,6 57,7 6.078}
{0 CHEMBL1938492,1 43.932,2 502.06,3 64.091,4 1,5 41.686,6 64,7 7.824}
{0 CHEMBL1938493,1 44.79,2 536.5,3 64.414,4 2,5 42.513,6 64,7 7.481}
{0 CHEMBL1938494,1 42.319,2 468.61,3 62.985,5 40.353,6 63,7 7.585}
{0 CHEMBL1938495,1 42.256,2 486.6,3 63.498,5 40.736,6 63,7 8.119}
{0 CHEMBL1938496,1 43.176,2 503.05,3 63.309,4 1,5 41.18,6 63,7 8.569}
{0 CHEMBL1938497,1 43.176,2 503.05,3 63.309,4 1,5 41.18,6 63,7 7.432}
{0 CHEMBL1938498,1 43.176,2 503.05,3 63.309,4 1,5 41.18,6 63,7 7.194}
{0 CHEMBL1938499,1 44.938,2 517.08,3 66.192,4 1,5 42.707,6 66,7 7.959}
{0 CHEMBL1938500,1 44.938,2 517.08,3 66.192,4 1,5 42.707,6 66,7 7.585}
{0 CHEMBL1938501,1 36.461,2 392.96,3 52.458,4 1,5 33.907,6 53,7 7.824}
{0 CHEMBL1938502,1 44.205,2 478.08,3 65.538,4 1,5 41.223,6 66,7 9.046}
{0 CHEMBL1938503,1 39.983,2 421.02,3 58.225,4 1,5 36.96,6 59,7 7.276}
{0 CHEMBL1938504,1 47.728,2 506.14,3 71.305,4 1,5 44.277,6 72,7 7.77}
{0 CHEMBL1938505,1 36.336,2 428.94,3 53.483,4 1,5 34.673,6 53,7 7.678}
{0 CHEMBL1938506,1 44.08,2 514.06,3 66.563,4 1,5 41.99,6 66,7 8.42}
{0 CHEMBL1938507,1 36.273,2 446.93,3 53.996,4 1,5 35.057,6 53,7 7.495}
{0 CHEMBL1938508,1 44.017,2 532.05,3 67.076,4 1,5 42.373,6 66,7 8.77}
{0 CHEMBL1938509,1 41.466,2 456.02,3 58.56,4 1,5 38.928,6 59,7 8.602}
{0 CHEMBL1938510,1 49.211,2 541.14,3 71.64,4 1,5 46.245,6 72,7 9.222}
{0 CHEMBL1938511,1 43.228,2 470.05,3 61.443,4 1,5 40.455,6 62,7 6.606}
{0 CHEMBL1938512,1 44.989,2 484.08,3 64.327,4 1,5 41.982,6 65,7 5.578}
{0 CHEMBL1938513,1 34.364,2 336.52,3 52.018,5 31.606,6 53,7 7.097}
{0 CHEMBL1938514,1 35.222,2 370.96,3 52.341,4 1,5 32.434,6 53,7 8}
{0 CHEMBL1938515,1 35.716,2 415.41,3 52.247,5 32.631,6 53,7 8.076}
{0 CHEMBL1938516,1 38.745,2 399.02,3 58.109,4 1,5 35.487,6 59,7 8.824}
{0 CHEMBL1938517,1 38.745,2 399.02,3 58.109,4 1,5 35.487,6 59,7 6.701}
{0 CHEMBL1938518,1 35.097,2 406.94,3 53.367,4 1,5 33.2,6 53,7 6.796}
{0 CHEMBL1938519,1 35.035,2 424.93,3 53.88,4 1,5 33.583,6 53,7 7.155}
{0 CHEMBL1938520,1 41.841,2 467.47,3 59.549,4 2,5 38.788,6 60,7 8.284}
{0 CHEMBL1938521,1 39.307,2 417.57,3 58.632,5 37.011,6 59,7 8.42}
{0 CHEMBL1938522,1 40.228,2 434.02,3 58.443,4 1,5 37.455,6 59,7 9.523}
{0 CHEMBL1938523,1 41.989,2 448.05,3 61.327,4 1,5 38.982,6 62,7 8.921}
{0 CHEMBL1938524,1 41.989,2 448.05,3 61.327,4 1,5 38.982,6 62,7 8.678}
{0 CHEMBL1938525,1 43.75,2 462.08,3 64.21,4 1,5 40.508,6 65,7 7.102}
{0 CHEMBL1938526,1 40.233,2 437.03,3 59.545,4 1,5 37.476,6 60,7 7.959}
{0 CHEMBL1938527,1 41.887,2 412.62,3 61.785,5 38.66,6 63,7 8.553}
{0 CHEMBL1949687,1 35.171,2 403.96,3 54.207,4 1,5 33.159,6 54,7 8.222}
{0 CHEMBL1950307,1 38.267,2 463.42,3 56.498,4 2,5 36.16,6 56,7 8}
{0 CHEMBL1950308,1 37.512,2 464.41,3 55.716,4 2,5 35.655,6 55,7 7.42}
{0 CHEMBL1950309,1 37.512,2 464.41,3 55.716,4 2,5 35.655,6 55,7 8.301}
{0 CHEMBL1950310,1 37.512,2 464.41,3 55.716,4 2,5 35.655,6 55,7 7.796}
{0 CHEMBL1950311,1 38.33,2 445.43,3 55.985,4 2,5 35.777,6 56,7 7.854}
{0 CHEMBL1950312,1 40.091,2 459.46,3 58.869,4 2,5 37.304,6 59,7 6.742}
{0 CHEMBL1950313,1 36.568,2 431.4,3 53.102,4 2,5 34.25,6 53,7 6.37}
{0 CHEMBL1950314,1 44.25,2 543.5,3 65.843,4 2,5 42.249,6 65,7 8.252}
{0 CHEMBL1950439,1 43.029,2 575.46,3 67.272,4 2,5 42.125,6 65,7 9.131}
{0 CHEMBL1950440,1 43.58,2 574.48,3 68.047,4 2,5 42.431,6 66,7 9.77}
{0 CHEMBL1950441,1 39.273,2 487.43,3 57.749,4 2,5 37.481,6 57,7 8.18}
{0 CHEMBL1950442,1 31.529,2 402.31,3 44.669,4 2,5 30.164,6 44,7 6.991}
{0 CHEMBL1950443,1 45.858,2 524.54,3 66.854,4 2,5 42.852,6 67,7 9}
{0 CHEMBL1950444,1 47.313,2 552.55,3 69.181,4 2,5 44.567,6 69,7 9.432}
{0 CHEMBL1950445,1 39.568,2 467.43,3 56.102,4 2,5 37.25,6 56,7 8.585}
{0 CHEMBL1950446,1 37.807,2 453.4,3 53.218,4 2,5 35.723,6 53,7 6.796}
{0 CHEMBL1950447,1 36.801,2 438.38,3 51.116,4 2,5 34.702,6 51,7 6.001}
{0 CHEMBL1950448,1 36.046,2 439.37,3 50.334,4 2,5 34.197,6 50,7 7.319}
{0 CHEMBL1950449,1 37.256,2 454.38,3 52.443,4 2,5 35.417,6 52,7 6.648}
{0 CHEMBL1950450,1 38.563,2 452.41,3 54,4 2,5 36.229,6 54,7 6.427}
{0 CHEMBL1950451,1 36.801,2 438.38,3 51.116,4 2,5 34.702,6 51,7 7.222}
{0 CHEMBL1950452,1 35.04,2 424.35,3 48.233,4 2,5 33.175,6 48,7 5}
{0 CHEMBL1950453,1 38.591,2 459.4,3 52.007,4 2,5 36.482,6 52,7 5}
{0 CHEMBL1950454,1 38.04,2 460.38,3 51.233,4 2,5 36.175,6 51,7 5}
{0 CHEMBL1950455,1 51.284,2 593.6,3 75.174,4 2,5 48.314,6 75,7 5}
{0 CHEMBL1950782,1 42.358,2 500.46,3 57.992,4 2,5 40.03,6 58,7 5.083}
{0 CHEMBL1950783,1 42.358,2 500.46,3 57.992,4 2,5 40.03,6 58,7 5.817}
{0 CHEMBL1950784,1 42.358,2 500.46,3 57.992,4 2,5 40.03,6 58,7 6.082}
{0 CHEMBL1950785,1 38.625,2 522.39,3 56.858,4 2,5 37.895,6 55,7 5.441}
{0 CHEMBL1950786,1 46.37,2 607.51,3 69.938,4 2,5 45.211,6 68,7 5.593}
{0 CHEMBL1950787,1 44.137,2 523.52,3 64.181,4 2,5 41.621,6 64,7 5.411}
{0 CHEMBL1950788,1 43.131,2 508.5,3 62.08,4 2,5 40.6,6 62,7 6.24}
{0 CHEMBL1950789,1 35.841,2 439.38,3 50.327,4 2,5 33.998,6 50,7 5.462}
{0 CHEMBL1950790,1 37.603,2 453.41,3 53.211,4 2,5 35.525,6 53,7 5.64}
{0 CHEMBL1950791,1 38.125,2 445.44,3 55.978,4 2,5 35.578,6 56,7 5}
{0 CHEMBL1950895,1 36.364,2 431.41,3 53.094,4 2,5 34.051,6 53,7 6.076}
{0 CHEMBL1950896,1 34.603,2 417.38,3 50.211,4 2,5 32.525,6 50,7 6.293}
{0 CHEMBL1950897,1 43.699,2 561.48,3 64.4,4 2,5 42.255,6 63,7 6.27}
{0 CHEMBL1950898,1 43.699,2 561.48,3 64.4,4 2,5 42.255,6 63,7 6.721}
{0 CHEMBL1950899,1 43.699,2 561.48,3 64.4,4 2,5 42.255,6 63,7 7.041}
{0 CHEMBL1950900,1 43.699,2 561.48,3 64.4,4 2,5 42.255,6 63,7 7.553}
{0 CHEMBL1950901,1 42.125,2 493.48,3 59.978,4 2,5 39.578,6 60,7 6.478}
{0 CHEMBL1950902,1 40.818,2 495.45,3 58.422,4 2,5 38.766,6 58,7 6.544}
{0 CHEMBL1950903,1 40.818,2 495.45,3 58.422,4 2,5 38.766,6 58,7 6.618}
{0 CHEMBL1950904,1 43.034,2 525.48,3 62.632,4 2,5 41.008,6 62,7 7.678}
{0 CHEMBL1950905,1 41.375,2 497.48,3 60.298,4 2,5 39.094,6 60,7 7.495}
{0 CHEMBL1950906,1 39.608,2 480.44,3 56.312,4 2,5 37.546,6 56,7 7.041}
{0 CHEMBL1950907,1 40.818,2 495.45,3 58.422,4 2,5 38.766,6 58,7 7.237}
{0 CHEMBL1950908,1 40.341,2 475.47,3 60.189,4 2,5 37.82,6 60,7 7.377}
{0 CHEMBL1950909,1 54.421,2 625.66,3 77.832,4 2,5 51.201,6 78,7 7.294}
{0 CHEMBL1950910,1 35.376,2 354.55,3 55.221,5 32.649,6 56,7 6.886}
{0 CHEMBL1950911,1 35.376,2 354.55,3 55.221,5 32.649,6 56,7 5.101}
{0 CHEMBL1950912,1 34.472,2 374.96,3 52.661,4 1,5 31.95,6 53,7 6.599}
{0 CHEMBL1950913,1 33.552,2 358.51,3 52.85,5 31.505,6 53,7 5.769}
{0 CHEMBL1950914,1 32.711,2 360.93,3 49.778,4 1,5 30.423,6 50,7 5.256}
{0 CHEMBL1950915,1 36.233,2 388.99,3 55.545,4 1,5 33.476,6 56,7 5.99}
{0 CHEMBL1950916,1 36.233,2 388.99,3 55.545,4 1,5 33.476,6 56,7 7.285}
{0 CHEMBL1950917,1 48.552,2 525.15,3 70.305,4 1,5 45.331,6 71,7 7.357}
{0 CHEMBL1950918,1 38.017,2 407,3 55.334,4 1,5 35.235,6 56,7 7.284}
{0 CHEMBL1950919,1 35.819,2 424.02,3 54.283,4 1,5 33.346,6 54,7 7.824}
{0 CHEMBL1951455,1 39.767,2 464.41,3 55.007,4 2,5 37.428,6 55,7 7.638}
{0 CHEMBL1951456,1 39.341,2 508.39,3 57.429,4 2,5 38.104,6 56,7 8.721}
{0 CHEMBL1951457,1 36.495,2 443.37,3 51.411,4 2,5 34.591,6 51,7 7.959}
{0 CHEMBL1951458,1 38.131,2 493.38,3 55.32,4 2,5 36.884,6 54,7 8.495}
{0 CHEMBL1951459,1 43.847,2 494.5,3 62.651,4 2,5 40.809,6 63,7 7.387}
{0 CHEMBL1951460,1 43.33,2 505.48,3 60.985,4 2,5 40.777,6 61,7 6.324}
{0 CHEMBL1951461,1 38.585,2 509.38,3 56.647,4 2,5 37.599,6 55,7 8.495}
{0 CHEMBL1951462,1 38.585,2 509.38,3 56.647,4 2,5 37.599,6 55,7 8.469}
{0 CHEMBL1951463,1 38.585,2 509.38,3 56.647,4 2,5 37.599,6 55,7 8.347}
{0 CHEMBL1951464,1 38.585,2 509.38,3 56.647,4 2,5 37.599,6 55,7 6.772}
{0 CHEMBL1951465,1 37.728,2 474.94,3 56.323,4 1,5 36.771,6 55,7 9.357}
{0 CHEMBL1951466,1 37.728,2 474.94,3 56.323,4 1,5 36.771,6 55,7 7.268}
{0 CHEMBL1951467,1 36.87,2 440.5,3 56,5 35.944,6 55,7 7.076}
{0 CHEMBL1951468,1 38.182,2 490.94,3 57.651,4 1,5 37.486,6 56,7 8.921}
{0 CHEMBL1951469,1 36.972,2 475.93,3 55.541,4 1,5 36.266,6 54,7 7.807}
{0 CHEMBL1951470,1 36.642,2 423.95,3 53.189,4 1,5 34.785,6 53,7 9}
{0 CHEMBL1951471,1 39.381,2 559.42,3 57.494,4 2,5 38.689,6 55,7 8.796}
{0 CHEMBL1951472,1 35.887,2 424.94,3 52.407,4 1,5 34.279,6 52,7 8.022}
{0 CHEMBL1951473,1 37.5,2 458.39,3 53.512,4 2,5 35.612,6 53,7 8.721}
{0 CHEMBL1951474,1 38.256,2 457.4,3 54.294,4 2,5 36.117,6 54,7 9.137}
{0 CHEMBL1951475,1 38.773,2 455.41,3 55.109,4 2,5 36.449,6 55,7 6.699}
{0 CHEMBL1951476,1 40.495,2 503.99,3 61.309,4 1,5 39.32,6 60,7 9.31}
{0 CHEMBL1951477,1 42.296,2 483.47,3 60.876,4 2,5 39.503,6 61,7 8.081}
{0 CHEMBL1951478,1 37.767,2 525.97,3 56.389,4 1,5 37.356,6 54,7 9.108}
{0 CHEMBL2022781,1 46.415,2 543.67,3 73.025,5 44.784,6 72,7 8}
{0 CHEMBL2022782,1 46.54,2 507.69,3 71.999,5 44.017,6 72,7 6.089}
{0 CHEMBL2022783,1 48.302,2 521.72,3 74.883,5 45.544,6 75,7 5.71}
{0 CHEMBL2022784,1 39.018,2 431.59,3 62.232,5 36.964,6 62,7 5.513}
{0 CHEMBL2022785,1 49.915,2 555.17,3 75.988,4 1,5 46.877,6 76,7 9}
{0 CHEMBL2022786,1 49.915,2 555.17,3 75.988,4 1,5 46.877,6 76,7 9.155}
{0 CHEMBL2022787,1 49.915,2 555.17,3 75.988,4 1,5 46.877,6 76,7 9.699}
{0 CHEMBL2022788,1 48.154,2 541.14,3 73.105,4 1,5 45.35,6 73,7 8.174}
{0 CHEMBL2022789,1 48.154,2 541.14,3 73.105,4 1,5 45.35,6 73,7 9}
{0 CHEMBL2022790,1 47.966,2 595.11,3 74.643,4 1,5 46.5,6 73,7 7}
{0 CHEMBL2022791,1 44.881,2 529.09,3 68.658,4 1,5 42.812,6 68,7 8}
{0 CHEMBL2022792,1 49.012,2 575.58,3 73.429,4 2,5 46.178,6 73,7 6.07}
{0 CHEMBL2022793,1 49.012,2 575.58,3 73.429,4 2,5 46.178,6 73,7 9.699}
{0 CHEMBL2022794,1 49.012,2 575.58,3 73.429,4 2,5 46.178,6 73,7 9.398}
{0 CHEMBL2023202,1 49.012,2 575.58,3 73.429,4 2,5 46.178,6 73,7 9.523}
{0 CHEMBL2023203,1 47.234,2 524.69,3 73.294,5 44.906,6 73,7 7.921}
{0 CHEMBL2023204,1 47.171,2 542.68,3 73.807,5 45.289,6 73,7 6.502}
{0 CHEMBL2023205,1 47.171,2 542.68,3 73.807,5 45.289,6 73,7 8.553}
{0 CHEMBL2023206,1 47.171,2 542.68,3 73.807,5 45.289,6 73,7 8.367}
{0 CHEMBL2023207,1 48.091,2 559.13,3 73.618,4 1,5 45.733,6 73,7 9.301}
{0 CHEMBL2023208,1 48.091,2 559.13,3 73.618,4 1,5 45.733,6 73,7 8.854}
{0 CHEMBL2023209,1 48.091,2 559.13,3 73.618,4 1,5 45.733,6 73,7 9.301}
{0 CHEMBL2023210,1 46.33,2 545.1,3 70.734,4 1,5 44.207,6 70,7 9.699}
{0 CHEMBL2023211,1 48.091,2 559.13,3 73.618,4 1,5 45.733,6 73,7 9}
{0 CHEMBL2023212,1 48.091,2 559.13,3 73.618,4 1,5 45.733,6 73,7 8.108}
{0 CHEMBL2023213,1 40.353,2 486.01,3 60.789,4 1,5 38.737,6 60,7 7.481}
{0 CHEMBL2023214,1 41.211,2 520.45,3 61.112,4 2,5 39.565,6 60,7 7.959}
{0 CHEMBL2023215,1 41.211,2 520.45,3 61.112,4 2,5 39.565,6 60,7 7.854}
{0 CHEMBL2024193,1 40.29,2 504,3 61.301,4 1,5 39.121,6 60,7 7.886}
{0 CHEMBL2024194,1 41.966,2 519.46,3 61.894,4 2,5 40.07,6 61,7 8.252}
{0 CHEMBL2024195,1 41.966,2 519.46,3 61.894,4 2,5 40.07,6 61,7 8.31}
{0 CHEMBL2024196,1 41.046,2 503.01,3 62.083,4 1,5 39.626,6 61,7 7.959}
{0 CHEMBL2024197,1 39.284,2 488.98,3 59.2,4 1,5 38.099,6 58,7 8.602}
{0 CHEMBL2024198,1 49.16,2 556.16,3 75.207,4 1,5 46.371,6 75,7 9.046}
{0 CHEMBL2024199,1 49.16,2 556.16,3 75.207,4 1,5 46.371,6 75,7 8.31}
{0 CHEMBL2024200,1 49.16,2 556.16,3 75.207,4 1,5 46.371,6 75,7 7.137}
{0 CHEMBL2024201,1 47.398,2 542.13,3 72.323,4 1,5 44.845,6 72,7 7.959}
{0 CHEMBL2031367,1 47.398,2 542.13,3 72.323,4 1,5 44.845,6 72,7 8.194}
{0 CHEMBL2031579,1 47.398,2 542.13,3 72.323,4 1,5 44.845,6 72,7 7.903}
{0 CHEMBL2031580,1 49.16,2 556.16,3 75.207,4 1,5 46.371,6 75,7 8.959}
{0 CHEMBL2031581,1 45.637,2 528.1,3 69.439,4 1,5 43.318,6 69,7 7.302}
{0 CHEMBL2031582,1 48.256,2 576.57,3 72.647,4 2,5 45.672,6 72,7 8.796}
{0 CHEMBL2031583,1 44.733,2 548.51,3 66.88,4 2,5 42.619,6 66,7 8.222}
{0 CHEMBL2031584,1 47.336,2 560.12,3 72.836,4 1,5 45.228,6 72,7 8.699}
{0 CHEMBL2031585,1 43.813,2 532.06,3 67.069,4 1,5 42.174,6 66,7 7.917}
{0 CHEMBL2031586,1 43.813,2 532.06,3 67.069,4 1,5 42.174,6 66,7 7.354}
{0 CHEMBL2031587,1 42.052,2 518.03,3 64.185,4 1,5 40.648,6 63,7 7.553}
{0 CHEMBL2031588,1 49.012,2 575.58,3 73.429,4 2,5 46.178,6 73,7 9.046}
{0 CHEMBL2031589,1 45.489,2 547.52,3 67.661,4 2,5 43.124,6 67,7 8.569}
{0 CHEMBL2031590,1 48.091,2 559.13,3 73.618,4 1,5 45.733,6 73,7 9.046}
{0 CHEMBL2031591,1 44.569,2 531.07,3 67.85,4 1,5 42.68,6 67,7 8.194}
{0 CHEMBL2031592,1 44.569,2 531.07,3 67.85,4 1,5 42.68,6 67,7 6.197}
{0 CHEMBL2031593,1 44.569,2 531.07,3 67.85,4 1,5 42.68,6 67,7 7.607}
{0 CHEMBL2031594,1 44.569,2 531.07,3 67.85,4 1,5 42.68,6 67,7 7.745}
{0 CHEMBL2031595,1 46.33,2 545.1,3 70.734,4 1,5 44.207,6 70,7 9.398}
{0 CHEMBL2031596,1 46.33,2 545.1,3 70.734,4 1,5 44.207,6 70,7 9.097}
{0 CHEMBL2031597,1 42.807,2 517.04,3 64.967,4 1,5 41.153,6 64,7 8.699}
{0 CHEMBL2031598,1 42.807,2 517.04,3 64.967,4 1,5 41.153,6 64,7 8.244}
{0 CHEMBL21273,1 20.858,2 189.33,3 32.054,5 18.763,6 33,7 4.699}
{0 CHEMBL21277,1 21.273,2 227.3,3 30.8,5 20.092,6 31,7 5.31}
{0 CHEMBL21326,1 26.381,2 241.41,3 39.821,5 23.816,6 41,7 6.119}
{0 CHEMBL21342,1 21.336,2 209.31,3 30.287,5 19.709,6 31,7 5.409}
{0 CHEMBL21464,1 25.858,2 249.38,3 37.054,5 23.763,6 38,7 5.638}
{0 CHEMBL21465,1 21.336,2 209.31,3 30.287,5 19.709,6 31,7 5.721}
{0 CHEMBL21640,1 23.097,2 223.34,3 33.171,5 21.236,6 34,7 6}
{0 CHEMBL21672,1 19.574,2 195.28,3 27.403,5 18.182,6 28,7 4.523}
{0 CHEMBL21805,1 24.858,2 237.37,3 36.054,5 22.763,6 37,7 5.42}
{0 CHEMBL21911,1 23.62,2 215.37,3 35.938,5 21.289,6 37,7 4.921}
{0 CHEMBL21920,1 22.193,2 243.75,3 30.611,4 1,5 20.537,6 31,7 5.276}
{0 CHEMBL21969,1 23.097,2 223.34,3 33.171,5 21.236,6 34,7 5.022}
{0 CHEMBL22005,1 28.143,2 255.44,3 42.705,5 25.343,6 44,7 5.208}
{0 CHEMBL22009,1 17.336,2 161.27,3 26.287,5 15.709,6 27,7 4.523}
{0 CHEMBL22053,1 15.574,2 147.24,3 23.403,5 14.182,6 24,7 4.523}
{0 CHEMBL22078,1 24.858,2 237.37,3 36.054,5 22.763,6 37,7 4.523}
{0 CHEMBL275528,1 27.143,2 243.43,3 41.705,5 24.343,6 43,7 7.041}
{0 CHEMBL277493,1 17.336,2 161.27,3 26.287,5 15.709,6 27,7 4.523}
{0 CHEMBL278781,1 23.097,2 223.34,3 33.171,5 21.236,6 34,7 4.62}
{0 CHEMBL279013,1 26.097,2 259.37,3 36.171,5 24.236,6 37,7 4.523}
{0 CHEMBL279676,1 26.029,2 249.46,3 38.898,5 23.003,6 40,7 7.699}
{0 CHEMBL282475,1 19.097,2 175.3,3 29.171,5 17.236,6 30,7 4.959}
{0 CHEMBL283105,1 21.336,2 209.31,3 30.287,5 19.709,6 31,7 5.357}
{0 CHEMBL283130,1 21.336,2 209.31,3 30.287,5 19.709,6 31,7 4.523}
{0 CHEMBL283744,1 21.858,2 201.34,3 33.054,5 19.763,6 34,7 5.268}
{0 CHEMBL284237,1 22.336,2 221.32,3 31.287,5 20.709,6 32,7 8.276}
{0 CHEMBL305881,1 31.267,2 317.47,3 49.571,5 29.014,6 50,7 4}
{0 CHEMBL41541,1 30.035,2 300.51,3 44,5 27.025,6 45,7 7.796}
{0 CHEMBL61946,1 29.813,2 289.46,3 47.243,5 27.299,6 48,7 7.585}
{0 CHEMBL73234,1 33.79,2 333.52,3 54.338,5 31.068,6 55,7 7.495}
{0 CHEMBL7393,1 23.074,2 219.36,3 36.265,5 21.004,6 37,7 4}
{0 CHEMBL76578,1 32.211,2 359.47,3 51.334,5 30.718,6 51,7 4}
