"molecule_id","FCFP4_1024b1","FCFP4_1024b10","FCFP4_1024b100","FCFP4_1024b1000","FCFP4_1024b1001","FCFP4_1024b1002","FCFP4_1024b1003","FCFP4_1024b1004","FCFP4_1024b1005","FCFP4_1024b1006","FCFP4_1024b1007","FCFP4_1024b1008","FCFP4_1024b1009","FCFP4_1024b101","FCFP4_1024b1010","FCFP4_1024b1011","FCFP4_1024b1012","FCFP4_1024b1013","FCFP4_1024b1014","FCFP4_1024b1015","FCFP4_1024b1016","FCFP4_1024b1017","FCFP4_1024b1018","FCFP4_1024b1019","FCFP4_1024b102","FCFP4_1024b1020","FCFP4_1024b1021","FCFP4_1024b1022","FCFP4_1024b1023","FCFP4_1024b1024","FCFP4_1024b103","FCFP4_1024b104","FCFP4_1024b105","FCFP4_1024b106","FCFP4_1024b107","FCFP4_1024b108","FCFP4_1024b109","FCFP4_1024b11","FCFP4_1024b110","FCFP4_1024b111","FCFP4_1024b112","FCFP4_1024b113","FCFP4_1024b114","FCFP4_1024b115","FCFP4_1024b116","FCFP4_1024b117","FCFP4_1024b118","FCFP4_1024b119","FCFP4_1024b12","FCFP4_1024b120","FCFP4_1024b121","pXC50"
{1 1,26 1,52 8.3}
{0 CHEMBL313157,1 1,2 1,35 1,52 9.3}
{0 CHEMBL313775,1 1,2 1,35 1,36 1,52 10}
{0 CHEMBL314114,1 1,2 1,35 1,49 1,52 7.9}
{0 CHEMBL314880,1 1,2 1,35 1,52 10.699}
{0 CHEMBL315496,1 1,2 1,35 1,52 9.3}
{0 CHEMBL315785,1 1,2 1,35 1,52 9.2}
{0 CHEMBL326702,1 1,35 1,52 7.222}
{0 CHEMBL327168,1 1,2 1,35 1,52 9.5}
{0 CHEMBL327231,1 1,2 1,35 1,52 9.9}
{0 CHEMBL327232,1 1,2 1,35 1,52 8.699}
{0 CHEMBL327351,1 1,2 1,35 1,52 7.9}
{0 CHEMBL327872,1 1,2 1,24 1,35 1,52 9.1}
{0 CHEMBL328545,1 1,2 1,35 1,52 8.2}
{0 CHEMBL329160,1 1,2 1,35 1,52 8.801}
{0 CHEMBL329601,1 1,2 1,35 1,52 9.2}
{0 CHEMBL329773,1 1,2 1,35 1,52 9.1}
{0 CHEMBL330060,1 1,2 1,35 1,52 9}
{0 CHEMBL330579,1 1,2 1,35 1,52 10}
{0 CHEMBL419867,1 1,2 1,35 1,52 8.1}
{0 CHEMBL420060,1 1,2 1,52 8.4}
{0 CHEMBL420620,1 1,2 1,35 1,52 8.801}
{0 CHEMBL433348,1 1,2 1,35 1,52 9.3}
{0 CHEMBL597,1 1,52 8.2}
{0 CHEMBL611,1 1,26 1,52 7.7}
{0 CHEMBL836,1 1,24 1,52 9.801}
{0 CHEMBL88109,1 1,50 1,52 7.7}
{0 CHEMBL88160,1 1,2 1,35 1,52 9.3}
{0 CHEMBL88181,1 1,2 1,52 8.699}
{0 CHEMBL88211,1 1,2 1,35 1,52 9.4}
{0 CHEMBL88272,1 1,28 1,43 1,52 7.3}
{0 CHEMBL88435,1 1,2 1,35 1,52 8.699}
{0 CHEMBL88633,1 1,2 1,35 1,50 1,52 8.4}
{0 CHEMBL88664,1 1,2 1,35 1,52 8.3}
{0 CHEMBL88856,1 1,2 1,35 1,52 8.699}
{0 CHEMBL89030,1 1,2 1,35 1,52 9.3}
{0 CHEMBL89222,1 1,2 1,35 1,52 6.7}
{0 CHEMBL89397,1 1,2 1,35 1,52 8.9}
{0 CHEMBL89822,1 1,2 1,35 1,52 8.6}
{0 CHEMBL90022,1 1,2 1,35 1,52 8.801}
{0 CHEMBL90287,1 1,2 1,35 1,52 8.2}
{0 CHEMBL90746,1 1,2 1,35 1,52 8.9}
{0 CHEMBL90778,1 1,2 1,35 1,52 7.6}
{0 CHEMBL90810,1 1,2 1,21 1,35 1,52 8.9}
{0 CHEMBL90869,1 1,52 8.801}
{0 CHEMBL90874,1 1,2 1,35 1,52 8.9}
{0 CHEMBL90878,1 1,2 1,9 1,35 1,52 9.1}
{0 CHEMBL91036,1 1,2 1,35 1,52 8.5}
{0 CHEMBL91278,1 1,2 1,35 1,52 9.801}
{0 CHEMBL91326,1 1,2 1,35 1,52 8.5}
{0 CHEMBL91338,1 1,2 1,52 8.4}
{0 CHEMBL91400,1 1,2 1,35 1,52 9.699}
{0 CHEMBL91480,1 1,2 1,35 1,52 7.5}
{0 CHEMBL91547,1 1,2 1,35 1,52 9.2}
{0 CHEMBL91605,1 1,2 1,35 1,52 8.9}
{0 CHEMBL91785,1 1,2 1,35 1,52 9.1}
{0 CHEMBL91951,1 1,2 1,35 1,52 9.2}
{0 CHEMBL91989,1 1,2 1,35 1,52 8.4}
{0 CHEMBL92259,1 1,2 1,35 1,52 7.5}
{0 CHEMBL92901,1 1,2 1,35 1,52 8}
{0 CHEMBL93054,1 1,2 1,35 1,36 1,52 9}
{0 CHEMBL93736,1 1,2 1,35 1,52 7.9}
