"molecule_id","FCFP4_1024b1","FCFP4_1024b10","FCFP4_1024b100","FCFP4_1024b1000","FCFP4_1024b1001","FCFP4_1024b1002","FCFP4_1024b1003","FCFP4_1024b1004","FCFP4_1024b1005","FCFP4_1024b1006","FCFP4_1024b1007","FCFP4_1024b1008","FCFP4_1024b1009","FCFP4_1024b101","FCFP4_1024b1010","FCFP4_1024b1011","FCFP4_1024b1012","FCFP4_1024b1013","FCFP4_1024b1014","FCFP4_1024b1015","FCFP4_1024b1016","FCFP4_1024b1017","FCFP4_1024b1018","FCFP4_1024b1019","FCFP4_1024b102","FCFP4_1024b1020","FCFP4_1024b1021","FCFP4_1024b1022","FCFP4_1024b1023","FCFP4_1024b1024","FCFP4_1024b103","FCFP4_1024b104","FCFP4_1024b105","FCFP4_1024b106","FCFP4_1024b107","FCFP4_1024b108","FCFP4_1024b109","FCFP4_1024b11","FCFP4_1024b110","FCFP4_1024b111","FCFP4_1024b112","FCFP4_1024b113","FCFP4_1024b114","FCFP4_1024b115","FCFP4_1024b116","FCFP4_1024b117","FCFP4_1024b118","FCFP4_1024b119","FCFP4_1024b12","FCFP4_1024b120","FCFP4_1024b121","FCFP4_1024b122","FCFP4_1024b123","FCFP4_1024b124","FCFP4_1024b125","FCFP4_1024b126","FCFP4_1024b127","FCFP4_1024b128","FCFP4_1024b129","FCFP4_1024b13","FCFP4_1024b130","FCFP4_1024b131","FCFP4_1024b132","FCFP4_1024b133","FCFP4_1024b134","FCFP4_1024b135","FCFP4_1024b136","FCFP4_1024b137","FCFP4_1024b138","FCFP4_1024b139","FCFP4_1024b14","FCFP4_1024b140","FCFP4_1024b141","FCFP4_1024b142","FCFP4_1024b143","FCFP4_1024b144","FCFP4_1024b145","FCFP4_1024b146","FCFP4_1024b147","FCFP4_1024b148","FCFP4_1024b149","FCFP4_1024b15","FCFP4_1024b150","FCFP4_1024b151","FCFP4_1024b152","FCFP4_1024b153","FCFP4_1024b154","FCFP4_1024b155","FCFP4_1024b156","FCFP4_1024b157","FCFP4_1024b158","FCFP4_1024b159","FCFP4_1024b16","FCFP4_1024b160","FCFP4_1024b161","FCFP4_1024b162","FCFP4_1024b163","FCFP4_1024b164","FCFP4_1024b165","FCFP4_1024b166","FCFP4_1024b167","FCFP4_1024b168","pXC50"
{1 1,32 1,35 1,39 1,103 6}
{0 CHEMBL458145,1 1,32 1,35 1,39 1,103 6}
{0 CHEMBL470955,1 1,32 1,35 1,39 1,103 5}
{0 CHEMBL471979,1 1,32 1,35 1,39 1,58 1,103 6}
{0 CHEMBL472154,1 1,11 1,32 1,35 1,39 1,70 1,103 6}
{0 CHEMBL480113,1 1,32 1,35 1,39 1,103 5.31}
{0 CHEMBL480501,1 1,32 1,35 1,39 1,49 1,103 5.222}
{0 CHEMBL480692,1 1,32 1,35 1,39 1,103 5.495}
{0 CHEMBL499372,1 1,32 1,35 1,39 1,103 6}
{0 CHEMBL500315,1 1,32 1,35 1,39 1,103 5.699}
{0 CHEMBL511964,1 1,11 1,32 1,35 1,39 1,103 5.523}
{0 CHEMBL513067,1 1,32 1,35 1,39 1,58 1,103 5.602}
{0 CHEMBL518939,1 1,32 1,35 1,39 1,103 5.553}
