"molecule_id","AMW","C.","H.","MW","Me","Mi","Mp","Mv","N.","O.","RBF","RBN","SCBO","Se","Si","Sp","Sv","X.","nAB","nAT","nB","nBM","nBO","nBR","nBT","nC","nCL","nCsp","nCsp2","nCsp3","nDB","nF","nH","nHM","nHet","nI","nN","nO","nP","nS","nSK","nTB","nX","pXC50"
{1 7.659,2 38.8,3 45,4 612.69,5 1.023,6 1.129,7 0.637,8 0.623,9 2.5,10 13.8,11 0.108,12 9,13 58,14 81.825,15 90.358,16 50.955,17 49.861,19 12,20 80,22 17,23 47,25 83,26 31,29 19,30 12,31 5,33 36,35 13,37 2,38 11,41 44,44 7.432}
{0 CHEMBL565572,1 9.094,2 42.6,3 34,4 427.43,5 1.04,6 1.153,7 0.678,8 0.685,9 14.9,10 2.1,11 0.08,12 4,13 46,14 48.88,15 54.208,16 31.875,17 32.175,18 6.4,19 22,20 47,22 23,23 34,25 50,26 20,29 17,30 3,31 1,32 3,33 16,35 11,37 7,38 1,41 31,43 3,44 6.788}
{0 CHEMBL565741,1 7.965,2 44.4,3 40,4 358.44,5 1.005,6 1.126,7 0.69,8 0.667,9 13.3,10 2.2,11 0.083,12 4,13 42,14 45.24,15 50.69,16 31.057,17 30.004,19 22,20 45,22 23,23 30,25 48,26 20,29 17,30 3,31 1,33 18,35 7,37 6,38 1,41 27,44 6.593}
{0 CHEMBL565743,1 8.065,2 40.7,3 40.7,4 435.51,5 1.018,6 1.14,7 0.666,8 0.651,9 13,10 3.7,11 0.088,12 5,13 47,14 54.949,15 61.568,16 35.978,17 35.177,18 1.9,19 16,20 54,22 20,23 35,25 57,26 22,29 17,30 5,31 4,32 1,33 22,35 10,37 7,38 2,41 32,43 1,44 6.425}
{0 CHEMBL565750,1 7.732,2 40.7,3 42.6,4 417.52,5 1.008,6 1.134,7 0.667,8 0.644,9 13,10 3.7,11 0.088,12 5,13 46,14 54.436,15 61.229,16 36.04,17 34.794,19 16,20 54,22 20,23 34,25 57,26 22,29 17,30 5,31 4,33 23,35 9,37 7,38 2,41 31,44 7.292}
{0 CHEMBL565765,1 8.169,2 43.2,3 38.6,4 359.43,5 1.01,6 1.131,7 0.689,8 0.67,9 15.9,10 2.3,11 0.085,12 4,13 42,14 44.458,15 49.774,16 30.301,17 29.499,19 22,20 44,22 23,23 30,25 47,26 19,29 17,30 2,31 1,33 17,35 8,37 7,38 1,41 27,44 7.319}
{0 CHEMBL565776,1 7.912,2 41.2,3 41.2,4 403.49,5 1.011,6 1.134,7 0.672,8 0.652,9 13.7,10 3.9,11 0.093,12 5,13 45,14 51.552,15 57.813,16 34.279,17 33.267,19 22,20 51,22 23,23 33,25 54,26 21,29 17,30 4,31 1,33 21,35 9,37 7,38 2,41 30,44 6.932}
{0 CHEMBL565971,1 7.833,2 43.1,3 41.2,4 399.5,5 1.004,6 1.129,7 0.683,8 0.658,9 13.7,10 2,11 0.091,12 5,13 46,14 51.225,15 57.604,16 34.824,17 33.552,19 22,20 51,22 23,23 34,25 55,26 22,29 17,30 5,31 1,33 21,35 8,37 7,38 1,41 30,44 6.481}
{0 CHEMBL567804,1 7.648,2 39.7,3 43.1,4 443.57,5 1.005,6 1.138,7 0.665,8 0.64,9 15.5,10 1.7,11 0.081,12 5,13 49,14 58.312,15 66.016,16 38.597,17 37.122,19 22,20 58,22 23,23 37,25 62,26 23,29 16,30 7,31 1,33 25,35 10,37 9,38 1,41 33,44 6.613}
{0 CHEMBL568019,1 8.952,2 43.2,3 36.4,4 393.87,5 1.018,6 1.13,7 0.708,8 0.689,9 15.9,10 2.3,11 0.085,12 4,13 43,14 44.782,15 49.718,16 31.159,17 30.326,18 2.3,19 22,20 44,22 23,23 31,25 47,26 19,27 1,29 17,30 2,31 1,33 16,34 1,35 9,37 7,38 1,41 28,43 1,44 6.827}
{0 CHEMBL568020,1 7.946,2 42.6,3 40.4,4 373.46,5 1.007,6 1.132,7 0.682,8 0.66,9 14.9,10 2.1,11 0.08,12 4,13 43,14 47.342,15 53.189,16 32.063,17 31.025,19 22,20 47,22 23,23 31,25 50,26 20,29 17,30 3,31 1,33 19,35 8,37 7,38 1,41 28,44 7.357}
{0 CHEMBL568021,1 7.75,2 42,3 42,4 387.49,5 1.005,6 1.132,7 0.676,8 0.651,9 14,10 2,11 0.075,12 4,13 44,14 50.225,15 56.604,16 33.824,17 32.552,19 22,20 50,22 23,23 32,25 53,26 21,29 17,30 4,31 1,33 21,35 8,37 7,38 1,41 29,44 7.018}
{0 CHEMBL568222,1 8.751,2 40,3 38,4 437.53,5 1.021,6 1.131,7 0.692,8 0.673,9 14,10 6,11 0.094,12 5,13 48,14 51.073,15 56.528,16 34.62,17 33.642,19 22,20 50,22 25,23 34,25 53,26 20,29 17,30 3,31 3,33 19,34 1,35 11,37 7,38 3,40 1,41 31,44 6.364}
{0 CHEMBL571734,1 8.031,2 43.8,3 39.6,4 385.47,5 1.007,6 1.129,7 0.689,8 0.667,9 14.6,10 2.1,11 0.077,12 4,13 45,14 48.342,15 54.189,16 33.063,17 32.025,19 22,20 48,22 23,23 33,25 52,26 21,29 17,30 4,31 1,33 19,35 8,37 7,38 1,41 29,44 6.53}
{0 CHEMBL571959,1 7.576,2 41.5,3 43.4,4 401.52,5 1.002,6 1.132,7 0.671,8 0.643,9 13.2,10 1.9,11 0.089,12 5,13 45,14 53.109,15 60.019,16 35.586,17 34.079,19 22,20 53,22 23,23 33,25 56,26 22,29 17,30 5,31 1,33 23,35 8,37 7,38 1,41 30,44 5.719}
{0 CHEMBL576228,1 7.732,2 38.9,3 42.6,4 417.53,5 1.008,6 1.141,7 0.664,8 0.641,9 16.7,10 1.9,11 0.088,12 5,13 46,14 54.429,15 61.601,16 35.836,17 34.595,19 22,20 54,22 23,23 34,25 57,26 21,29 16,30 5,31 1,33 23,35 10,37 9,38 1,41 31,44 6.281}
{0 CHEMBL577041,1 7.912,2 39.2,3 41.2,4 403.5,5 1.011,6 1.141,7 0.668,8 0.648,9 17.6,10 2,11 0.093,12 5,13 45,14 51.545,15 58.185,16 34.074,17 33.068,19 22,20 51,22 23,23 33,25 54,26 20,29 16,30 4,31 1,33 21,35 10,37 9,38 1,41 30,44 6.863}
{0 CHEMBL577053,1 8.169,2 43.2,3 38.6,4 359.43,5 1.01,6 1.131,7 0.689,8 0.67,9 15.9,10 2.3,11 0.064,12 3,13 42,14 44.458,15 49.774,16 30.301,17 29.499,19 22,20 44,22 23,23 30,25 47,26 19,29 17,30 2,31 1,33 17,35 8,37 7,38 1,41 27,44 7.036}
{0 CHEMBL577238,1 7.896,2 39.6,3 41.5,4 418.51,5 1.012,6 1.138,7 0.666,8 0.647,9 15.1,10 3.8,11 0.107,12 6,13 46,14 53.654,15 60.312,16 35.284,17 34.288,19 22,20 53,22 23,23 34,25 56,26 21,29 16,30 5,31 1,33 22,35 10,37 8,38 2,41 31,44 5.86}
{0 CHEMBL577478,1 7.946,2 42.6,3 40.4,4 373.46,5 1.007,6 1.132,7 0.682,8 0.66,9 14.9,10 2.1,11 0.08,12 4,13 43,14 47.342,15 53.189,16 32.063,17 31.025,19 22,20 47,22 23,23 31,25 50,26 20,29 17,30 3,31 1,33 19,35 8,37 7,38 1,41 28,44 7.276}
{0 CHEMBL577909,1 7.732,2 38.9,3 42.6,4 417.53,5 1.008,6 1.141,7 0.664,8 0.641,9 16.7,10 1.9,11 0.088,12 5,13 46,14 54.429,15 61.601,16 35.836,17 34.595,19 22,20 54,22 23,23 34,25 57,26 21,29 16,30 5,31 1,33 23,35 10,37 9,38 1,41 31,44 6.947}
{0 CHEMBL577922,1 9.094,2 42.6,3 34,4 427.43,5 1.04,6 1.153,7 0.678,8 0.685,9 14.9,10 2.1,11 0.06,12 3,13 46,14 48.88,15 54.208,16 31.875,17 32.175,18 6.4,19 22,20 47,22 23,23 34,25 50,26 20,29 17,30 3,31 1,32 3,33 16,35 11,37 7,38 1,41 31,43 3,44 6.434}
{0 CHEMBL578120,1 7.75,2 42,3 42,4 387.49,5 1.005,6 1.132,7 0.676,8 0.651,9 14,10 2,11 0.094,12 5,13 44,14 50.225,15 56.604,16 33.824,17 32.552,19 22,20 50,22 23,23 32,25 53,26 21,29 17,30 4,31 1,33 21,35 8,37 7,38 1,41 29,44 6.452}
{0 CHEMBL578138,1 7.576,2 41.5,3 43.4,4 401.52,5 1.002,6 1.132,7 0.671,8 0.643,9 13.2,10 1.9,11 0.107,12 6,13 45,14 53.109,15 60.019,16 35.586,17 34.079,19 22,20 53,22 23,23 33,25 56,26 22,29 17,30 5,31 1,33 23,35 8,37 7,38 1,41 30,44 6.583}
{0 CHEMBL578149,1 7.571,2 40.4,3 43.9,4 431.55,5 1.006,6 1.134,7 0.663,8 0.637,9 12.3,10 3.5,11 0.1,12 6,13 47,14 57.32,15 64.644,16 37.801,17 36.321,19 16,20 57,22 20,23 35,25 60,26 23,29 17,30 6,31 4,33 25,35 9,37 7,38 2,41 32,44 7.013}
{0 CHEMBL578336,1 7.75,2 42,3 42,4 387.49,5 1.005,6 1.132,7 0.676,8 0.651,9 14,10 2,11 0.075,12 4,13 44,14 50.225,15 56.604,16 33.824,17 32.552,19 22,20 50,22 23,23 32,25 53,26 21,29 17,30 4,31 1,33 21,35 8,37 7,38 1,41 29,44 6.703}
{0 CHEMBL578361,1 8.382,2 41.9,3 37.2,4 360.42,5 1.016,6 1.136,7 0.687,8 0.674,9 18.6,10 2.3,11 0.087,12 4,13 42,14 43.676,15 48.857,16 29.546,17 28.993,19 22,20 43,22 23,23 30,25 46,26 18,29 16,30 2,31 1,33 16,35 9,37 8,38 1,41 27,44 7.125}
{0 CHEMBL578362,1 8.14,2 41.3,3 39.1,4 374.45,5 1.012,6 1.136,7 0.681,8 0.663,9 17.4,10 2.2,11 0.082,12 4,13 43,14 46.56,15 52.272,16 31.307,17 30.52,19 22,20 46,22 23,23 31,25 49,26 19,29 16,30 3,31 1,33 18,35 9,37 8,38 1,41 28,44 7.444}
{0 CHEMBL578991,1 8.829,2 42,3 36,4 441.46,5 1.035,6 1.152,7 0.673,8 0.674,9 14,10 2,11 0.075,12 4,13 47,14 51.763,15 57.623,16 33.637,17 33.702,18 6,19 22,20 50,22 23,23 35,25 53,26 21,29 17,30 4,31 1,32 3,33 18,35 11,37 7,38 1,41 32,43 3,44 6.666}
{0 CHEMBL578992,1 9.909,2 42,3 30,4 495.43,5 1.066,6 1.173,7 0.669,8 0.697,9 14,10 2,11 0.075,12 4,13 50,14 53.301,15 58.642,16 33.449,17 34.852,18 12,19 22,20 50,22 23,23 38,25 53,26 21,29 17,30 4,31 1,32 6,33 15,35 14,37 7,38 1,41 35,43 6,44 6.616}
{0 CHEMBL583049,1 8.578,2 43.2,3 36.4,4 377.42,5 1.022,6 1.139,7 0.687,8 0.679,9 15.9,10 2.3,11 0.085,12 4,13 43,14 44.971,15 50.113,16 30.239,17 29.882,18 2.3,19 22,20 44,22 23,23 31,25 47,26 19,29 17,30 2,31 1,32 1,33 16,35 9,37 7,38 1,41 28,43 1,44 7.252}
{0 CHEMBL583438,1 7.716,2 39.7,3 43.1,4 447.55,5 1.011,6 1.135,7 0.66,8 0.639,9 12.1,10 5.2,11 0.115,12 7,13 48,14 58.647,15 65.853,16 38.256,17 37.035,19 16,20 58,22 20,23 36,25 61,26 23,29 17,30 6,31 4,33 25,35 10,37 7,38 3,41 33,44 6.397}
{0 CHEMBL583440,1 8.287,2 40.7,3 38.9,4 447.5,5 1.022,6 1.134,7 0.67,8 0.661,9 13,10 7.4,11 0.105,12 6,13 49,14 55.207,15 61.232,16 36.188,17 35.697,19 16,20 54,22 21,23 36,25 57,26 22,29 18,30 4,31 5,33 21,35 11,37 7,38 4,41 33,44 7.009}
{0 CHEMBL583870,1 8.09,2 40,3 40,4 404.48,5 1.015,6 1.138,7 0.67,8 0.655,9 16,10 4,11 0.094,12 5,13 45,14 50.771,15 56.896,16 33.523,17 32.762,19 22,20 50,22 23,23 33,25 53,26 20,29 16,30 4,31 1,33 20,35 10,37 8,38 2,41 30,44 6.879}
{0 CHEMBL584265,1 8.349,2 42,3 38,4 417.47,5 1.02,6 1.132,7 0.679,8 0.669,9 14,10 6,11 0.113,12 6,13 47,14 50.996,15 56.608,16 33.972,17 33.455,19 22,20 50,22 24,23 34,25 53,26 21,29 18,30 3,31 2,33 19,35 10,37 7,38 3,41 31,44 7.284}
