{
  "data_set_description": {
    "collection_date": "November 2013",
    "creator": "Dr Jeremy Besnard, Dr Ivan Olier, Dr Noureddin Sadawi, Dr Larisa Soldatova, Dr Crina Grosan, Prof Ross King, Dr Richard Bickerton, Prof Andrew Hopkins and Dr Willem van Hoorn",
    "default_target_attribute": "pXC50",
    "description": "This dataset contains QSAR data (from ChEMBL version 17) showing activity values (unit is pseudo-pCI50) of several compounds on drug target ChEMBL_ID: CHEMBL3868 (TID: 10462), and it has 19 rows and 43 features (not including molecule IDs and class feature: molecule_id and pXC50). The features represent Basic Molecular Descriptors which were generated from SMILES strings.  Missing value imputation was applied to this dataset (By choosing the Median).",
    "description_version": "1",
    "file_id": "3304607",
    "format": "ARFF",
    "id": "26500",
    "licence": "Public",
    "md5_checksum": "60ad90c88a26e5d3de6a6328edeaaeb5",
    "minio_url": "https://data.openml.org/datasets/0002/26500/dataset_26500.pq",
    "name": "QSAR-DATASET-FOR-DRUG-TARGET-CHEMBL3868",
    "original_data_url": "https://www.ebi.ac.uk/chembl/target/inspect/CHEMBL3868",
    "parquet_url": "https://data.openml.org/datasets/0002/26500/dataset_26500.pq",
    "processing_date": "2018-10-03 23:58:56",
    "row_id_attribute": "molecule_id",
    "status": "deactivated",
    "tag": [
      "MetaQSAR",
      "study_13"
    ],
    "upload_date": "2016-07-14T19:23:39",
    "url": "https://api.openml.org/data/v1/download/3304607/QSAR-DATASET-FOR-DRUG-TARGET-CHEMBL3868.arff",
    "version": "7",
    "visibility": "public"
  }
}