{
  "data_features": {
    "feature": [
      {
        "data_type": "nominal",
        "index": "0",
        "is_ignore": "false",
        "is_row_identifier": "true",
        "is_target": "false",
        "name": "molecule_id",
        "nominal_value": [
          "CHEMBL1823557",
          "CHEMBL1823558",
          "CHEMBL1823559",
          "CHEMBL1823560",
          "CHEMBL1823561",
          "CHEMBL1823562",
          "CHEMBL1823563",
          "CHEMBL1823564",
          "CHEMBL1823565",
          "CHEMBL1823566",
          "CHEMBL1823567",
          "CHEMBL1823568",
          "CHEMBL1823569",
          "CHEMBL1823570",
          "CHEMBL1823571",
          "CHEMBL187999",
          "CHEMBL188158",
          "CHEMBL188524",
          "CHEMBL189015",
          "CHEMBL189859",
          "CHEMBL361695",
          "CHEMBL362122",
          "CHEMBL362504",
          "CHEMBL362505",
          "CHEMBL363381",
          "CHEMBL365468",
          "CHEMBL365959",
          "CHEMBL425726",
          "CHEMBL567136",
          "CHEMBL567563",
          "CHEMBL567564",
          "CHEMBL576247"
        ],
        "number_of_missing_values": "0"
      },
      {
        "data_type": "numeric",
        "index": "1",
        "is_ignore": "false",
        "is_row_identifier": "false",
        "is_target": "false",
        "name": "RBF",
        "number_of_missing_values": "0"
      },
      {
        "data_type": "numeric",
        "index": "2",
        "is_ignore": "false",
        "is_row_identifier": "false",
        "is_target": "false",
        "name": "AMW",
        "number_of_missing_values": "0"
      },
      {
        "data_type": "numeric",
        "index": "3",
        "is_ignore": "false",
        "is_row_identifier": "false",
        "is_target": "true",
        "name": "pXC50",
        "number_of_missing_values": "0"
      }
    ]
  }
}