{
  "data_features": {
    "feature": [
      {
        "data_type": "nominal",
        "index": "0",
        "is_ignore": "false",
        "is_row_identifier": "true",
        "is_target": "false",
        "name": "molecule_id",
        "nominal_value": [
          "CHEMBL1082723",
          "CHEMBL1121",
          "CHEMBL113718",
          "CHEMBL1161950",
          "CHEMBL1172244",
          "CHEMBL1172246",
          "CHEMBL1172247",
          "CHEMBL1172249",
          "CHEMBL1172250",
          "CHEMBL1172251",
          "CHEMBL1172252",
          "CHEMBL1172253",
          "CHEMBL1172428",
          "CHEMBL1172429",
          "CHEMBL1210154",
          "CHEMBL1269257",
          "CHEMBL1269258",
          "CHEMBL1269259",
          "CHEMBL1269260",
          "CHEMBL1269261",
          "CHEMBL1269262",
          "CHEMBL1269263",
          "CHEMBL1269264",
          "CHEMBL1270487",
          "CHEMBL132314",
          "CHEMBL147186",
          "CHEMBL150869",
          "CHEMBL151483",
          "CHEMBL153308",
          "CHEMBL1628610",
          "CHEMBL1628665",
          "CHEMBL168182",
          "CHEMBL1773877",
          "CHEMBL1773878",
          "CHEMBL1773879",
          "CHEMBL1773880",
          "CHEMBL1773881",
          "CHEMBL1773882",
          "CHEMBL1773883",
          "CHEMBL1773884",
          "CHEMBL1773885",
          "CHEMBL1773886",
          "CHEMBL1773887",
          "CHEMBL1773888",
          "CHEMBL1773889",
          "CHEMBL1773890",
          "CHEMBL1773891",
          "CHEMBL1773892",
          "CHEMBL1773893",
          "CHEMBL1773894",
          "CHEMBL1773895",
          "CHEMBL1773896",
          "CHEMBL1774032",
          "CHEMBL1774033",
          "CHEMBL1774034",
          "CHEMBL1774035",
          "CHEMBL1774036",
          "CHEMBL1774037",
          "CHEMBL1774038",
          "CHEMBL1774039",
          "CHEMBL1774040",
          "CHEMBL1774041",
          "CHEMBL1774042",
          "CHEMBL1774043",
          "CHEMBL1806526",
          "CHEMBL1806527",
          "CHEMBL1806528",
          "CHEMBL1806529",
          "CHEMBL1806530",
          "CHEMBL1806531",
          "CHEMBL1806532",
          "CHEMBL1806772",
          "CHEMBL1807149",
          "CHEMBL1807150",
          "CHEMBL1807151",
          "CHEMBL189634",
          "CHEMBL1933100",
          "CHEMBL1933103",
          "CHEMBL1933104",
          "CHEMBL2017690",
          "CHEMBL2017691",
          "CHEMBL2017692",
          "CHEMBL2017823",
          "CHEMBL2017824",
          "CHEMBL2017825",
          "CHEMBL2017826",
          "CHEMBL2017827",
          "CHEMBL2017828",
          "CHEMBL2017829",
          "CHEMBL2017830",
          "CHEMBL2017831",
          "CHEMBL2017832",
          "CHEMBL2017833",
          "CHEMBL2017834",
          "CHEMBL2017835",
          "CHEMBL202861",
          "CHEMBL204154",
          "CHEMBL205198",
          "CHEMBL205455",
          "CHEMBL205751",
          "CHEMBL205965",
          "CHEMBL206025",
          "CHEMBL206079",
          "CHEMBL206974",
          "CHEMBL208171",
          "CHEMBL208479",
          "CHEMBL214235",
          "CHEMBL214277",
          "CHEMBL214283",
          "CHEMBL214728",
          "CHEMBL214785",
          "CHEMBL214836",
          "CHEMBL215111",
          "CHEMBL215415",
          "CHEMBL215416",
          "CHEMBL216124",
          "CHEMBL216134",
          "CHEMBL216233",
          "CHEMBL216271",
          "CHEMBL216320",
          "CHEMBL216360",
          "CHEMBL216396",
          "CHEMBL216483",
          "CHEMBL216559",
          "CHEMBL216623",
          "CHEMBL216707",
          "CHEMBL217170",
          "CHEMBL217225",
          "CHEMBL217255",
          "CHEMBL217270",
          "CHEMBL217276",
          "CHEMBL217353",
          "CHEMBL217373",
          "CHEMBL217453",
          "CHEMBL217492",
          "CHEMBL217514",
          "CHEMBL217553",
          "CHEMBL217595",
          "CHEMBL217648",
          "CHEMBL217715",
          "CHEMBL217720",
          "CHEMBL217878",
          "CHEMBL217957",
          "CHEMBL218327",
          "CHEMBL218344",
          "CHEMBL218600",
          "CHEMBL218651",
          "CHEMBL218729",
          "CHEMBL218763",
          "CHEMBL226533",
          "CHEMBL226570",
          "CHEMBL226571",
          "CHEMBL226583",
          "CHEMBL226620",
          "CHEMBL226622",
          "CHEMBL226673",
          "CHEMBL226675",
          "CHEMBL226726",
          "CHEMBL226729",
          "CHEMBL227097",
          "CHEMBL227147",
          "CHEMBL227254",
          "CHEMBL227275",
          "CHEMBL227276",
          "CHEMBL227277",
          "CHEMBL227330",
          "CHEMBL227333",
          "CHEMBL227369",
          "CHEMBL2310857",
          "CHEMBL235970",
          "CHEMBL238269",
          "CHEMBL238270",
          "CHEMBL248552",
          "CHEMBL248752",
          "CHEMBL248754",
          "CHEMBL248948",
          "CHEMBL248949",
          "CHEMBL248950",
          "CHEMBL249151",
          "CHEMBL249153",
          "CHEMBL249361",
          "CHEMBL24938",
          "CHEMBL249560",
          "CHEMBL249763",
          "CHEMBL249973",
          "CHEMBL250576",
          "CHEMBL250699",
          "CHEMBL258486",
          "CHEMBL258782",
          "CHEMBL258863",
          "CHEMBL259224",
          "CHEMBL259276",
          "CHEMBL259390",
          "CHEMBL259557",
          "CHEMBL259751",
          "CHEMBL259762",
          "CHEMBL260394",
          "CHEMBL261636",
          "CHEMBL261682",
          "CHEMBL262172",
          "CHEMBL263475",
          "CHEMBL263742",
          "CHEMBL264150",
          "CHEMBL265595",
          "CHEMBL267290",
          "CHEMBL269016",
          "CHEMBL269355",
          "CHEMBL269790",
          "CHEMBL276645",
          "CHEMBL283117",
          "CHEMBL292097",
          "CHEMBL292492",
          "CHEMBL292493",
          "CHEMBL293456",
          "CHEMBL294329",
          "CHEMBL317181",
          "CHEMBL319438",
          "CHEMBL320141",
          "CHEMBL320624",
          "CHEMBL321761",
          "CHEMBL324547",
          "CHEMBL332261",
          "CHEMBL336381",
          "CHEMBL337366",
          "CHEMBL341403",
          "CHEMBL347329",
          "CHEMBL356191",
          "CHEMBL356386",
          "CHEMBL356898",
          "CHEMBL357502",
          "CHEMBL358646",
          "CHEMBL363916",
          "CHEMBL366344",
          "CHEMBL373703",
          "CHEMBL374325",
          "CHEMBL374388",
          "CHEMBL374389",
          "CHEMBL374390",
          "CHEMBL375360",
          "CHEMBL375412",
          "CHEMBL377157",
          "CHEMBL378388",
          "CHEMBL379405",
          "CHEMBL379902",
          "CHEMBL380355",
          "CHEMBL380907",
          "CHEMBL381805",
          "CHEMBL382051",
          "CHEMBL382349",
          "CHEMBL383458",
          "CHEMBL383919",
          "CHEMBL384097",
          "CHEMBL384109",
          "CHEMBL384126",
          "CHEMBL384387",
          "CHEMBL384457",
          "CHEMBL384573",
          "CHEMBL384707",
          "CHEMBL384854",
          "CHEMBL385153",
          "CHEMBL385285",
          "CHEMBL385552",
          "CHEMBL385734",
          "CHEMBL385952",
          "CHEMBL385963",
          "CHEMBL386143",
          "CHEMBL386186",
          "CHEMBL386209",
          "CHEMBL386212",
          "CHEMBL386436",
          "CHEMBL386438",
          "CHEMBL386581",
          "CHEMBL386590",
          "CHEMBL386598",
          "CHEMBL386976",
          "CHEMBL386985",
          "CHEMBL387018",
          "CHEMBL387194",
          "CHEMBL387285",
          "CHEMBL387287",
          "CHEMBL387299",
          "CHEMBL387413",
          "CHEMBL387948",
          "CHEMBL388068",
          "CHEMBL388143",
          "CHEMBL388144",
          "CHEMBL389019",
          "CHEMBL389639",
          "CHEMBL389711",
          "CHEMBL389713",
          "CHEMBL389933",
          "CHEMBL390275",
          "CHEMBL390276",
          "CHEMBL390519",
          "CHEMBL391357",
          "CHEMBL392426",
          "CHEMBL39263",
          "CHEMBL393637",
          "CHEMBL393638",
          "CHEMBL396601",
          "CHEMBL396602",
          "CHEMBL399055",
          "CHEMBL399056",
          "CHEMBL399915",
          "CHEMBL400670",
          "CHEMBL404967",
          "CHEMBL405192",
          "CHEMBL407057",
          "CHEMBL407198",
          "CHEMBL407340",
          "CHEMBL408083",
          "CHEMBL408452",
          "CHEMBL408832",
          "CHEMBL408915",
          "CHEMBL409479",
          "CHEMBL410114",
          "CHEMBL410138",
          "CHEMBL410511",
          "CHEMBL410708",
          "CHEMBL410905",
          "CHEMBL411069",
          "CHEMBL411201",
          "CHEMBL412282",
          "CHEMBL412331",
          "CHEMBL413644",
          "CHEMBL414087",
          "CHEMBL421575",
          "CHEMBL425638",
          "CHEMBL426524",
          "CHEMBL428647",
          "CHEMBL430298",
          "CHEMBL432256",
          "CHEMBL435143",
          "CHEMBL437736",
          "CHEMBL437908",
          "CHEMBL438739",
          "CHEMBL438843",
          "CHEMBL438984",
          "CHEMBL446324",
          "CHEMBL446502",
          "CHEMBL448118",
          "CHEMBL448221",
          "CHEMBL448597",
          "CHEMBL449681",
          "CHEMBL449725",
          "CHEMBL450105",
          "CHEMBL450443",
          "CHEMBL451342",
          "CHEMBL451644",
          "CHEMBL453083",
          "CHEMBL455742",
          "CHEMBL468372",
          "CHEMBL473457",
          "CHEMBL473663",
          "CHEMBL473664",
          "CHEMBL473865",
          "CHEMBL474067",
          "CHEMBL475226",
          "CHEMBL475679",
          "CHEMBL476095",
          "CHEMBL476297",
          "CHEMBL476519",
          "CHEMBL476520",
          "CHEMBL476530",
          "CHEMBL476531",
          "CHEMBL476725",
          "CHEMBL476739",
          "CHEMBL476747",
          "CHEMBL477784",
          "CHEMBL477996",
          "CHEMBL478397",
          "CHEMBL478398",
          "CHEMBL478604",
          "CHEMBL478630",
          "CHEMBL479030",
          "CHEMBL479046",
          "CHEMBL479063",
          "CHEMBL479256",
          "CHEMBL498942",
          "CHEMBL498958",
          "CHEMBL502924",
          "CHEMBL502974",
          "CHEMBL503107",
          "CHEMBL503331",
          "CHEMBL504024",
          "CHEMBL504114",
          "CHEMBL504406",
          "CHEMBL504707",
          "CHEMBL504861",
          "CHEMBL505225",
          "CHEMBL505432",
          "CHEMBL505727",
          "CHEMBL507051",
          "CHEMBL507094",
          "CHEMBL508004",
          "CHEMBL508772",
          "CHEMBL509464",
          "CHEMBL509519",
          "CHEMBL510690",
          "CHEMBL514716",
          "CHEMBL514953",
          "CHEMBL515160",
          "CHEMBL515161",
          "CHEMBL515288",
          "CHEMBL515616",
          "CHEMBL515887",
          "CHEMBL516113",
          "CHEMBL516355",
          "CHEMBL541903",
          "CHEMBL541904",
          "CHEMBL559157",
          "CHEMBL563949",
          "CHEMBL565298",
          "CHEMBL565324",
          "CHEMBL565325",
          "CHEMBL565511",
          "CHEMBL566177",
          "CHEMBL566359",
          "CHEMBL566360",
          "CHEMBL566390",
          "CHEMBL566574",
          "CHEMBL566604",
          "CHEMBL569018",
          "CHEMBL569391",
          "CHEMBL569470",
          "CHEMBL569616",
          "CHEMBL569848",
          "CHEMBL569849",
          "CHEMBL570163",
          "CHEMBL570297",
          "CHEMBL570518",
          "CHEMBL570520",
          "CHEMBL570521",
          "CHEMBL570761",
          "CHEMBL571206",
          "CHEMBL571457",
          "CHEMBL571650",
          "CHEMBL571832",
          "CHEMBL572046",
          "CHEMBL583035",
          "CHEMBL583343",
          "CHEMBL583344",
          "CHEMBL583457",
          "CHEMBL584063",
          "CHEMBL584259",
          "CHEMBL584525",
          "CHEMBL585157",
          "CHEMBL585914",
          "CHEMBL59865",
          "CHEMBL59993",
          "CHEMBL9387",
          "CHEMBL9506",
          "CHEMBL95200",
          "CHEMBL99252",
          "CHEMBL99499"
        ],
        "number_of_missing_values": "0"
      },
      {
        "data_type": "numeric",
        "index": "1",
        "is_ignore": "false",
        "is_row_identifier": "false",
        "is_target": "false",
        "name": "FCFP4_1024b584",
        "number_of_missing_values": "0"
      },
      {
        "data_type": "numeric",
        "index": "2",
        "is_ignore": "false",
        "is_row_identifier": "false",
        "is_target": "false",
        "name": "FCFP4_1024b246",
        "number_of_missing_values": "0"
      },
      {
        "data_type": "numeric",
        "index": "3",
        "is_ignore": "false",
        "is_row_identifier": "false",
        "is_target": "false",
        "name": "FCFP4_1024b820",
        "number_of_missing_values": "0"
      },
      {
        "data_type": "numeric",
        "index": "4",
        "is_ignore": "false",
        "is_row_identifier": "false",
        "is_target": "false",
        "name": "FCFP4_1024b23",
        "number_of_missing_values": "0"
      },
      {
        "data_type": "numeric",
        "index": "5",
        "is_ignore": "false",
        "is_row_identifier": "false",
        "is_target": "false",
        "name": "FCFP4_1024b726",
        "number_of_missing_values": "0"
      },
      {
        "data_type": "numeric",
        "index": "6",
        "is_ignore": "false",
        "is_row_identifier": "false",
        "is_target": "false",
        "name": "FCFP4_1024b309",
        "number_of_missing_values": "0"
      },
      {
        "data_type": "numeric",
        "index": "7",
        "is_ignore": "false",
        "is_row_identifier": "false",
        "is_target": "false",
        "name": "FCFP4_1024b674",
        "number_of_missing_values": "0"
      },
      {
        "data_type": "numeric",
        "index": "8",
        "is_ignore": "false",
        "is_row_identifier": "false",
        "is_target": "false",
        "name": "FCFP4_1024b165",
        "number_of_missing_values": "0"
      },
      {
        "data_type": "numeric",
        "index": "9",
        "is_ignore": "false",
        "is_row_identifier": "false",
        "is_target": "false",
        "name": "FCFP4_1024b924",
        "number_of_missing_values": "0"
      },
      {
        "data_type": "numeric",
        "index": "10",
        "is_ignore": "false",
        "is_row_identifier": "false",
        "is_target": "false",
        "name": "FCFP4_1024b537",
        "number_of_missing_values": "0"
      },
      {
        "data_type": "numeric",
        "index": "11",
        "is_ignore": "false",
        "is_row_identifier": "false",
        "is_target": "false",
        "name": "FCFP4_1024b61",
        "number_of_missing_values": "0"
      },
      {
        "data_type": "numeric",
        "index": "12",
        "is_ignore": "false",
        "is_row_identifier": "false",
        "is_target": "false",
        "name": "FCFP4_1024b985",
        "number_of_missing_values": "0"
      },
      {
        "data_type": "numeric",
        "index": "13",
        "is_ignore": "false",
        "is_row_identifier": "false",
        "is_target": "false",
        "name": "FCFP4_1024b286",
        "number_of_missing_values": "0"
      },
      {
        "data_type": "numeric",
        "index": "14",
        "is_ignore": "false",
        "is_row_identifier": "false",
        "is_target": "false",
        "name": "FCFP4_1024b599",
        "number_of_missing_values": "0"
      },
      {
        "data_type": "numeric",
        "index": "15",
        "is_ignore": "false",
        "is_row_identifier": "false",
        "is_target": "false",
        "name": "FCFP4_1024b553",
        "number_of_missing_values": "0"
      },
      {
        "data_type": "numeric",
        "index": "16",
        "is_ignore": "false",
        "is_row_identifier": "false",
        "is_target": "false",
        "name": "FCFP4_1024b787",
        "number_of_missing_values": "0"
      },
      {
        "data_type": "numeric",
        "index": "17",
        "is_ignore": "false",
        "is_row_identifier": "false",
        "is_target": "false",
        "name": "FCFP4_1024b525",
        "number_of_missing_values": "0"
      },
      {
        "data_type": "numeric",
        "index": "18",
        "is_ignore": "false",
        "is_row_identifier": "false",
        "is_target": "false",
        "name": "FCFP4_1024b235",
        "number_of_missing_values": "0"
      },
      {
        "data_type": "numeric",
        "index": "19",
        "is_ignore": "false",
        "is_row_identifier": "false",
        "is_target": "false",
        "name": "FCFP4_1024b826",
        "number_of_missing_values": "0"
      },
      {
        "data_type": "numeric",
        "index": "20",
        "is_ignore": "false",
        "is_row_identifier": "false",
        "is_target": "false",
        "name": "FCFP4_1024b574",
        "number_of_missing_values": "0"
      },
      {
        "data_type": "numeric",
        "index": "21",
        "is_ignore": "false",
        "is_row_identifier": "false",
        "is_target": "false",
        "name": "FCFP4_1024b54",
        "number_of_missing_values": "0"
      },
      {
        "data_type": "numeric",
        "index": "22",
        "is_ignore": "false",
        "is_row_identifier": "false",
        "is_target": "false",
        "name": "FCFP4_1024b468",
        "number_of_missing_values": "0"
      },
      {
        "data_type": "numeric",
        "index": "23",
        "is_ignore": "false",
        "is_row_identifier": "false",
        "is_target": "false",
        "name": "FCFP4_1024b904",
        "number_of_missing_values": "0"
      },
      {
        "data_type": "numeric",
        "index": "24",
        "is_ignore": "false",
        "is_row_identifier": "false",
        "is_target": "false",
        "name": "FCFP4_1024b219",
        "number_of_missing_values": "0"
      },
      {
        "data_type": "numeric",
        "index": "25",
        "is_ignore": "false",
        "is_row_identifier": "false",
        "is_target": "false",
        "name": "FCFP4_1024b107",
        "number_of_missing_values": "0"
      },
      {
        "data_type": "numeric",
        "index": "26",
        "is_ignore": "false",
        "is_row_identifier": "false",
        "is_target": "false",
        "name": "FCFP4_1024b521",
        "number_of_missing_values": "0"
      },
      {
        "data_type": "numeric",
        "index": "27",
        "is_ignore": "false",
        "is_row_identifier": "false",
        "is_target": "false",
        "name": "FCFP4_1024b983",
        "number_of_missing_values": "0"
      },
      {
        "data_type": "numeric",
        "index": "28",
        "is_ignore": "false",
        "is_row_identifier": "false",
        "is_target": "false",
        "name": "FCFP4_1024b942",
        "number_of_missing_values": "0"
      },
      {
        "data_type": "numeric",
        "index": "29",
        "is_ignore": "false",
        "is_row_identifier": "false",
        "is_target": "false",
        "name": "FCFP4_1024b4",
        "number_of_missing_values": "0"
      },
      {
        "data_type": "numeric",
        "index": "30",
        "is_ignore": "false",
        "is_row_identifier": "false",
        "is_target": "false",
        "name": "FCFP4_1024b490",
        "number_of_missing_values": "0"
      },
      {
        "data_type": "numeric",
        "index": "31",
        "is_ignore": "false",
        "is_row_identifier": "false",
        "is_target": "false",
        "name": "FCFP4_1024b971",
        "number_of_missing_values": "0"
      },
      {
        "data_type": "numeric",
        "index": "32",
        "is_ignore": "false",
        "is_row_identifier": "false",
        "is_target": "false",
        "name": "FCFP4_1024b217",
        "number_of_missing_values": "0"
      },
      {
        "data_type": "numeric",
        "index": "33",
        "is_ignore": "false",
        "is_row_identifier": "false",
        "is_target": "false",
        "name": "FCFP4_1024b627",
        "number_of_missing_values": "0"
      },
      {
        "data_type": "numeric",
        "index": "34",
        "is_ignore": "false",
        "is_row_identifier": "false",
        "is_target": "false",
        "name": "FCFP4_1024b357",
        "number_of_missing_values": "0"
      },
      {
        "data_type": "numeric",
        "index": "35",
        "is_ignore": "false",
        "is_row_identifier": "false",
        "is_target": "false",
        "name": "FCFP4_1024b987",
        "number_of_missing_values": "0"
      },
      {
        "data_type": "numeric",
        "index": "36",
        "is_ignore": "false",
        "is_row_identifier": "false",
        "is_target": "false",
        "name": "FCFP4_1024b387",
        "number_of_missing_values": "0"
      },
      {
        "data_type": "numeric",
        "index": "37",
        "is_ignore": "false",
        "is_row_identifier": "false",
        "is_target": "false",
        "name": "FCFP4_1024b466",
        "number_of_missing_values": "0"
      },
      {
        "data_type": "numeric",
        "index": "38",
        "is_ignore": "false",
        "is_row_identifier": "false",
        "is_target": "false",
        "name": "FCFP4_1024b931",
        "number_of_missing_values": "0"
      },
      {
        "data_type": "numeric",
        "index": "39",
        "is_ignore": "false",
        "is_row_identifier": "false",
        "is_target": "false",
        "name": "FCFP4_1024b450",
        "number_of_missing_values": "0"
      },
      {
        "data_type": "numeric",
        "index": "40",
        "is_ignore": "false",
        "is_row_identifier": "false",
        "is_target": "false",
        "name": "FCFP4_1024b626",
        "number_of_missing_values": "0"
      },
      {
        "data_type": "numeric",
        "index": "41",
        "is_ignore": "false",
        "is_row_identifier": "false",
        "is_target": "false",
        "name": "FCFP4_1024b351",
        "number_of_missing_values": "0"
      },
      {
        "data_type": "numeric",
        "index": "42",
        "is_ignore": "false",
        "is_row_identifier": "false",
        "is_target": "false",
        "name": "FCFP4_1024b79",
        "number_of_missing_values": "0"
      },
      {
        "data_type": "numeric",
        "index": "43",
        "is_ignore": "false",
        "is_row_identifier": "false",
        "is_target": "false",
        "name": "FCFP4_1024b280",
        "number_of_missing_values": "0"
      },
      {
        "data_type": "numeric",
        "index": "44",
        "is_ignore": "false",
        "is_row_identifier": "false",
        "is_target": "false",
        "name": "FCFP4_1024b965",
        "number_of_missing_values": "0"
      },
      {
        "data_type": "numeric",
        "index": "45",
        "is_ignore": "false",
        "is_row_identifier": "false",
        "is_target": "false",
        "name": "FCFP4_1024b65",
        "number_of_missing_values": "0"
      },
      {
        "data_type": "numeric",
        "index": "46",
        "is_ignore": "false",
        "is_row_identifier": "false",
        "is_target": "false",
        "name": "FCFP4_1024b582",
        "number_of_missing_values": "0"
      },
      {
        "data_type": "numeric",
        "index": "47",
        "is_ignore": "false",
        "is_row_identifier": "false",
        "is_target": "false",
        "name": "FCFP4_1024b738",
        "number_of_missing_values": "0"
      },
      {
        "data_type": "numeric",
        "index": "48",
        "is_ignore": "false",
        "is_row_identifier": "false",
        "is_target": "false",
        "name": "FCFP4_1024b203",
        "number_of_missing_values": "0"
      },
      {
        "data_type": "numeric",
        "index": "49",
        "is_ignore": "false",
        "is_row_identifier": "false",
        "is_target": "false",
        "name": "FCFP4_1024b571",
        "number_of_missing_values": "0"
      },
      {
        "data_type": "numeric",
        "index": "50",
        "is_ignore": "false",
        "is_row_identifier": "false",
        "is_target": "false",
        "name": "FCFP4_1024b385",
        "number_of_missing_values": "0"
      },
      {
        "data_type": "numeric",
        "index": "51",
        "is_ignore": "false",
        "is_row_identifier": "false",
        "is_target": "false",
        "name": "FCFP4_1024b376",
        "number_of_missing_values": "0"
      },
      {
        "data_type": "numeric",
        "index": "52",
        "is_ignore": "false",
        "is_row_identifier": "false",
        "is_target": "true",
        "name": "pXC50",
        "number_of_missing_values": "0"
      }
    ]
  }
}