{
  "data_set_description": {
    "collection_date": "November 2013",
    "creator": "Dr Jeremy Besnard, Dr Ivan Olier, Dr Noureddin Sadawi, Dr Larisa Soldatova, Dr Crina Grosan, Prof Ross King, Dr Richard Bickerton, Prof Andrew Hopkins and Dr Willem van Hoorn",
    "default_target_attribute": "pXC50",
    "description": "This dataset contains QSAR data (from ChEMBL version 17) showing activity values (unit is pseudo-pCI50) of several compounds on drug target ChEMBL_ID: CHEMBL3706 (TID: 11473), and it has 1529 rows and 1024 features (not including molecule IDs and class feature: molecule_id and pXC50). The features represent FCFP 1024-bit Molecular Fingerprints which were generated from SMILES strings. They were obtained using the Pipeline Pilot program, Dassault Systèmes BIOVIA. Generating Fingerprints do not usually require missing value imputation as all bits are generated.",
    "description_version": "1",
    "file_id": "3302744",
    "format": "ARFF",
    "id": "26439",
    "licence": "Public",
    "md5_checksum": "1c6fa036a02191d8abd3ad7561a36c5e",
    "minio_url": "https://data.openml.org/datasets/0002/26439/dataset_26439.pq",
    "name": "QSAR-DATASET-FOR-DRUG-TARGET-CHEMBL3706",
    "original_data_url": "https://www.ebi.ac.uk/chembl/target/inspect/CHEMBL3706",
    "parquet_url": "https://data.openml.org/datasets/0002/26439/dataset_26439.pq",
    "processing_date": "2018-10-03 23:41:40",
    "row_id_attribute": "molecule_id",
    "status": "deactivated",
    "tag": [
      "MetaQSAR",
      "study_13"
    ],
    "upload_date": "2016-07-14T19:15:00",
    "url": "https://api.openml.org/data/v1/download/3302744/QSAR-DATASET-FOR-DRUG-TARGET-CHEMBL3706.arff",
    "version": "8",
    "visibility": "public"
  }
}