{
  "data_features": {
    "feature": [
      {
        "data_type": "nominal",
        "index": "0",
        "is_ignore": "false",
        "is_row_identifier": "true",
        "is_target": "false",
        "name": "molecule_id",
        "nominal_value": [
          "CHEMBL100503",
          "CHEMBL101246",
          "CHEMBL1085374",
          "CHEMBL1086110",
          "CHEMBL1221434",
          "CHEMBL138658",
          "CHEMBL141918",
          "CHEMBL150764",
          "CHEMBL1520",
          "CHEMBL171957",
          "CHEMBL173998",
          "CHEMBL175132",
          "CHEMBL175238",
          "CHEMBL175370",
          "CHEMBL175489",
          "CHEMBL175958",
          "CHEMBL177336",
          "CHEMBL189",
          "CHEMBL1911559",
          "CHEMBL1911572",
          "CHEMBL1915888",
          "CHEMBL1915889",
          "CHEMBL1915890",
          "CHEMBL1915891",
          "CHEMBL1915892",
          "CHEMBL1915893",
          "CHEMBL1915894",
          "CHEMBL1915896",
          "CHEMBL1915897",
          "CHEMBL1915898",
          "CHEMBL1915899",
          "CHEMBL1915900",
          "CHEMBL1915901",
          "CHEMBL1915902",
          "CHEMBL1915903",
          "CHEMBL1915904",
          "CHEMBL1915905",
          "CHEMBL1915906",
          "CHEMBL1915907",
          "CHEMBL1915908",
          "CHEMBL1915909",
          "CHEMBL1915910",
          "CHEMBL1915912",
          "CHEMBL1916089",
          "CHEMBL1916090",
          "CHEMBL1916091",
          "CHEMBL1916093",
          "CHEMBL1916094",
          "CHEMBL1916095",
          "CHEMBL1916096",
          "CHEMBL1916097",
          "CHEMBL1916101",
          "CHEMBL1916102",
          "CHEMBL1916103",
          "CHEMBL1916104",
          "CHEMBL1916106",
          "CHEMBL1916108",
          "CHEMBL1916109",
          "CHEMBL1916111",
          "CHEMBL1916112",
          "CHEMBL1916113",
          "CHEMBL1916114",
          "CHEMBL1916115",
          "CHEMBL1916116",
          "CHEMBL1916117",
          "CHEMBL1916118",
          "CHEMBL1916119",
          "CHEMBL1916120",
          "CHEMBL1916123",
          "CHEMBL1916124",
          "CHEMBL1916125",
          "CHEMBL1916126",
          "CHEMBL1916127",
          "CHEMBL1916129",
          "CHEMBL1916130",
          "CHEMBL1916131",
          "CHEMBL1916132",
          "CHEMBL1916133",
          "CHEMBL1916134",
          "CHEMBL1916135",
          "CHEMBL1916136",
          "CHEMBL1916137",
          "CHEMBL1916138",
          "CHEMBL1916139",
          "CHEMBL192",
          "CHEMBL19224",
          "CHEMBL1939912",
          "CHEMBL1939914",
          "CHEMBL1939915",
          "CHEMBL1940053",
          "CHEMBL1940056",
          "CHEMBL1940057",
          "CHEMBL1940058",
          "CHEMBL1957366",
          "CHEMBL200906",
          "CHEMBL204449",
          "CHEMBL20613",
          "CHEMBL2069321",
          "CHEMBL2070659",
          "CHEMBL2070666",
          "CHEMBL2178115",
          "CHEMBL2180771",
          "CHEMBL2180772",
          "CHEMBL2180773",
          "CHEMBL2180774",
          "CHEMBL2180775",
          "CHEMBL2206212",
          "CHEMBL2206213",
          "CHEMBL2206214",
          "CHEMBL2206215",
          "CHEMBL2206216",
          "CHEMBL2206217",
          "CHEMBL2206218",
          "CHEMBL2206219",
          "CHEMBL2206220",
          "CHEMBL2206221",
          "CHEMBL2206222",
          "CHEMBL2206223",
          "CHEMBL2206224",
          "CHEMBL2206225",
          "CHEMBL2206226",
          "CHEMBL2311556",
          "CHEMBL2313231",
          "CHEMBL2313232",
          "CHEMBL2313233",
          "CHEMBL2313234",
          "CHEMBL2313235",
          "CHEMBL2313236",
          "CHEMBL2313237",
          "CHEMBL2313238",
          "CHEMBL2313239",
          "CHEMBL2313240",
          "CHEMBL2313241",
          "CHEMBL2313242",
          "CHEMBL2313243",
          "CHEMBL2313244",
          "CHEMBL2313245",
          "CHEMBL2313246",
          "CHEMBL2313247",
          "CHEMBL2313248",
          "CHEMBL2313249",
          "CHEMBL2313250",
          "CHEMBL2313251",
          "CHEMBL2313252",
          "CHEMBL2313253",
          "CHEMBL2313254",
          "CHEMBL2313255",
          "CHEMBL2313256",
          "CHEMBL2313257",
          "CHEMBL2313258",
          "CHEMBL2313259",
          "CHEMBL2313260",
          "CHEMBL2313261",
          "CHEMBL2313262",
          "CHEMBL2313263",
          "CHEMBL2333219",
          "CHEMBL2333220",
          "CHEMBL24385",
          "CHEMBL24495",
          "CHEMBL24715",
          "CHEMBL24752",
          "CHEMBL25192",
          "CHEMBL25616",
          "CHEMBL26348",
          "CHEMBL275084",
          "CHEMBL277529",
          "CHEMBL28079",
          "CHEMBL282765",
          "CHEMBL283360",
          "CHEMBL28676",
          "CHEMBL296435",
          "CHEMBL302299",
          "CHEMBL30362",
          "CHEMBL30402",
          "CHEMBL304927",
          "CHEMBL30623",
          "CHEMBL306389",
          "CHEMBL309026",
          "CHEMBL30908",
          "CHEMBL313282",
          "CHEMBL313463",
          "CHEMBL316599",
          "CHEMBL317604",
          "CHEMBL319166",
          "CHEMBL323071",
          "CHEMBL328149",
          "CHEMBL330280",
          "CHEMBL330677",
          "CHEMBL332898",
          "CHEMBL337587",
          "CHEMBL362451",
          "CHEMBL366545",
          "CHEMBL366822",
          "CHEMBL367083",
          "CHEMBL367399",
          "CHEMBL369824",
          "CHEMBL370962",
          "CHEMBL373102",
          "CHEMBL41950",
          "CHEMBL421885",
          "CHEMBL422104",
          "CHEMBL431799",
          "CHEMBL43406",
          "CHEMBL448467",
          "CHEMBL456368",
          "CHEMBL457216",
          "CHEMBL458298",
          "CHEMBL50378",
          "CHEMBL511115",
          "CHEMBL514277",
          "CHEMBL545712",
          "CHEMBL551052",
          "CHEMBL557593",
          "CHEMBL567470",
          "CHEMBL61692",
          "CHEMBL63",
          "CHEMBL66323",
          "CHEMBL66620",
          "CHEMBL67243",
          "CHEMBL67276",
          "CHEMBL760",
          "CHEMBL77826",
          "CHEMBL779",
          "CHEMBL8068",
          "CHEMBL88136",
          "CHEMBL88218",
          "CHEMBL88245",
          "CHEMBL88265",
          "CHEMBL88395",
          "CHEMBL88444",
          "CHEMBL88525",
          "CHEMBL88583",
          "CHEMBL88764",
          "CHEMBL89660",
          "CHEMBL89679",
          "CHEMBL90195",
          "CHEMBL90237",
          "CHEMBL90414",
          "CHEMBL90601",
          "CHEMBL90677",
          "CHEMBL90804",
          "CHEMBL91044",
          "CHEMBL91224",
          "CHEMBL91295",
          "CHEMBL91356",
          "CHEMBL91368",
          "CHEMBL91422",
          "CHEMBL91478",
          "CHEMBL91527",
          "CHEMBL91634",
          "CHEMBL91837",
          "CHEMBL91843",
          "CHEMBL92264",
          "CHEMBL92363",
          "CHEMBL932",
          "CHEMBL94931",
          "CHEMBL97546",
          "CHEMBL97946",
          "CHEMBL98350",
          "CHEMBL98604",
          "CHEMBL98738",
          "CHEMBL98851",
          "CHEMBL98943",
          "CHEMBL99117",
          "CHEMBL99144",
          "CHEMBL99820"
        ],
        "number_of_missing_values": "0"
      },
      {
        "data_type": "numeric",
        "index": "1",
        "is_ignore": "false",
        "is_row_identifier": "false",
        "is_target": "false",
        "name": "AMW",
        "number_of_missing_values": "0"
      },
      {
        "data_type": "numeric",
        "index": "2",
        "is_ignore": "false",
        "is_row_identifier": "false",
        "is_target": "false",
        "name": "C.",
        "number_of_missing_values": "0"
      },
      {
        "data_type": "numeric",
        "index": "3",
        "is_ignore": "false",
        "is_row_identifier": "false",
        "is_target": "false",
        "name": "H.",
        "number_of_missing_values": "0"
      },
      {
        "data_type": "numeric",
        "index": "4",
        "is_ignore": "false",
        "is_row_identifier": "false",
        "is_target": "false",
        "name": "Me",
        "number_of_missing_values": "0"
      },
      {
        "data_type": "numeric",
        "index": "5",
        "is_ignore": "false",
        "is_row_identifier": "false",
        "is_target": "false",
        "name": "Mi",
        "number_of_missing_values": "0"
      },
      {
        "data_type": "numeric",
        "index": "6",
        "is_ignore": "false",
        "is_row_identifier": "false",
        "is_target": "false",
        "name": "Mp",
        "number_of_missing_values": "0"
      },
      {
        "data_type": "numeric",
        "index": "7",
        "is_ignore": "false",
        "is_row_identifier": "false",
        "is_target": "false",
        "name": "Mv",
        "number_of_missing_values": "0"
      },
      {
        "data_type": "numeric",
        "index": "8",
        "is_ignore": "false",
        "is_row_identifier": "false",
        "is_target": "false",
        "name": "MW",
        "number_of_missing_values": "0"
      },
      {
        "data_type": "numeric",
        "index": "9",
        "is_ignore": "false",
        "is_row_identifier": "false",
        "is_target": "false",
        "name": "N.",
        "number_of_missing_values": "0"
      },
      {
        "data_type": "numeric",
        "index": "10",
        "is_ignore": "false",
        "is_row_identifier": "false",
        "is_target": "false",
        "name": "nAB",
        "number_of_missing_values": "0"
      },
      {
        "data_type": "numeric",
        "index": "11",
        "is_ignore": "false",
        "is_row_identifier": "false",
        "is_target": "false",
        "name": "nAT",
        "number_of_missing_values": "0"
      },
      {
        "data_type": "numeric",
        "index": "12",
        "is_ignore": "false",
        "is_row_identifier": "false",
        "is_target": "false",
        "name": "nB",
        "number_of_missing_values": "0"
      },
      {
        "data_type": "numeric",
        "index": "13",
        "is_ignore": "false",
        "is_row_identifier": "false",
        "is_target": "false",
        "name": "nBM",
        "number_of_missing_values": "0"
      },
      {
        "data_type": "numeric",
        "index": "14",
        "is_ignore": "false",
        "is_row_identifier": "false",
        "is_target": "false",
        "name": "nBO",
        "number_of_missing_values": "0"
      },
      {
        "data_type": "numeric",
        "index": "15",
        "is_ignore": "false",
        "is_row_identifier": "false",
        "is_target": "false",
        "name": "nBR",
        "number_of_missing_values": "0"
      },
      {
        "data_type": "numeric",
        "index": "16",
        "is_ignore": "false",
        "is_row_identifier": "false",
        "is_target": "false",
        "name": "nBT",
        "number_of_missing_values": "0"
      },
      {
        "data_type": "numeric",
        "index": "17",
        "is_ignore": "false",
        "is_row_identifier": "false",
        "is_target": "false",
        "name": "nC",
        "number_of_missing_values": "0"
      },
      {
        "data_type": "numeric",
        "index": "18",
        "is_ignore": "false",
        "is_row_identifier": "false",
        "is_target": "false",
        "name": "nCL",
        "number_of_missing_values": "0"
      },
      {
        "data_type": "numeric",
        "index": "19",
        "is_ignore": "false",
        "is_row_identifier": "false",
        "is_target": "false",
        "name": "nCsp",
        "number_of_missing_values": "0"
      },
      {
        "data_type": "numeric",
        "index": "20",
        "is_ignore": "false",
        "is_row_identifier": "false",
        "is_target": "false",
        "name": "nCsp2",
        "number_of_missing_values": "0"
      },
      {
        "data_type": "numeric",
        "index": "21",
        "is_ignore": "false",
        "is_row_identifier": "false",
        "is_target": "false",
        "name": "nCsp3",
        "number_of_missing_values": "0"
      },
      {
        "data_type": "numeric",
        "index": "22",
        "is_ignore": "false",
        "is_row_identifier": "false",
        "is_target": "false",
        "name": "nDB",
        "number_of_missing_values": "0"
      },
      {
        "data_type": "numeric",
        "index": "23",
        "is_ignore": "false",
        "is_row_identifier": "false",
        "is_target": "false",
        "name": "nF",
        "number_of_missing_values": "0"
      },
      {
        "data_type": "numeric",
        "index": "24",
        "is_ignore": "false",
        "is_row_identifier": "false",
        "is_target": "false",
        "name": "nH",
        "number_of_missing_values": "0"
      },
      {
        "data_type": "numeric",
        "index": "25",
        "is_ignore": "false",
        "is_row_identifier": "false",
        "is_target": "false",
        "name": "nHet",
        "number_of_missing_values": "0"
      },
      {
        "data_type": "numeric",
        "index": "26",
        "is_ignore": "false",
        "is_row_identifier": "false",
        "is_target": "false",
        "name": "nHM",
        "number_of_missing_values": "0"
      },
      {
        "data_type": "numeric",
        "index": "27",
        "is_ignore": "false",
        "is_row_identifier": "false",
        "is_target": "false",
        "name": "nI",
        "number_of_missing_values": "0"
      },
      {
        "data_type": "numeric",
        "index": "28",
        "is_ignore": "false",
        "is_row_identifier": "false",
        "is_target": "false",
        "name": "nN",
        "number_of_missing_values": "0"
      },
      {
        "data_type": "numeric",
        "index": "29",
        "is_ignore": "false",
        "is_row_identifier": "false",
        "is_target": "false",
        "name": "nO",
        "number_of_missing_values": "0"
      },
      {
        "data_type": "numeric",
        "index": "30",
        "is_ignore": "false",
        "is_row_identifier": "false",
        "is_target": "false",
        "name": "nP",
        "number_of_missing_values": "0"
      },
      {
        "data_type": "numeric",
        "index": "31",
        "is_ignore": "false",
        "is_row_identifier": "false",
        "is_target": "false",
        "name": "nS",
        "number_of_missing_values": "0"
      },
      {
        "data_type": "numeric",
        "index": "32",
        "is_ignore": "false",
        "is_row_identifier": "false",
        "is_target": "false",
        "name": "nSK",
        "number_of_missing_values": "0"
      },
      {
        "data_type": "numeric",
        "index": "33",
        "is_ignore": "false",
        "is_row_identifier": "false",
        "is_target": "false",
        "name": "nTB",
        "number_of_missing_values": "0"
      },
      {
        "data_type": "numeric",
        "index": "34",
        "is_ignore": "false",
        "is_row_identifier": "false",
        "is_target": "false",
        "name": "nX",
        "number_of_missing_values": "0"
      },
      {
        "data_type": "numeric",
        "index": "35",
        "is_ignore": "false",
        "is_row_identifier": "false",
        "is_target": "false",
        "name": "O.",
        "number_of_missing_values": "0"
      },
      {
        "data_type": "numeric",
        "index": "36",
        "is_ignore": "false",
        "is_row_identifier": "false",
        "is_target": "false",
        "name": "RBF",
        "number_of_missing_values": "0"
      },
      {
        "data_type": "numeric",
        "index": "37",
        "is_ignore": "false",
        "is_row_identifier": "false",
        "is_target": "false",
        "name": "RBN",
        "number_of_missing_values": "0"
      },
      {
        "data_type": "numeric",
        "index": "38",
        "is_ignore": "false",
        "is_row_identifier": "false",
        "is_target": "false",
        "name": "SCBO",
        "number_of_missing_values": "0"
      },
      {
        "data_type": "numeric",
        "index": "39",
        "is_ignore": "false",
        "is_row_identifier": "false",
        "is_target": "false",
        "name": "Se",
        "number_of_missing_values": "0"
      },
      {
        "data_type": "numeric",
        "index": "40",
        "is_ignore": "false",
        "is_row_identifier": "false",
        "is_target": "false",
        "name": "Si",
        "number_of_missing_values": "0"
      },
      {
        "data_type": "numeric",
        "index": "41",
        "is_ignore": "false",
        "is_row_identifier": "false",
        "is_target": "false",
        "name": "Sp",
        "number_of_missing_values": "0"
      },
      {
        "data_type": "numeric",
        "index": "42",
        "is_ignore": "false",
        "is_row_identifier": "false",
        "is_target": "false",
        "name": "Sv",
        "number_of_missing_values": "0"
      },
      {
        "data_type": "numeric",
        "index": "43",
        "is_ignore": "false",
        "is_row_identifier": "false",
        "is_target": "false",
        "name": "X.",
        "number_of_missing_values": "0"
      },
      {
        "data_type": "numeric",
        "index": "44",
        "is_ignore": "false",
        "is_row_identifier": "false",
        "is_target": "true",
        "name": "pXC50",
        "number_of_missing_values": "0"
      }
    ]
  }
}