{
  "data_set_description": {
    "collection_date": "November 2013",
    "creator": "Dr Jeremy Besnard, Dr Ivan Olier, Dr Noureddin Sadawi, Dr Larisa Soldatova, Dr Crina Grosan, Prof Ross King, Dr Richard Bickerton, Prof Andrew Hopkins and Dr Willem van Hoorn",
    "default_target_attribute": "pXC50",
    "description": "This dataset contains QSAR data (from ChEMBL version 17) showing activity values (unit is pseudo-pCI50) of several compounds on drug target ChEMBL_ID: CHEMBL4149 (TID: 100163), and it has 10 rows and 43 features (not including molecule IDs and class feature: molecule_id and pXC50). The features represent Basic Molecular Descriptors which were generated from SMILES strings.  Missing value imputation was applied to this dataset (By choosing the Median).",
    "description_version": "1",
    "file_id": "3302033",
    "format": "ARFF",
    "id": "26416",
    "licence": "Public",
    "md5_checksum": "5e0db56b348515b50da926b18e3a2754",
    "minio_url": "https://data.openml.org/datasets/0002/26416/dataset_26416.pq",
    "name": "QSAR-DATASET-FOR-DRUG-TARGET-CHEMBL4149",
    "original_data_url": "https://www.ebi.ac.uk/chembl/target/inspect/CHEMBL4149",
    "parquet_url": "https://data.openml.org/datasets/0002/26416/dataset_26416.pq",
    "processing_date": "2018-10-03 23:44:55",
    "row_id_attribute": "molecule_id",
    "status": "deactivated",
    "tag": [
      "MetaQSAR",
      "study_13"
    ],
    "upload_date": "2016-07-14T19:11:44",
    "url": "https://api.openml.org/data/v1/download/3302033/QSAR-DATASET-FOR-DRUG-TARGET-CHEMBL4149.arff",
    "version": "6",
    "visibility": "public"
  }
}