{
  "data_features": {
    "feature": [
      {
        "data_type": "nominal",
        "index": "0",
        "is_ignore": "false",
        "is_row_identifier": "true",
        "is_target": "false",
        "name": "molecule_id",
        "nominal_value": [
          "CHEMBL174893",
          "CHEMBL174957",
          "CHEMBL176294",
          "CHEMBL177327",
          "CHEMBL1938618",
          "CHEMBL1938619",
          "CHEMBL1938620",
          "CHEMBL1938621",
          "CHEMBL1938622",
          "CHEMBL1938623",
          "CHEMBL1938624",
          "CHEMBL1938625",
          "CHEMBL1938626",
          "CHEMBL1938627",
          "CHEMBL1938629",
          "CHEMBL1938630",
          "CHEMBL1938633",
          "CHEMBL1938634",
          "CHEMBL1938635",
          "CHEMBL1938636",
          "CHEMBL1938638",
          "CHEMBL1938639",
          "CHEMBL1938640",
          "CHEMBL1938641",
          "CHEMBL359933",
          "CHEMBL369465",
          "CHEMBL405395",
          "CHEMBL426936",
          "CHEMBL441308"
        ],
        "number_of_missing_values": "0"
      },
      {
        "data_type": "numeric",
        "index": "1",
        "is_ignore": "false",
        "is_row_identifier": "false",
        "is_target": "false",
        "name": "MW",
        "number_of_missing_values": "0"
      },
      {
        "data_type": "numeric",
        "index": "2",
        "is_ignore": "false",
        "is_row_identifier": "false",
        "is_target": "false",
        "name": "nAT",
        "number_of_missing_values": "0"
      },
      {
        "data_type": "numeric",
        "index": "3",
        "is_ignore": "false",
        "is_row_identifier": "false",
        "is_target": "true",
        "name": "pXC50",
        "number_of_missing_values": "0"
      }
    ]
  }
}