{
  "data_features": {
    "feature": [
      {
        "data_type": "nominal",
        "index": "0",
        "is_ignore": "false",
        "is_row_identifier": "true",
        "is_target": "false",
        "name": "molecule_id",
        "nominal_value": [
          "CHEMBL119647",
          "CHEMBL1223708",
          "CHEMBL1223709",
          "CHEMBL1223710",
          "CHEMBL1223767",
          "CHEMBL1223768",
          "CHEMBL1223769",
          "CHEMBL1223770",
          "CHEMBL1223828",
          "CHEMBL1223829",
          "CHEMBL1223830",
          "CHEMBL1223884",
          "CHEMBL1223885",
          "CHEMBL1223886",
          "CHEMBL1223887",
          "CHEMBL1223888",
          "CHEMBL1223966",
          "CHEMBL1223967",
          "CHEMBL1223968",
          "CHEMBL1223969",
          "CHEMBL1224079",
          "CHEMBL1224080",
          "CHEMBL1224081",
          "CHEMBL1224082",
          "CHEMBL1224152",
          "CHEMBL1224153",
          "CHEMBL1224154",
          "CHEMBL1224228",
          "CHEMBL1224229",
          "CHEMBL1224230",
          "CHEMBL1224231",
          "CHEMBL1224304",
          "CHEMBL1224305",
          "CHEMBL1224306",
          "CHEMBL1224386",
          "CHEMBL1224387",
          "CHEMBL1224388",
          "CHEMBL1224389",
          "CHEMBL1253196",
          "CHEMBL1253625",
          "CHEMBL1253626",
          "CHEMBL1253627",
          "CHEMBL1253628",
          "CHEMBL1253629",
          "CHEMBL1253630",
          "CHEMBL1253631",
          "CHEMBL1253789",
          "CHEMBL1253793",
          "CHEMBL1253794",
          "CHEMBL1253795",
          "CHEMBL1253796",
          "CHEMBL1253872",
          "CHEMBL1253875",
          "CHEMBL1253876",
          "CHEMBL1253877",
          "CHEMBL1253878",
          "CHEMBL1253956",
          "CHEMBL1253961",
          "CHEMBL1253962",
          "CHEMBL1253963",
          "CHEMBL1254054",
          "CHEMBL1254055",
          "CHEMBL1254056",
          "CHEMBL1254057",
          "CHEMBL1254141",
          "CHEMBL1254146",
          "CHEMBL1254147",
          "CHEMBL1254148",
          "CHEMBL1254149",
          "CHEMBL1254150",
          "CHEMBL1254240",
          "CHEMBL1254241",
          "CHEMBL1254242",
          "CHEMBL1254243",
          "CHEMBL1254244",
          "CHEMBL1254326",
          "CHEMBL1254327",
          "CHEMBL1254328",
          "CHEMBL1254329",
          "CHEMBL1254398",
          "CHEMBL1254399",
          "CHEMBL1254400",
          "CHEMBL1254401",
          "CHEMBL1254402",
          "CHEMBL1254403",
          "CHEMBL1254479",
          "CHEMBL1254480",
          "CHEMBL1254481",
          "CHEMBL1254482",
          "CHEMBL1254556",
          "CHEMBL1254560",
          "CHEMBL1254561",
          "CHEMBL1254562",
          "CHEMBL1254563",
          "CHEMBL1254564",
          "CHEMBL1254630",
          "CHEMBL1254634",
          "CHEMBL1254635",
          "CHEMBL1254636",
          "CHEMBL1254711",
          "CHEMBL1254713",
          "CHEMBL1254714",
          "CHEMBL1254715",
          "CHEMBL1254796",
          "CHEMBL1254797",
          "CHEMBL1254798",
          "CHEMBL1254799",
          "CHEMBL1254883",
          "CHEMBL1254885",
          "CHEMBL1254886",
          "CHEMBL1254887",
          "CHEMBL1254968",
          "CHEMBL1254972",
          "CHEMBL1254973",
          "CHEMBL1255050",
          "CHEMBL1255054",
          "CHEMBL1255055",
          "CHEMBL1255056",
          "CHEMBL1255057",
          "CHEMBL1287838",
          "CHEMBL1289044",
          "CHEMBL1289051",
          "CHEMBL1289053",
          "CHEMBL1289054",
          "CHEMBL1289166",
          "CHEMBL1289169",
          "CHEMBL1289170",
          "CHEMBL1289278",
          "CHEMBL1289279",
          "CHEMBL1289282",
          "CHEMBL1289283",
          "CHEMBL1289395",
          "CHEMBL1289396",
          "CHEMBL1289399",
          "CHEMBL1289400",
          "CHEMBL1289511",
          "CHEMBL1289512",
          "CHEMBL1289515",
          "CHEMBL1289516",
          "CHEMBL1289614",
          "CHEMBL1289619",
          "CHEMBL1289620",
          "CHEMBL1289623",
          "CHEMBL1289624",
          "CHEMBL1289717",
          "CHEMBL1289718",
          "CHEMBL1289722",
          "CHEMBL1289723",
          "CHEMBL1289726",
          "CHEMBL1289727",
          "CHEMBL1289823",
          "CHEMBL1289824",
          "CHEMBL1289829",
          "CHEMBL1289830",
          "CHEMBL1289833",
          "CHEMBL1289834",
          "CHEMBL1289940",
          "CHEMBL1289941",
          "CHEMBL1289945",
          "CHEMBL1289946",
          "CHEMBL1290041",
          "CHEMBL1290042",
          "CHEMBL1290045",
          "CHEMBL1290046",
          "CHEMBL1290150",
          "CHEMBL1290151",
          "CHEMBL1290155",
          "CHEMBL1290261",
          "CHEMBL1290262",
          "CHEMBL1290264",
          "CHEMBL1290265",
          "CHEMBL1290266",
          "CHEMBL1290267",
          "CHEMBL1290378",
          "CHEMBL1290379",
          "CHEMBL1290381",
          "CHEMBL1290382",
          "CHEMBL1290383",
          "CHEMBL1290384",
          "CHEMBL1290484",
          "CHEMBL1290490",
          "CHEMBL1290491",
          "CHEMBL1290492",
          "CHEMBL1290493",
          "CHEMBL1290593",
          "CHEMBL1290594",
          "CHEMBL1290600",
          "CHEMBL1290601",
          "CHEMBL1290602",
          "CHEMBL1290603",
          "CHEMBL1290712",
          "CHEMBL1290713",
          "CHEMBL1290719",
          "CHEMBL1290720",
          "CHEMBL1290721",
          "CHEMBL1290722",
          "CHEMBL1300935",
          "CHEMBL1300997",
          "CHEMBL1306232",
          "CHEMBL1311692",
          "CHEMBL1312413",
          "CHEMBL1314041",
          "CHEMBL1319175",
          "CHEMBL1319565",
          "CHEMBL1325848",
          "CHEMBL1332346",
          "CHEMBL1335094",
          "CHEMBL1335256",
          "CHEMBL1335373",
          "CHEMBL1335685",
          "CHEMBL1335692",
          "CHEMBL1336601",
          "CHEMBL1337101",
          "CHEMBL1338735",
          "CHEMBL1339046",
          "CHEMBL1339438",
          "CHEMBL1342885",
          "CHEMBL1343746",
          "CHEMBL1344766",
          "CHEMBL1344848",
          "CHEMBL1350024",
          "CHEMBL1351920",
          "CHEMBL1353612",
          "CHEMBL1358771",
          "CHEMBL1358809",
          "CHEMBL1359426",
          "CHEMBL1359489",
          "CHEMBL1364722",
          "CHEMBL1366282",
          "CHEMBL1370401",
          "CHEMBL1371138",
          "CHEMBL1371990",
          "CHEMBL1380202",
          "CHEMBL1382150",
          "CHEMBL1383506",
          "CHEMBL1386141",
          "CHEMBL1387472",
          "CHEMBL1388042",
          "CHEMBL1388448",
          "CHEMBL1401638",
          "CHEMBL1402796",
          "CHEMBL1404493",
          "CHEMBL1412407",
          "CHEMBL1412874",
          "CHEMBL1413393",
          "CHEMBL1416734",
          "CHEMBL1418691",
          "CHEMBL1421312",
          "CHEMBL1421525",
          "CHEMBL1426998",
          "CHEMBL1436519",
          "CHEMBL1446321",
          "CHEMBL1447678",
          "CHEMBL1452153",
          "CHEMBL1452812",
          "CHEMBL1454002",
          "CHEMBL1456577",
          "CHEMBL1458112",
          "CHEMBL1459221",
          "CHEMBL1460465",
          "CHEMBL1461182",
          "CHEMBL1463698",
          "CHEMBL1464847",
          "CHEMBL1467280",
          "CHEMBL1468887",
          "CHEMBL1471999",
          "CHEMBL1480448",
          "CHEMBL1482022",
          "CHEMBL1484343",
          "CHEMBL1493564",
          "CHEMBL1498512",
          "CHEMBL1499675",
          "CHEMBL1500235",
          "CHEMBL1501491",
          "CHEMBL1503352",
          "CHEMBL1503385",
          "CHEMBL1506732",
          "CHEMBL1507724",
          "CHEMBL1509579",
          "CHEMBL1517453",
          "CHEMBL1518183",
          "CHEMBL1531690",
          "CHEMBL1533829",
          "CHEMBL1536967",
          "CHEMBL1537947",
          "CHEMBL1538063",
          "CHEMBL1538214",
          "CHEMBL1539046",
          "CHEMBL1540447",
          "CHEMBL1543278",
          "CHEMBL1546168",
          "CHEMBL1549996",
          "CHEMBL1562905",
          "CHEMBL1565197",
          "CHEMBL1568072",
          "CHEMBL1569862",
          "CHEMBL1572885",
          "CHEMBL1573548",
          "CHEMBL1575268",
          "CHEMBL1576145",
          "CHEMBL1578660",
          "CHEMBL1579263",
          "CHEMBL1579913",
          "CHEMBL1582334",
          "CHEMBL1582511",
          "CHEMBL1583768",
          "CHEMBL1584538",
          "CHEMBL1585038",
          "CHEMBL1585808",
          "CHEMBL1586617",
          "CHEMBL1587146",
          "CHEMBL1588709",
          "CHEMBL1589201",
          "CHEMBL1589399",
          "CHEMBL1595687",
          "CHEMBL1595945",
          "CHEMBL1609697",
          "CHEMBL1609915",
          "CHEMBL1610617",
          "CHEMBL161261",
          "CHEMBL1641614",
          "CHEMBL1642468",
          "CHEMBL1642469",
          "CHEMBL1642470",
          "CHEMBL1642471",
          "CHEMBL1642472",
          "CHEMBL1642473",
          "CHEMBL1642474",
          "CHEMBL1642475",
          "CHEMBL1642476",
          "CHEMBL1642477",
          "CHEMBL1642478",
          "CHEMBL1642479",
          "CHEMBL1642480",
          "CHEMBL1642481",
          "CHEMBL1642482",
          "CHEMBL1642483",
          "CHEMBL1642484",
          "CHEMBL1642485",
          "CHEMBL1642486",
          "CHEMBL1642487",
          "CHEMBL1642488",
          "CHEMBL1642489",
          "CHEMBL1642490",
          "CHEMBL1642491",
          "CHEMBL1642492",
          "CHEMBL1642493",
          "CHEMBL1642494",
          "CHEMBL1697929",
          "CHEMBL1698073",
          "CHEMBL1698337",
          "CHEMBL1698879",
          "CHEMBL1699198",
          "CHEMBL1699874",
          "CHEMBL1700476",
          "CHEMBL1701301",
          "CHEMBL1701512",
          "CHEMBL1701679",
          "CHEMBL1702161",
          "CHEMBL1702876",
          "CHEMBL1703306",
          "CHEMBL1703414",
          "CHEMBL1703562",
          "CHEMBL1703918",
          "CHEMBL1705448",
          "CHEMBL1705499",
          "CHEMBL1705920",
          "CHEMBL1706556",
          "CHEMBL1706758",
          "CHEMBL1706988",
          "CHEMBL1707135",
          "CHEMBL1707743",
          "CHEMBL1707830",
          "CHEMBL1708047",
          "CHEMBL1708651",
          "CHEMBL1708907",
          "CHEMBL1709509",
          "CHEMBL1710048",
          "CHEMBL1710120",
          "CHEMBL1710128",
          "CHEMBL1710499",
          "CHEMBL1710711",
          "CHEMBL1712328",
          "CHEMBL1713683",
          "CHEMBL1713871",
          "CHEMBL1714617",
          "CHEMBL1715364",
          "CHEMBL1715946",
          "CHEMBL1716158",
          "CHEMBL1716369",
          "CHEMBL1716381",
          "CHEMBL1717204",
          "CHEMBL1717450",
          "CHEMBL1718965",
          "CHEMBL1719118",
          "CHEMBL1720022",
          "CHEMBL1720787",
          "CHEMBL1720892",
          "CHEMBL1721648",
          "CHEMBL1722551",
          "CHEMBL1723067",
          "CHEMBL1723453",
          "CHEMBL1723963",
          "CHEMBL1724285",
          "CHEMBL1724571",
          "CHEMBL1725011",
          "CHEMBL1726190",
          "CHEMBL1726382",
          "CHEMBL1727473",
          "CHEMBL1728485",
          "CHEMBL1728621",
          "CHEMBL1728794",
          "CHEMBL1729021",
          "CHEMBL1729376",
          "CHEMBL1729749",
          "CHEMBL1729911",
          "CHEMBL1729987",
          "CHEMBL1730555",
          "CHEMBL1731173",
          "CHEMBL1731906",
          "CHEMBL1732922",
          "CHEMBL1733129",
          "CHEMBL1733974",
          "CHEMBL1734525",
          "CHEMBL1734822",
          "CHEMBL1735215",
          "CHEMBL1735852",
          "CHEMBL1736481",
          "CHEMBL175581",
          "CHEMBL175653",
          "CHEMBL175675",
          "CHEMBL175709",
          "CHEMBL175783",
          "CHEMBL175815",
          "CHEMBL175860",
          "CHEMBL175874",
          "CHEMBL175943",
          "CHEMBL175964",
          "CHEMBL175993",
          "CHEMBL1760003",
          "CHEMBL1760012",
          "CHEMBL1760059",
          "CHEMBL1760060",
          "CHEMBL1760061",
          "CHEMBL1760062",
          "CHEMBL1760063",
          "CHEMBL1760064",
          "CHEMBL1760065",
          "CHEMBL1760066",
          "CHEMBL1760067",
          "CHEMBL1760068",
          "CHEMBL1760069",
          "CHEMBL1760070",
          "CHEMBL1760071",
          "CHEMBL1760072",
          "CHEMBL1760073",
          "CHEMBL1760074",
          "CHEMBL1760075",
          "CHEMBL1760076",
          "CHEMBL1760077",
          "CHEMBL1760078",
          "CHEMBL1760079",
          "CHEMBL1760080",
          "CHEMBL1760081",
          "CHEMBL1760082",
          "CHEMBL1760083",
          "CHEMBL1760084",
          "CHEMBL1760085",
          "CHEMBL1760086",
          "CHEMBL1760220",
          "CHEMBL1760221",
          "CHEMBL1760222",
          "CHEMBL1760223",
          "CHEMBL1760224",
          "CHEMBL1760225",
          "CHEMBL1760226",
          "CHEMBL1760227",
          "CHEMBL1760228",
          "CHEMBL1760229",
          "CHEMBL1760230",
          "CHEMBL1760231",
          "CHEMBL1760232",
          "CHEMBL1760233",
          "CHEMBL1760234",
          "CHEMBL1760235",
          "CHEMBL1760236",
          "CHEMBL1760237",
          "CHEMBL1760238",
          "CHEMBL1760239",
          "CHEMBL176024",
          "CHEMBL1760240",
          "CHEMBL1760241",
          "CHEMBL1760242",
          "CHEMBL1760243",
          "CHEMBL1760244",
          "CHEMBL1760245",
          "CHEMBL1760246",
          "CHEMBL1760247",
          "CHEMBL1760248",
          "CHEMBL1760249",
          "CHEMBL1760250",
          "CHEMBL1760251",
          "CHEMBL176079",
          "CHEMBL176081",
          "CHEMBL176088",
          "CHEMBL176092",
          "CHEMBL1761097",
          "CHEMBL1761098",
          "CHEMBL1761099",
          "CHEMBL1761100",
          "CHEMBL1761101",
          "CHEMBL1761102",
          "CHEMBL1761103",
          "CHEMBL1761104",
          "CHEMBL1761105",
          "CHEMBL1761106",
          "CHEMBL1761107",
          "CHEMBL1761108",
          "CHEMBL1761109",
          "CHEMBL1761110",
          "CHEMBL1761111",
          "CHEMBL1761112",
          "CHEMBL1761113",
          "CHEMBL1761114",
          "CHEMBL1761115",
          "CHEMBL1761116",
          "CHEMBL1761117",
          "CHEMBL1761118",
          "CHEMBL1761119",
          "CHEMBL1761120",
          "CHEMBL1761121",
          "CHEMBL1761122",
          "CHEMBL1761123",
          "CHEMBL1761124",
          "CHEMBL1761125",
          "CHEMBL1761126",
          "CHEMBL176142",
          "CHEMBL176159",
          "CHEMBL176208",
          "CHEMBL176219",
          "CHEMBL176220",
          "CHEMBL176230",
          "CHEMBL176548",
          "CHEMBL177426",
          "CHEMBL177900",
          "CHEMBL177955",
          "CHEMBL177981",
          "CHEMBL178084",
          "CHEMBL178147",
          "CHEMBL178182",
          "CHEMBL178195",
          "CHEMBL178250",
          "CHEMBL178259",
          "CHEMBL178388",
          "CHEMBL178496",
          "CHEMBL178515",
          "CHEMBL178546",
          "CHEMBL178549",
          "CHEMBL178707",
          "CHEMBL178731",
          "CHEMBL178755",
          "CHEMBL178772",
          "CHEMBL178808",
          "CHEMBL178810",
          "CHEMBL178864",
          "CHEMBL178882",
          "CHEMBL178989",
          "CHEMBL178997",
          "CHEMBL178998",
          "CHEMBL179013",
          "CHEMBL179072",
          "CHEMBL179091",
          "CHEMBL179115",
          "CHEMBL179152",
          "CHEMBL179203",
          "CHEMBL179216",
          "CHEMBL179260",
          "CHEMBL179275",
          "CHEMBL179325",
          "CHEMBL179326",
          "CHEMBL179345",
          "CHEMBL179346",
          "CHEMBL179353",
          "CHEMBL179417",
          "CHEMBL179425",
          "CHEMBL179437",
          "CHEMBL179493",
          "CHEMBL179501",
          "CHEMBL179606",
          "CHEMBL179869",
          "CHEMBL179870",
          "CHEMBL179872",
          "CHEMBL179878",
          "CHEMBL179974",
          "CHEMBL180003",
          "CHEMBL180009",
          "CHEMBL180168",
          "CHEMBL180364",
          "CHEMBL180658",
          "CHEMBL180717",
          "CHEMBL180962",
          "CHEMBL181020",
          "CHEMBL181099",
          "CHEMBL181176",
          "CHEMBL181184",
          "CHEMBL181217",
          "CHEMBL181251",
          "CHEMBL181383",
          "CHEMBL181393",
          "CHEMBL181466",
          "CHEMBL181492",
          "CHEMBL181516",
          "CHEMBL181632",
          "CHEMBL181727",
          "CHEMBL1817681",
          "CHEMBL181776",
          "CHEMBL181798",
          "CHEMBL181813",
          "CHEMBL1818777",
          "CHEMBL1818778",
          "CHEMBL1818779",
          "CHEMBL1818780",
          "CHEMBL1818781",
          "CHEMBL1818782",
          "CHEMBL1818783",
          "CHEMBL1818784",
          "CHEMBL1818785",
          "CHEMBL1818786",
          "CHEMBL1818787",
          "CHEMBL1818788",
          "CHEMBL1818789",
          "CHEMBL1818790",
          "CHEMBL1818791",
          "CHEMBL1818792",
          "CHEMBL1818793",
          "CHEMBL1818794",
          "CHEMBL1818795",
          "CHEMBL1818796",
          "CHEMBL1818797",
          "CHEMBL1818798",
          "CHEMBL1818799",
          "CHEMBL1818800",
          "CHEMBL1818801",
          "CHEMBL1818802",
          "CHEMBL1818803",
          "CHEMBL1818804",
          "CHEMBL1818805",
          "CHEMBL1818806",
          "CHEMBL1818807",
          "CHEMBL1818808",
          "CHEMBL1818809",
          "CHEMBL1818810",
          "CHEMBL1818811",
          "CHEMBL1818901",
          "CHEMBL181931",
          "CHEMBL182112",
          "CHEMBL182150",
          "CHEMBL182161",
          "CHEMBL182235",
          "CHEMBL182261",
          "CHEMBL182466",
          "CHEMBL182554",
          "CHEMBL182575",
          "CHEMBL182847",
          "CHEMBL182886",
          "CHEMBL182913",
          "CHEMBL183032",
          "CHEMBL183159",
          "CHEMBL183215",
          "CHEMBL183358",
          "CHEMBL183468",
          "CHEMBL183532",
          "CHEMBL183631",
          "CHEMBL183739",
          "CHEMBL183839",
          "CHEMBL183932",
          "CHEMBL184001",
          "CHEMBL184037",
          "CHEMBL184080",
          "CHEMBL184084",
          "CHEMBL184086",
          "CHEMBL184087",
          "CHEMBL184099",
          "CHEMBL184102",
          "CHEMBL184116",
          "CHEMBL184163",
          "CHEMBL184191",
          "CHEMBL184205",
          "CHEMBL184243",
          "CHEMBL184277",
          "CHEMBL184291",
          "CHEMBL184292",
          "CHEMBL184353",
          "CHEMBL184394",
          "CHEMBL184417",
          "CHEMBL184418",
          "CHEMBL184437",
          "CHEMBL184438",
          "CHEMBL184439",
          "CHEMBL184446",
          "CHEMBL184454",
          "CHEMBL184475",
          "CHEMBL184476",
          "CHEMBL184477",
          "CHEMBL184482",
          "CHEMBL184520",
          "CHEMBL184528",
          "CHEMBL184534",
          "CHEMBL184560",
          "CHEMBL184573",
          "CHEMBL184579",
          "CHEMBL184581",
          "CHEMBL184585",
          "CHEMBL184589",
          "CHEMBL184590",
          "CHEMBL184609",
          "CHEMBL184634",
          "CHEMBL184658",
          "CHEMBL184692",
          "CHEMBL184717",
          "CHEMBL184720",
          "CHEMBL184754",
          "CHEMBL184797",
          "CHEMBL184854",
          "CHEMBL184860",
          "CHEMBL184980",
          "CHEMBL185065",
          "CHEMBL185095",
          "CHEMBL185096",
          "CHEMBL185187",
          "CHEMBL185235",
          "CHEMBL185236",
          "CHEMBL185266",
          "CHEMBL185271",
          "CHEMBL185348",
          "CHEMBL185558",
          "CHEMBL185688",
          "CHEMBL185696",
          "CHEMBL185843",
          "CHEMBL185997",
          "CHEMBL186077",
          "CHEMBL186156",
          "CHEMBL186159",
          "CHEMBL186160",
          "CHEMBL186174",
          "CHEMBL186333",
          "CHEMBL186338",
          "CHEMBL186417",
          "CHEMBL186469",
          "CHEMBL186481",
          "CHEMBL186491",
          "CHEMBL186547",
          "CHEMBL186548",
          "CHEMBL186601",
          "CHEMBL186642",
          "CHEMBL186659",
          "CHEMBL186750",
          "CHEMBL186770",
          "CHEMBL186771",
          "CHEMBL186818",
          "CHEMBL186825",
          "CHEMBL186827",
          "CHEMBL186842",
          "CHEMBL186894",
          "CHEMBL186947",
          "CHEMBL186949",
          "CHEMBL187003",
          "CHEMBL187093",
          "CHEMBL187162",
          "CHEMBL187165",
          "CHEMBL187288",
          "CHEMBL187295",
          "CHEMBL187296",
          "CHEMBL187371",
          "CHEMBL187413",
          "CHEMBL187430",
          "CHEMBL187447",
          "CHEMBL187503",
          "CHEMBL187553",
          "CHEMBL187558",
          "CHEMBL187563",
          "CHEMBL187660",
          "CHEMBL187702",
          "CHEMBL187714",
          "CHEMBL187719",
          "CHEMBL187721",
          "CHEMBL187756",
          "CHEMBL187797",
          "CHEMBL187814",
          "CHEMBL187847",
          "CHEMBL187850",
          "CHEMBL187854",
          "CHEMBL187859",
          "CHEMBL187916",
          "CHEMBL187931",
          "CHEMBL187942",
          "CHEMBL187953",
          "CHEMBL187968",
          "CHEMBL187996",
          "CHEMBL188058",
          "CHEMBL188084",
          "CHEMBL188088",
          "CHEMBL188179",
          "CHEMBL188206",
          "CHEMBL188330",
          "CHEMBL188340",
          "CHEMBL188401",
          "CHEMBL188474",
          "CHEMBL188654",
          "CHEMBL188655",
          "CHEMBL188659",
          "CHEMBL188766",
          "CHEMBL188937",
          "CHEMBL188988",
          "CHEMBL188991",
          "CHEMBL189029",
          "CHEMBL189043",
          "CHEMBL189083",
          "CHEMBL189118",
          "CHEMBL189147",
          "CHEMBL189190",
          "CHEMBL189282",
          "CHEMBL189492",
          "CHEMBL189496",
          "CHEMBL189508",
          "CHEMBL189602",
          "CHEMBL189611",
          "CHEMBL189650",
          "CHEMBL189653",
          "CHEMBL189756",
          "CHEMBL190068",
          "CHEMBL190219",
          "CHEMBL190401",
          "CHEMBL190775",
          "CHEMBL190780",
          "CHEMBL190842",
          "CHEMBL190875",
          "CHEMBL191078",
          "CHEMBL191079",
          "CHEMBL191388",
          "CHEMBL191390",
          "CHEMBL191393",
          "CHEMBL191409",
          "CHEMBL1914463",
          "CHEMBL1914623",
          "CHEMBL1914624",
          "CHEMBL1914625",
          "CHEMBL1914626",
          "CHEMBL1914627",
          "CHEMBL1914628",
          "CHEMBL1914629",
          "CHEMBL1914630",
          "CHEMBL1914631",
          "CHEMBL1914632",
          "CHEMBL1914633",
          "CHEMBL1914634",
          "CHEMBL1914635",
          "CHEMBL1914636",
          "CHEMBL1914637",
          "CHEMBL1914638",
          "CHEMBL1914639",
          "CHEMBL1914640",
          "CHEMBL1914641",
          "CHEMBL1914642",
          "CHEMBL1914643",
          "CHEMBL1914644",
          "CHEMBL1914645",
          "CHEMBL1914646",
          "CHEMBL1914647",
          "CHEMBL1914648",
          "CHEMBL1914649",
          "CHEMBL1914650",
          "CHEMBL1914651",
          "CHEMBL1914849",
          "CHEMBL1914850",
          "CHEMBL1914851",
          "CHEMBL1914852",
          "CHEMBL1914853",
          "CHEMBL1914854",
          "CHEMBL1914855",
          "CHEMBL1914856",
          "CHEMBL1914857",
          "CHEMBL1914858",
          "CHEMBL1914859",
          "CHEMBL1914860",
          "CHEMBL1922249",
          "CHEMBL1922250",
          "CHEMBL1922251",
          "CHEMBL1922252",
          "CHEMBL1922253",
          "CHEMBL1922254",
          "CHEMBL1922255",
          "CHEMBL1922256",
          "CHEMBL1922257",
          "CHEMBL1922258",
          "CHEMBL1922259",
          "CHEMBL1922260",
          "CHEMBL1922261",
          "CHEMBL1922262",
          "CHEMBL1922263",
          "CHEMBL1922264",
          "CHEMBL1922265",
          "CHEMBL1922266",
          "CHEMBL1922267",
          "CHEMBL1922268",
          "CHEMBL1922269",
          "CHEMBL1922270",
          "CHEMBL1922271",
          "CHEMBL192266",
          "CHEMBL192923",
          "CHEMBL193164",
          "CHEMBL193260",
          "CHEMBL1933085",
          "CHEMBL1934102",
          "CHEMBL193438",
          "CHEMBL193473",
          "CHEMBL1934811",
          "CHEMBL1934812",
          "CHEMBL1934813",
          "CHEMBL1934814",
          "CHEMBL1934815",
          "CHEMBL1934816",
          "CHEMBL1934817",
          "CHEMBL1934818",
          "CHEMBL1934819",
          "CHEMBL1934820",
          "CHEMBL1934821",
          "CHEMBL1934822",
          "CHEMBL1934823",
          "CHEMBL1934824",
          "CHEMBL1934825",
          "CHEMBL1934826",
          "CHEMBL1934827",
          "CHEMBL1934828",
          "CHEMBL1934829",
          "CHEMBL1934830",
          "CHEMBL1934831",
          "CHEMBL1934832",
          "CHEMBL1934833",
          "CHEMBL1934834",
          "CHEMBL1934835",
          "CHEMBL1934836",
          "CHEMBL1934837",
          "CHEMBL1934838",
          "CHEMBL1934839",
          "CHEMBL1934840",
          "CHEMBL1934841",
          "CHEMBL193489",
          "CHEMBL193576",
          "CHEMBL193666",
          "CHEMBL193771",
          "CHEMBL193970",
          "CHEMBL194046",
          "CHEMBL194122",
          "CHEMBL194173",
          "CHEMBL194253",
          "CHEMBL194292",
          "CHEMBL194342",
          "CHEMBL194408",
          "CHEMBL194417",
          "CHEMBL194459",
          "CHEMBL194468",
          "CHEMBL194477",
          "CHEMBL194484",
          "CHEMBL194521",
          "CHEMBL194523",
          "CHEMBL194530",
          "CHEMBL194531",
          "CHEMBL194564",
          "CHEMBL194576",
          "CHEMBL194583",
          "CHEMBL194602",
          "CHEMBL194630",
          "CHEMBL194691",
          "CHEMBL194697",
          "CHEMBL194726",
          "CHEMBL194731",
          "CHEMBL194759",
          "CHEMBL194789",
          "CHEMBL194837",
          "CHEMBL194946",
          "CHEMBL194950",
          "CHEMBL194997",
          "CHEMBL195006",
          "CHEMBL195022",
          "CHEMBL195123",
          "CHEMBL195250",
          "CHEMBL195255",
          "CHEMBL195346",
          "CHEMBL195350",
          "CHEMBL195351",
          "CHEMBL195380",
          "CHEMBL195435",
          "CHEMBL195511",
          "CHEMBL195635",
          "CHEMBL195810",
          "CHEMBL196004",
          "CHEMBL196091",
          "CHEMBL196168",
          "CHEMBL196196",
          "CHEMBL196208",
          "CHEMBL196223",
          "CHEMBL196273",
          "CHEMBL196277",
          "CHEMBL196350",
          "CHEMBL196360",
          "CHEMBL196362",
          "CHEMBL1965537",
          "CHEMBL1965555",
          "CHEMBL196567",
          "CHEMBL196573",
          "CHEMBL196581",
          "CHEMBL196591",
          "CHEMBL196620",
          "CHEMBL196627",
          "CHEMBL196667",
          "CHEMBL1966758",
          "CHEMBL196681",
          "CHEMBL196686",
          "CHEMBL1966941",
          "CHEMBL1967160",
          "CHEMBL1967208",
          "CHEMBL1968058",
          "CHEMBL196819",
          "CHEMBL1968631",
          "CHEMBL196864",
          "CHEMBL196898",
          "CHEMBL1969065",
          "CHEMBL196972",
          "CHEMBL196973",
          "CHEMBL197005",
          "CHEMBL1970107",
          "CHEMBL197023",
          "CHEMBL197026",
          "CHEMBL197050",
          "CHEMBL197058",
          "CHEMBL197059",
          "CHEMBL197065",
          "CHEMBL197145",
          "CHEMBL1972164",
          "CHEMBL1972271",
          "CHEMBL197232",
          "CHEMBL197245",
          "CHEMBL197279",
          "CHEMBL197280",
          "CHEMBL197281",
          "CHEMBL197283",
          "CHEMBL1973416",
          "CHEMBL1973528",
          "CHEMBL197395",
          "CHEMBL1974221",
          "CHEMBL197429",
          "CHEMBL1974290",
          "CHEMBL197485",
          "CHEMBL197497",
          "CHEMBL1977285",
          "CHEMBL1977747",
          "CHEMBL1977847",
          "CHEMBL197797",
          "CHEMBL197849",
          "CHEMBL1978853",
          "CHEMBL1979161",
          "CHEMBL1979415",
          "CHEMBL1979763",
          "CHEMBL1980701",
          "CHEMBL1981724",
          "CHEMBL1982060",
          "CHEMBL1982410",
          "CHEMBL1982532",
          "CHEMBL198361",
          "CHEMBL198483",
          "CHEMBL1985305",
          "CHEMBL198562",
          "CHEMBL1985845",
          "CHEMBL198588",
          "CHEMBL1985907",
          "CHEMBL198689",
          "CHEMBL198692",
          "CHEMBL198724",
          "CHEMBL1987263",
          "CHEMBL198727",
          "CHEMBL1987752",
          "CHEMBL198789",
          "CHEMBL198823",
          "CHEMBL198835",
          "CHEMBL198890",
          "CHEMBL1988961",
          "CHEMBL198945",
          "CHEMBL1989553",
          "CHEMBL198968",
          "CHEMBL198969",
          "CHEMBL1989820",
          "CHEMBL199025",
          "CHEMBL199179",
          "CHEMBL199222",
          "CHEMBL199274",
          "CHEMBL1992915",
          "CHEMBL1993067",
          "CHEMBL1993324",
          "CHEMBL1993900",
          "CHEMBL1994128",
          "CHEMBL1995732",
          "CHEMBL1995837",
          "CHEMBL1996268",
          "CHEMBL1997514",
          "CHEMBL1997956",
          "CHEMBL1999025",
          "CHEMBL1999375",
          "CHEMBL1999570",
          "CHEMBL1999861",
          "CHEMBL2000524",
          "CHEMBL2001553",
          "CHEMBL2001833",
          "CHEMBL2003244",
          "CHEMBL2005330",
          "CHEMBL2005445",
          "CHEMBL2006687",
          "CHEMBL2007325",
          "CHEMBL2011528",
          "CHEMBL2011529",
          "CHEMBL2011532",
          "CHEMBL2011533",
          "CHEMBL2011534",
          "CHEMBL2011535",
          "CHEMBL2011537",
          "CHEMBL2016580",
          "CHEMBL2016698",
          "CHEMBL2016699",
          "CHEMBL2016700",
          "CHEMBL2016701",
          "CHEMBL2016702",
          "CHEMBL2016703",
          "CHEMBL2016704",
          "CHEMBL2016705",
          "CHEMBL2016706",
          "CHEMBL2016707",
          "CHEMBL2016708",
          "CHEMBL2016709",
          "CHEMBL2016710",
          "CHEMBL2016711",
          "CHEMBL2016712",
          "CHEMBL2016713",
          "CHEMBL2016714",
          "CHEMBL2016715",
          "CHEMBL2016716",
          "CHEMBL2016717",
          "CHEMBL2016718",
          "CHEMBL2016719",
          "CHEMBL2016720",
          "CHEMBL2016721",
          "CHEMBL2016722",
          "CHEMBL2016723",
          "CHEMBL2016724",
          "CHEMBL2016725",
          "CHEMBL2016726",
          "CHEMBL2016727",
          "CHEMBL2016728",
          "CHEMBL2016729",
          "CHEMBL2016730",
          "CHEMBL2016731",
          "CHEMBL2016772",
          "CHEMBL2016773",
          "CHEMBL2016774",
          "CHEMBL2016775",
          "CHEMBL2016776",
          "CHEMBL2016777",
          "CHEMBL2016778",
          "CHEMBL2016779",
          "CHEMBL2016780",
          "CHEMBL2016781",
          "CHEMBL2016782",
          "CHEMBL2016783",
          "CHEMBL2016784",
          "CHEMBL2016785",
          "CHEMBL2016786",
          "CHEMBL2017587",
          "CHEMBL2017588",
          "CHEMBL2017589",
          "CHEMBL2017590",
          "CHEMBL2017591",
          "CHEMBL2017592",
          "CHEMBL2017593",
          "CHEMBL2017594",
          "CHEMBL2017595",
          "CHEMBL2017596",
          "CHEMBL2017597",
          "CHEMBL2017598",
          "CHEMBL2017599",
          "CHEMBL2017600",
          "CHEMBL2017601",
          "CHEMBL2017602",
          "CHEMBL2017603",
          "CHEMBL2017604",
          "CHEMBL2017605",
          "CHEMBL2017606",
          "CHEMBL2017607",
          "CHEMBL2017608",
          "CHEMBL2017609",
          "CHEMBL2017610",
          "CHEMBL2017611",
          "CHEMBL2017612",
          "CHEMBL2017613",
          "CHEMBL2017614",
          "CHEMBL2017615",
          "CHEMBL2017616",
          "CHEMBL2017617",
          "CHEMBL2017618",
          "CHEMBL2017740",
          "CHEMBL2017741",
          "CHEMBL2017742",
          "CHEMBL2017743",
          "CHEMBL2017744",
          "CHEMBL2017745",
          "CHEMBL2017746",
          "CHEMBL2017747",
          "CHEMBL2017748",
          "CHEMBL2017749",
          "CHEMBL2017750",
          "CHEMBL2017751",
          "CHEMBL2017752",
          "CHEMBL2017753",
          "CHEMBL2017754",
          "CHEMBL2017755",
          "CHEMBL2017756",
          "CHEMBL2017757",
          "CHEMBL2017758",
          "CHEMBL2017759",
          "CHEMBL2017760",
          "CHEMBL2017761",
          "CHEMBL2017762",
          "CHEMBL2017763",
          "CHEMBL2017764",
          "CHEMBL2017765",
          "CHEMBL201813",
          "CHEMBL202095",
          "CHEMBL2021397",
          "CHEMBL202563",
          "CHEMBL202741",
          "CHEMBL202854",
          "CHEMBL2029372",
          "CHEMBL2031573",
          "CHEMBL2031574",
          "CHEMBL2031575",
          "CHEMBL2031576",
          "CHEMBL2031577",
          "CHEMBL2031578",
          "CHEMBL203161",
          "CHEMBL203166",
          "CHEMBL2031715",
          "CHEMBL2031716",
          "CHEMBL2031717",
          "CHEMBL2031718",
          "CHEMBL2031719",
          "CHEMBL2031720",
          "CHEMBL2031721",
          "CHEMBL2031722",
          "CHEMBL2031723",
          "CHEMBL2031724",
          "CHEMBL2031725",
          "CHEMBL2031726",
          "CHEMBL2031727",
          "CHEMBL2031728",
          "CHEMBL2031729",
          "CHEMBL2031730",
          "CHEMBL2031731",
          "CHEMBL2031732",
          "CHEMBL2031733",
          "CHEMBL2031734",
          "CHEMBL2031735",
          "CHEMBL2031736",
          "CHEMBL2032047",
          "CHEMBL2032048",
          "CHEMBL2032049",
          "CHEMBL203388",
          "CHEMBL203445",
          "CHEMBL203504",
          "CHEMBL203544",
          "CHEMBL203549",
          "CHEMBL203558",
          "CHEMBL203586",
          "CHEMBL203699",
          "CHEMBL203804",
          "CHEMBL203820",
          "CHEMBL203858",
          "CHEMBL203917",
          "CHEMBL203929",
          "CHEMBL204082",
          "CHEMBL204161",
          "CHEMBL204168",
          "CHEMBL204212",
          "CHEMBL204407",
          "CHEMBL204428",
          "CHEMBL204508",
          "CHEMBL204514",
          "CHEMBL204798",
          "CHEMBL204801",
          "CHEMBL204828",
          "CHEMBL204881",
          "CHEMBL204912",
          "CHEMBL204952",
          "CHEMBL204968",
          "CHEMBL205106",
          "CHEMBL205111",
          "CHEMBL205112",
          "CHEMBL205115",
          "CHEMBL205285",
          "CHEMBL205397",
          "CHEMBL205492",
          "CHEMBL205493",
          "CHEMBL205741",
          "CHEMBL205760",
          "CHEMBL205838",
          "CHEMBL205874",
          "CHEMBL2059408",
          "CHEMBL2059409",
          "CHEMBL2059410",
          "CHEMBL2059411",
          "CHEMBL2059412",
          "CHEMBL2059413",
          "CHEMBL2059414",
          "CHEMBL2059415",
          "CHEMBL2059416",
          "CHEMBL2059417",
          "CHEMBL2059418",
          "CHEMBL2059419",
          "CHEMBL2059420",
          "CHEMBL2059421",
          "CHEMBL2059422",
          "CHEMBL2059423",
          "CHEMBL2059424",
          "CHEMBL2059425",
          "CHEMBL2059426",
          "CHEMBL2059511",
          "CHEMBL2059512",
          "CHEMBL2059513",
          "CHEMBL2059514",
          "CHEMBL205979",
          "CHEMBL206030",
          "CHEMBL206081",
          "CHEMBL206195",
          "CHEMBL206248",
          "CHEMBL206314",
          "CHEMBL206498",
          "CHEMBL206503",
          "CHEMBL206616",
          "CHEMBL206637",
          "CHEMBL206813",
          "CHEMBL206825",
          "CHEMBL206831",
          "CHEMBL2068743",
          "CHEMBL2068744",
          "CHEMBL2068749",
          "CHEMBL2068750",
          "CHEMBL206953",
          "CHEMBL207257",
          "CHEMBL207296",
          "CHEMBL207300",
          "CHEMBL207308",
          "CHEMBL207668",
          "CHEMBL208025",
          "CHEMBL208028",
          "CHEMBL208081",
          "CHEMBL208275",
          "CHEMBL208340",
          "CHEMBL208473",
          "CHEMBL208573",
          "CHEMBL208635",
          "CHEMBL208688",
          "CHEMBL208827",
          "CHEMBL208931",
          "CHEMBL208970",
          "CHEMBL209050",
          "CHEMBL209059",
          "CHEMBL209089",
          "CHEMBL209103",
          "CHEMBL209109",
          "CHEMBL209123",
          "CHEMBL209416",
          "CHEMBL209504",
          "CHEMBL209510",
          "CHEMBL209526",
          "CHEMBL209542",
          "CHEMBL209584",
          "CHEMBL209590",
          "CHEMBL2096766",
          "CHEMBL2096889",
          "CHEMBL209754",
          "CHEMBL209828",
          "CHEMBL209895",
          "CHEMBL209905",
          "CHEMBL209935",
          "CHEMBL209964",
          "CHEMBL209993",
          "CHEMBL210069",
          "CHEMBL210155",
          "CHEMBL210167",
          "CHEMBL210255",
          "CHEMBL210273",
          "CHEMBL210274",
          "CHEMBL210343",
          "CHEMBL210344",
          "CHEMBL210408",
          "CHEMBL210436",
          "CHEMBL210481",
          "CHEMBL210531",
          "CHEMBL210532",
          "CHEMBL210715",
          "CHEMBL210818",
          "CHEMBL210857",
          "CHEMBL211005",
          "CHEMBL2110360",
          "CHEMBL211058",
          "CHEMBL211069",
          "CHEMBL211139",
          "CHEMBL211166",
          "CHEMBL211232",
          "CHEMBL2112322",
          "CHEMBL211258",
          "CHEMBL211285",
          "CHEMBL2112988",
          "CHEMBL2112989",
          "CHEMBL211311",
          "CHEMBL2113218",
          "CHEMBL2113245",
          "CHEMBL211335",
          "CHEMBL211492",
          "CHEMBL211504",
          "CHEMBL211511",
          "CHEMBL211615",
          "CHEMBL211619",
          "CHEMBL211672",
          "CHEMBL211736",
          "CHEMBL211746",
          "CHEMBL211820",
          "CHEMBL211934",
          "CHEMBL211956",
          "CHEMBL211964",
          "CHEMBL211978",
          "CHEMBL211984",
          "CHEMBL212032",
          "CHEMBL212093",
          "CHEMBL212135",
          "CHEMBL212136",
          "CHEMBL212142",
          "CHEMBL212159",
          "CHEMBL212210",
          "CHEMBL212230",
          "CHEMBL212254",
          "CHEMBL212256",
          "CHEMBL212265",
          "CHEMBL212330",
          "CHEMBL212344",
          "CHEMBL212487",
          "CHEMBL212488",
          "CHEMBL212508",
          "CHEMBL212573",
          "CHEMBL212671",
          "CHEMBL212715",
          "CHEMBL212750",
          "CHEMBL212756",
          "CHEMBL212758",
          "CHEMBL212829",
          "CHEMBL212874",
          "CHEMBL212875",
          "CHEMBL212890",
          "CHEMBL212922",
          "CHEMBL212927",
          "CHEMBL212941",
          "CHEMBL212955",
          "CHEMBL212979",
          "CHEMBL212983",
          "CHEMBL213010",
          "CHEMBL213050",
          "CHEMBL213052",
          "CHEMBL213089",
          "CHEMBL213171",
          "CHEMBL213187",
          "CHEMBL213198",
          "CHEMBL213255",
          "CHEMBL213363",
          "CHEMBL213370",
          "CHEMBL213383",
          "CHEMBL213386",
          "CHEMBL213459",
          "CHEMBL213464",
          "CHEMBL213465",
          "CHEMBL213491",
          "CHEMBL213540",
          "CHEMBL213641",
          "CHEMBL213642",
          "CHEMBL213649",
          "CHEMBL213658",
          "CHEMBL213715",
          "CHEMBL213761",
          "CHEMBL213767",
          "CHEMBL213771",
          "CHEMBL213817",
          "CHEMBL213835",
          "CHEMBL213840",
          "CHEMBL213873",
          "CHEMBL213898",
          "CHEMBL213922",
          "CHEMBL213923",
          "CHEMBL213932",
          "CHEMBL213933",
          "CHEMBL213946",
          "CHEMBL213949",
          "CHEMBL213966",
          "CHEMBL213973",
          "CHEMBL214019",
          "CHEMBL214020",
          "CHEMBL214021",
          "CHEMBL214075",
          "CHEMBL214078",
          "CHEMBL214081",
          "CHEMBL214103",
          "CHEMBL214123",
          "CHEMBL214125",
          "CHEMBL214126",
          "CHEMBL214177",
          "CHEMBL214178",
          "CHEMBL214181",
          "CHEMBL214185",
          "CHEMBL214221",
          "CHEMBL214223",
          "CHEMBL214227",
          "CHEMBL214252",
          "CHEMBL214254",
          "CHEMBL214276",
          "CHEMBL214278",
          "CHEMBL214280",
          "CHEMBL214318",
          "CHEMBL214322",
          "CHEMBL214323",
          "CHEMBL214377",
          "CHEMBL214382",
          "CHEMBL214383",
          "CHEMBL214413",
          "CHEMBL214417",
          "CHEMBL214432",
          "CHEMBL214441",
          "CHEMBL214442",
          "CHEMBL214450",
          "CHEMBL214468",
          "CHEMBL214470",
          "CHEMBL214482",
          "CHEMBL214494",
          "CHEMBL214497",
          "CHEMBL214499",
          "CHEMBL214504",
          "CHEMBL214513",
          "CHEMBL214516",
          "CHEMBL214523",
          "CHEMBL214527",
          "CHEMBL214532",
          "CHEMBL214535",
          "CHEMBL214541",
          "CHEMBL214547",
          "CHEMBL214571",
          "CHEMBL214577",
          "CHEMBL214583",
          "CHEMBL214584",
          "CHEMBL214585",
          "CHEMBL214604",
          "CHEMBL214606",
          "CHEMBL214629",
          "CHEMBL214649",
          "CHEMBL214650",
          "CHEMBL214660",
          "CHEMBL2146615",
          "CHEMBL214663",
          "CHEMBL214667",
          "CHEMBL214670",
          "CHEMBL214678",
          "CHEMBL214679",
          "CHEMBL214684",
          "CHEMBL214715",
          "CHEMBL214717",
          "CHEMBL214726",
          "CHEMBL214731",
          "CHEMBL2147476",
          "CHEMBL214750",
          "CHEMBL214766",
          "CHEMBL214767",
          "CHEMBL214768",
          "CHEMBL214774",
          "CHEMBL214778",
          "CHEMBL214779",
          "CHEMBL214790",
          "CHEMBL214806",
          "CHEMBL214808",
          "CHEMBL214817",
          "CHEMBL214843",
          "CHEMBL214858",
          "CHEMBL214871",
          "CHEMBL214888",
          "CHEMBL214891",
          "CHEMBL214907",
          "CHEMBL214916",
          "CHEMBL214936",
          "CHEMBL214941",
          "CHEMBL214944",
          "CHEMBL214946",
          "CHEMBL214957",
          "CHEMBL214968",
          "CHEMBL214979",
          "CHEMBL214983",
          "CHEMBL214984",
          "CHEMBL214985",
          "CHEMBL214991",
          "CHEMBL215004",
          "CHEMBL215005",
          "CHEMBL215030",
          "CHEMBL215039",
          "CHEMBL215040",
          "CHEMBL215041",
          "CHEMBL215067",
          "CHEMBL215075",
          "CHEMBL215078",
          "CHEMBL215082",
          "CHEMBL215113",
          "CHEMBL215114",
          "CHEMBL215118",
          "CHEMBL215131",
          "CHEMBL215138",
          "CHEMBL215141",
          "CHEMBL215204",
          "CHEMBL215224",
          "CHEMBL215235",
          "CHEMBL215241",
          "CHEMBL215257",
          "CHEMBL215258",
          "CHEMBL215259",
          "CHEMBL215261",
          "CHEMBL215266",
          "CHEMBL215273",
          "CHEMBL215277",
          "CHEMBL215278",
          "CHEMBL215279",
          "CHEMBL215281",
          "CHEMBL215286",
          "CHEMBL215307",
          "CHEMBL215308",
          "CHEMBL215316",
          "CHEMBL215321",
          "CHEMBL215331",
          "CHEMBL215338",
          "CHEMBL215359",
          "CHEMBL215364",
          "CHEMBL215374",
          "CHEMBL215388",
          "CHEMBL215418",
          "CHEMBL215446",
          "CHEMBL215457",
          "CHEMBL215493",
          "CHEMBL215501",
          "CHEMBL215508",
          "CHEMBL215526",
          "CHEMBL215550",
          "CHEMBL215567",
          "CHEMBL215580",
          "CHEMBL215586",
          "CHEMBL215591",
          "CHEMBL215614",
          "CHEMBL215619",
          "CHEMBL215621",
          "CHEMBL215624",
          "CHEMBL215631",
          "CHEMBL215635",
          "CHEMBL215648",
          "CHEMBL215649",
          "CHEMBL215660",
          "CHEMBL215661",
          "CHEMBL215662",
          "CHEMBL215666",
          "CHEMBL215695",
          "CHEMBL215696",
          "CHEMBL215728",
          "CHEMBL215754",
          "CHEMBL215782",
          "CHEMBL215819",
          "CHEMBL215841",
          "CHEMBL215850",
          "CHEMBL215873",
          "CHEMBL215898",
          "CHEMBL215920",
          "CHEMBL215934",
          "CHEMBL215945",
          "CHEMBL215951",
          "CHEMBL215955",
          "CHEMBL215958",
          "CHEMBL215964",
          "CHEMBL215965",
          "CHEMBL215981",
          "CHEMBL215989",
          "CHEMBL216008",
          "CHEMBL216010",
          "CHEMBL216038",
          "CHEMBL216050",
          "CHEMBL216054",
          "CHEMBL216056",
          "CHEMBL216066",
          "CHEMBL216068",
          "CHEMBL216103",
          "CHEMBL216104",
          "CHEMBL216117",
          "CHEMBL216133",
          "CHEMBL216145",
          "CHEMBL216180",
          "CHEMBL216184",
          "CHEMBL216187",
          "CHEMBL216190",
          "CHEMBL216192",
          "CHEMBL216209",
          "CHEMBL216225",
          "CHEMBL216228",
          "CHEMBL216241",
          "CHEMBL216242",
          "CHEMBL216267",
          "CHEMBL216280",
          "CHEMBL216286",
          "CHEMBL216314",
          "CHEMBL216315",
          "CHEMBL216323",
          "CHEMBL216324",
          "CHEMBL216342",
          "CHEMBL216356",
          "CHEMBL216362",
          "CHEMBL216368",
          "CHEMBL216372",
          "CHEMBL216406",
          "CHEMBL216407",
          "CHEMBL216428",
          "CHEMBL216429",
          "CHEMBL216430",
          "CHEMBL216454",
          "CHEMBL216455",
          "CHEMBL216456",
          "CHEMBL216460",
          "CHEMBL216471",
          "CHEMBL216472",
          "CHEMBL216482",
          "CHEMBL216486",
          "CHEMBL216510",
          "CHEMBL216524",
          "CHEMBL216554",
          "CHEMBL216561",
          "CHEMBL216564",
          "CHEMBL216565",
          "CHEMBL216570",
          "CHEMBL216576",
          "CHEMBL216577",
          "CHEMBL216580",
          "CHEMBL216680",
          "CHEMBL216681",
          "CHEMBL216741",
          "CHEMBL216751",
          "CHEMBL216754",
          "CHEMBL216765",
          "CHEMBL216777",
          "CHEMBL216817",
          "CHEMBL216820",
          "CHEMBL216821",
          "CHEMBL216828",
          "CHEMBL216935",
          "CHEMBL216950",
          "CHEMBL216953",
          "CHEMBL216959",
          "CHEMBL216964",
          "CHEMBL217061",
          "CHEMBL217078",
          "CHEMBL217079",
          "CHEMBL217080",
          "CHEMBL217105",
          "CHEMBL217114",
          "CHEMBL217132",
          "CHEMBL217140",
          "CHEMBL217158",
          "CHEMBL217159",
          "CHEMBL217171",
          "CHEMBL217178",
          "CHEMBL217182",
          "CHEMBL217193",
          "CHEMBL217196",
          "CHEMBL217207",
          "CHEMBL217210",
          "CHEMBL217228",
          "CHEMBL217233",
          "CHEMBL217257",
          "CHEMBL217262",
          "CHEMBL217269",
          "CHEMBL217300",
          "CHEMBL217349",
          "CHEMBL217351",
          "CHEMBL217356",
          "CHEMBL217400",
          "CHEMBL217403",
          "CHEMBL217410",
          "CHEMBL217430",
          "CHEMBL217435",
          "CHEMBL217442",
          "CHEMBL217459",
          "CHEMBL217460",
          "CHEMBL217462",
          "CHEMBL217480",
          "CHEMBL217487",
          "CHEMBL217495",
          "CHEMBL217502",
          "CHEMBL217528",
          "CHEMBL217535",
          "CHEMBL217544",
          "CHEMBL217550",
          "CHEMBL217557",
          "CHEMBL217560",
          "CHEMBL217574",
          "CHEMBL217575",
          "CHEMBL217581",
          "CHEMBL217593",
          "CHEMBL217605",
          "CHEMBL217610",
          "CHEMBL217614",
          "CHEMBL217618",
          "CHEMBL217626",
          "CHEMBL217637",
          "CHEMBL217653",
          "CHEMBL217678",
          "CHEMBL217699",
          "CHEMBL217706",
          "CHEMBL217707",
          "CHEMBL217712",
          "CHEMBL217733",
          "CHEMBL217751",
          "CHEMBL217761",
          "CHEMBL217789",
          "CHEMBL217812",
          "CHEMBL217820",
          "CHEMBL217843",
          "CHEMBL217844",
          "CHEMBL217845",
          "CHEMBL217857",
          "CHEMBL217860",
          "CHEMBL217861",
          "CHEMBL217875",
          "CHEMBL217887",
          "CHEMBL217925",
          "CHEMBL218030",
          "CHEMBL218031",
          "CHEMBL218077",
          "CHEMBL228289",
          "CHEMBL228293",
          "CHEMBL228294",
          "CHEMBL228987",
          "CHEMBL229092",
          "CHEMBL229093",
          "CHEMBL229112",
          "CHEMBL229113",
          "CHEMBL229164",
          "CHEMBL229171",
          "CHEMBL229172",
          "CHEMBL229177",
          "CHEMBL229178",
          "CHEMBL229223",
          "CHEMBL229229",
          "CHEMBL229230",
          "CHEMBL229285",
          "CHEMBL229290",
          "CHEMBL229291",
          "CHEMBL229339",
          "CHEMBL229348",
          "CHEMBL229350",
          "CHEMBL229406",
          "CHEMBL229407",
          "CHEMBL229408",
          "CHEMBL229461",
          "CHEMBL229462",
          "CHEMBL229463",
          "CHEMBL229504",
          "CHEMBL229505",
          "CHEMBL229512",
          "CHEMBL229556",
          "CHEMBL229557",
          "CHEMBL229609",
          "CHEMBL229610",
          "CHEMBL229664",
          "CHEMBL229665",
          "CHEMBL229715",
          "CHEMBL229716",
          "CHEMBL229739",
          "CHEMBL229767",
          "CHEMBL229768",
          "CHEMBL229769",
          "CHEMBL229791",
          "CHEMBL229792",
          "CHEMBL229793",
          "CHEMBL229822",
          "CHEMBL229823",
          "CHEMBL229824",
          "CHEMBL229870",
          "CHEMBL229871",
          "CHEMBL229875",
          "CHEMBL229876",
          "CHEMBL229877",
          "CHEMBL229925",
          "CHEMBL229926",
          "CHEMBL229929",
          "CHEMBL229930",
          "CHEMBL229931",
          "CHEMBL229979",
          "CHEMBL229980",
          "CHEMBL229981",
          "CHEMBL229983",
          "CHEMBL229986",
          "CHEMBL229988",
          "CHEMBL230080",
          "CHEMBL230082",
          "CHEMBL230083",
          "CHEMBL230307",
          "CHEMBL230521",
          "CHEMBL230625",
          "CHEMBL230626",
          "CHEMBL230627",
          "CHEMBL230940",
          "CHEMBL231044",
          "CHEMBL231147",
          "CHEMBL231216",
          "CHEMBL231651",
          "CHEMBL231652",
          "CHEMBL231814",
          "CHEMBL231815",
          "CHEMBL231816",
          "CHEMBL232027",
          "CHEMBL232209",
          "CHEMBL232231",
          "CHEMBL232257",
          "CHEMBL232438",
          "CHEMBL232439",
          "CHEMBL232619",
          "CHEMBL232634",
          "CHEMBL232662",
          "CHEMBL232823",
          "CHEMBL232834",
          "CHEMBL232835",
          "CHEMBL232858",
          "CHEMBL233027",
          "CHEMBL2337724",
          "CHEMBL2337725",
          "CHEMBL2337726",
          "CHEMBL2337727",
          "CHEMBL2337728",
          "CHEMBL2337729",
          "CHEMBL2337730",
          "CHEMBL2337731",
          "CHEMBL2337732",
          "CHEMBL2337733",
          "CHEMBL2337734",
          "CHEMBL2337735",
          "CHEMBL2337736",
          "CHEMBL2337737",
          "CHEMBL2337738",
          "CHEMBL2337739",
          "CHEMBL2337740",
          "CHEMBL2337741",
          "CHEMBL2337742",
          "CHEMBL2337743",
          "CHEMBL2337744",
          "CHEMBL2337745",
          "CHEMBL2337746",
          "CHEMBL2337747",
          "CHEMBL2337748",
          "CHEMBL2337749",
          "CHEMBL2337750",
          "CHEMBL2337751",
          "CHEMBL2337752",
          "CHEMBL2337753",
          "CHEMBL2337754",
          "CHEMBL2337755",
          "CHEMBL2337756",
          "CHEMBL2337757",
          "CHEMBL2337758",
          "CHEMBL2337759",
          "CHEMBL2337760",
          "CHEMBL2337761",
          "CHEMBL2337762",
          "CHEMBL233889",
          "CHEMBL234920",
          "CHEMBL234929",
          "CHEMBL234930",
          "CHEMBL234931",
          "CHEMBL236888",
          "CHEMBL236889",
          "CHEMBL237098",
          "CHEMBL237099",
          "CHEMBL237318",
          "CHEMBL237531",
          "CHEMBL237532",
          "CHEMBL237748",
          "CHEMBL237959",
          "CHEMBL238605",
          "CHEMBL238606",
          "CHEMBL239468",
          "CHEMBL239871",
          "CHEMBL239904",
          "CHEMBL239905",
          "CHEMBL240115",
          "CHEMBL240116",
          "CHEMBL240126",
          "CHEMBL240287",
          "CHEMBL240339",
          "CHEMBL240341",
          "CHEMBL240537",
          "CHEMBL240912",
          "CHEMBL240939",
          "CHEMBL240940",
          "CHEMBL241375",
          "CHEMBL241376",
          "CHEMBL241587",
          "CHEMBL241588",
          "CHEMBL241589",
          "CHEMBL241795",
          "CHEMBL243045",
          "CHEMBL245135",
          "CHEMBL245642",
          "CHEMBL245844",
          "CHEMBL245846",
          "CHEMBL246050",
          "CHEMBL246051",
          "CHEMBL246258",
          "CHEMBL246259",
          "CHEMBL246464",
          "CHEMBL246588",
          "CHEMBL246590",
          "CHEMBL246741",
          "CHEMBL246790",
          "CHEMBL246794",
          "CHEMBL246992",
          "CHEMBL247283",
          "CHEMBL247566",
          "CHEMBL247688",
          "CHEMBL247689",
          "CHEMBL247764",
          "CHEMBL247891",
          "CHEMBL248266",
          "CHEMBL248267",
          "CHEMBL248295",
          "CHEMBL248296",
          "CHEMBL248297",
          "CHEMBL248462",
          "CHEMBL248673",
          "CHEMBL248694",
          "CHEMBL248863",
          "CHEMBL248881",
          "CHEMBL249489",
          "CHEMBL249714",
          "CHEMBL249716",
          "CHEMBL250118",
          "CHEMBL250122",
          "CHEMBL250123",
          "CHEMBL250124",
          "CHEMBL250311",
          "CHEMBL250319",
          "CHEMBL250321",
          "CHEMBL250326",
          "CHEMBL250327",
          "CHEMBL250516",
          "CHEMBL250526",
          "CHEMBL250527",
          "CHEMBL250528",
          "CHEMBL250530",
          "CHEMBL250540",
          "CHEMBL250541",
          "CHEMBL250544",
          "CHEMBL250728",
          "CHEMBL250729",
          "CHEMBL250730",
          "CHEMBL250746",
          "CHEMBL250926",
          "CHEMBL250927",
          "CHEMBL251290",
          "CHEMBL251701",
          "CHEMBL251702",
          "CHEMBL251946",
          "CHEMBL251947",
          "CHEMBL251948",
          "CHEMBL252145",
          "CHEMBL255112",
          "CHEMBL257280",
          "CHEMBL257733",
          "CHEMBL257905",
          "CHEMBL257906",
          "CHEMBL258260",
          "CHEMBL261955",
          "CHEMBL261964",
          "CHEMBL262175",
          "CHEMBL262945",
          "CHEMBL263171",
          "CHEMBL263296",
          "CHEMBL263686",
          "CHEMBL263702",
          "CHEMBL263771",
          "CHEMBL263975",
          "CHEMBL264350",
          "CHEMBL264906",
          "CHEMBL265089",
          "CHEMBL265132",
          "CHEMBL265255",
          "CHEMBL265365",
          "CHEMBL265540",
          "CHEMBL266513",
          "CHEMBL266725",
          "CHEMBL266738",
          "CHEMBL266739",
          "CHEMBL266740",
          "CHEMBL266840",
          "CHEMBL266972",
          "CHEMBL267319",
          "CHEMBL267320",
          "CHEMBL267690",
          "CHEMBL267797",
          "CHEMBL268385",
          "CHEMBL268848",
          "CHEMBL268938",
          "CHEMBL269061",
          "CHEMBL269352",
          "CHEMBL269695",
          "CHEMBL269939",
          "CHEMBL270151",
          "CHEMBL274102",
          "CHEMBL274168",
          "CHEMBL274254",
          "CHEMBL274326",
          "CHEMBL276393",
          "CHEMBL277531",
          "CHEMBL359510",
          "CHEMBL359580",
          "CHEMBL359707",
          "CHEMBL359782",
          "CHEMBL359995",
          "CHEMBL360006",
          "CHEMBL360081",
          "CHEMBL360102",
          "CHEMBL360117",
          "CHEMBL360142",
          "CHEMBL360159",
          "CHEMBL360303",
          "CHEMBL360327",
          "CHEMBL360393",
          "CHEMBL360567",
          "CHEMBL360620",
          "CHEMBL360671",
          "CHEMBL360731",
          "CHEMBL360732",
          "CHEMBL360811",
          "CHEMBL360876",
          "CHEMBL360896",
          "CHEMBL360976",
          "CHEMBL360977",
          "CHEMBL360996",
          "CHEMBL361139",
          "CHEMBL361215",
          "CHEMBL361262",
          "CHEMBL361288",
          "CHEMBL361305",
          "CHEMBL361392",
          "CHEMBL361423",
          "CHEMBL361442",
          "CHEMBL361654",
          "CHEMBL361821",
          "CHEMBL361878",
          "CHEMBL361902",
          "CHEMBL362009",
          "CHEMBL362094",
          "CHEMBL362150",
          "CHEMBL362193",
          "CHEMBL362309",
          "CHEMBL362400",
          "CHEMBL362501",
          "CHEMBL362713",
          "CHEMBL362720",
          "CHEMBL362768",
          "CHEMBL362790",
          "CHEMBL363011",
          "CHEMBL363044",
          "CHEMBL363047",
          "CHEMBL363103",
          "CHEMBL363120",
          "CHEMBL363139",
          "CHEMBL363169",
          "CHEMBL363220",
          "CHEMBL363222",
          "CHEMBL363238",
          "CHEMBL363256",
          "CHEMBL363264",
          "CHEMBL363311",
          "CHEMBL363336",
          "CHEMBL363337",
          "CHEMBL363459",
          "CHEMBL363464",
          "CHEMBL363470",
          "CHEMBL363479",
          "CHEMBL363548",
          "CHEMBL363583",
          "CHEMBL363664",
          "CHEMBL363683",
          "CHEMBL363701",
          "CHEMBL363876",
          "CHEMBL363909",
          "CHEMBL363965",
          "CHEMBL364104",
          "CHEMBL364134",
          "CHEMBL364162",
          "CHEMBL364178",
          "CHEMBL364210",
          "CHEMBL364377",
          "CHEMBL364399",
          "CHEMBL364414",
          "CHEMBL364500",
          "CHEMBL364522",
          "CHEMBL364540",
          "CHEMBL364573",
          "CHEMBL364818",
          "CHEMBL364863",
          "CHEMBL364871",
          "CHEMBL364983",
          "CHEMBL365011",
          "CHEMBL365041",
          "CHEMBL365055",
          "CHEMBL365087",
          "CHEMBL365094",
          "CHEMBL365254",
          "CHEMBL365360",
          "CHEMBL365374",
          "CHEMBL365400",
          "CHEMBL365443",
          "CHEMBL365459",
          "CHEMBL365689",
          "CHEMBL365714",
          "CHEMBL365734",
          "CHEMBL365788",
          "CHEMBL365876",
          "CHEMBL366041",
          "CHEMBL366161",
          "CHEMBL366180",
          "CHEMBL366275",
          "CHEMBL366307",
          "CHEMBL366309",
          "CHEMBL366445",
          "CHEMBL366703",
          "CHEMBL366934",
          "CHEMBL367156",
          "CHEMBL367215",
          "CHEMBL367355",
          "CHEMBL367359",
          "CHEMBL367532",
          "CHEMBL368228",
          "CHEMBL368249",
          "CHEMBL368417",
          "CHEMBL368888",
          "CHEMBL369116",
          "CHEMBL369392",
          "CHEMBL369986",
          "CHEMBL370120",
          "CHEMBL370193",
          "CHEMBL370222",
          "CHEMBL370360",
          "CHEMBL370361",
          "CHEMBL370576",
          "CHEMBL370608",
          "CHEMBL370733",
          "CHEMBL370820",
          "CHEMBL371099",
          "CHEMBL371129",
          "CHEMBL371222",
          "CHEMBL371355",
          "CHEMBL371576",
          "CHEMBL371700",
          "CHEMBL371809",
          "CHEMBL371877",
          "CHEMBL372116",
          "CHEMBL372245",
          "CHEMBL372551",
          "CHEMBL372721",
          "CHEMBL372803",
          "CHEMBL372848",
          "CHEMBL372919",
          "CHEMBL373036",
          "CHEMBL373084",
          "CHEMBL373157",
          "CHEMBL373165",
          "CHEMBL373235",
          "CHEMBL373266",
          "CHEMBL373886",
          "CHEMBL373887",
          "CHEMBL374843",
          "CHEMBL374844",
          "CHEMBL375132",
          "CHEMBL375386",
          "CHEMBL375465",
          "CHEMBL375466",
          "CHEMBL375520",
          "CHEMBL376749",
          "CHEMBL376976",
          "CHEMBL377084",
          "CHEMBL377208",
          "CHEMBL377251",
          "CHEMBL377270",
          "CHEMBL377321",
          "CHEMBL377372",
          "CHEMBL377479",
          "CHEMBL377519",
          "CHEMBL377541",
          "CHEMBL377570",
          "CHEMBL377658",
          "CHEMBL377664",
          "CHEMBL377738",
          "CHEMBL377814",
          "CHEMBL377843",
          "CHEMBL377864",
          "CHEMBL377874",
          "CHEMBL377884",
          "CHEMBL377955",
          "CHEMBL377976",
          "CHEMBL378009",
          "CHEMBL378019",
          "CHEMBL378180",
          "CHEMBL378230",
          "CHEMBL378242",
          "CHEMBL378261",
          "CHEMBL378269",
          "CHEMBL378283",
          "CHEMBL378304",
          "CHEMBL378310",
          "CHEMBL378428",
          "CHEMBL378439",
          "CHEMBL378972",
          "CHEMBL378994",
          "CHEMBL379002",
          "CHEMBL379004",
          "CHEMBL379060",
          "CHEMBL379166",
          "CHEMBL379201",
          "CHEMBL379275",
          "CHEMBL379391",
          "CHEMBL379395",
          "CHEMBL379457",
          "CHEMBL379489",
          "CHEMBL379521",
          "CHEMBL379535",
          "CHEMBL379693",
          "CHEMBL379789",
          "CHEMBL379797",
          "CHEMBL379802",
          "CHEMBL379886",
          "CHEMBL379940",
          "CHEMBL379978",
          "CHEMBL380036",
          "CHEMBL380144",
          "CHEMBL380275",
          "CHEMBL380306",
          "CHEMBL380307",
          "CHEMBL380371",
          "CHEMBL380429",
          "CHEMBL380509",
          "CHEMBL380692",
          "CHEMBL380718",
          "CHEMBL380782",
          "CHEMBL381013",
          "CHEMBL381143",
          "CHEMBL381162",
          "CHEMBL381335",
          "CHEMBL381810",
          "CHEMBL382126",
          "CHEMBL382140",
          "CHEMBL382161",
          "CHEMBL382177",
          "CHEMBL382631",
          "CHEMBL382668",
          "CHEMBL382755",
          "CHEMBL382772",
          "CHEMBL382841",
          "CHEMBL382851",
          "CHEMBL383076",
          "CHEMBL383078",
          "CHEMBL383150",
          "CHEMBL383340",
          "CHEMBL383359",
          "CHEMBL383390",
          "CHEMBL383432",
          "CHEMBL383567",
          "CHEMBL383859",
          "CHEMBL383884",
          "CHEMBL383891",
          "CHEMBL383901",
          "CHEMBL383933",
          "CHEMBL383971",
          "CHEMBL383972",
          "CHEMBL383976",
          "CHEMBL383981",
          "CHEMBL384000",
          "CHEMBL384030",
          "CHEMBL384043",
          "CHEMBL384079",
          "CHEMBL384111",
          "CHEMBL384115",
          "CHEMBL384116",
          "CHEMBL384133",
          "CHEMBL384145",
          "CHEMBL384147",
          "CHEMBL384156",
          "CHEMBL384163",
          "CHEMBL384172",
          "CHEMBL384181",
          "CHEMBL384234",
          "CHEMBL384245",
          "CHEMBL384247",
          "CHEMBL384282",
          "CHEMBL384302",
          "CHEMBL384362",
          "CHEMBL384371",
          "CHEMBL384400",
          "CHEMBL384449",
          "CHEMBL384458",
          "CHEMBL384487",
          "CHEMBL384489",
          "CHEMBL384546",
          "CHEMBL384547",
          "CHEMBL384548",
          "CHEMBL384550",
          "CHEMBL384553",
          "CHEMBL384622",
          "CHEMBL384626",
          "CHEMBL384676",
          "CHEMBL384701",
          "CHEMBL384734",
          "CHEMBL384738",
          "CHEMBL384765",
          "CHEMBL384770",
          "CHEMBL384805",
          "CHEMBL384825",
          "CHEMBL384844",
          "CHEMBL384848",
          "CHEMBL384919",
          "CHEMBL384994",
          "CHEMBL385011",
          "CHEMBL385036",
          "CHEMBL385037",
          "CHEMBL385038",
          "CHEMBL385054",
          "CHEMBL385141",
          "CHEMBL385171",
          "CHEMBL385215",
          "CHEMBL385218",
          "CHEMBL385221",
          "CHEMBL385252",
          "CHEMBL385253",
          "CHEMBL385254",
          "CHEMBL385347",
          "CHEMBL385361",
          "CHEMBL385363",
          "CHEMBL385389",
          "CHEMBL385391",
          "CHEMBL385393",
          "CHEMBL385398",
          "CHEMBL385452",
          "CHEMBL385496",
          "CHEMBL385535",
          "CHEMBL385539",
          "CHEMBL385612",
          "CHEMBL385619",
          "CHEMBL385639",
          "CHEMBL385661",
          "CHEMBL385690",
          "CHEMBL385743",
          "CHEMBL385748",
          "CHEMBL385831",
          "CHEMBL385875",
          "CHEMBL385876",
          "CHEMBL385941",
          "CHEMBL385947",
          "CHEMBL385957",
          "CHEMBL385959",
          "CHEMBL386021",
          "CHEMBL386035",
          "CHEMBL386039",
          "CHEMBL386041",
          "CHEMBL386046",
          "CHEMBL386050",
          "CHEMBL386075",
          "CHEMBL386111",
          "CHEMBL386117",
          "CHEMBL386163",
          "CHEMBL386211",
          "CHEMBL386247",
          "CHEMBL386281",
          "CHEMBL386284",
          "CHEMBL386311",
          "CHEMBL386320",
          "CHEMBL386321",
          "CHEMBL386349",
          "CHEMBL386354",
          "CHEMBL386411",
          "CHEMBL386449",
          "CHEMBL386454",
          "CHEMBL386487",
          "CHEMBL386507",
          "CHEMBL386509",
          "CHEMBL386512",
          "CHEMBL386548",
          "CHEMBL386552",
          "CHEMBL386600",
          "CHEMBL386660",
          "CHEMBL386717",
          "CHEMBL386727",
          "CHEMBL386753",
          "CHEMBL386759",
          "CHEMBL386819",
          "CHEMBL386880",
          "CHEMBL386900",
          "CHEMBL386925",
          "CHEMBL386968",
          "CHEMBL386969",
          "CHEMBL387013",
          "CHEMBL387025",
          "CHEMBL387055",
          "CHEMBL387065",
          "CHEMBL387081",
          "CHEMBL387085",
          "CHEMBL387178",
          "CHEMBL387219",
          "CHEMBL387266",
          "CHEMBL387309",
          "CHEMBL387417",
          "CHEMBL387418",
          "CHEMBL387419",
          "CHEMBL387420",
          "CHEMBL387501",
          "CHEMBL387502",
          "CHEMBL387961",
          "CHEMBL387962",
          "CHEMBL387989",
          "CHEMBL387990",
          "CHEMBL388181",
          "CHEMBL388302",
          "CHEMBL388491",
          "CHEMBL388524",
          "CHEMBL388723",
          "CHEMBL388972",
          "CHEMBL389058",
          "CHEMBL389059",
          "CHEMBL389274",
          "CHEMBL389295",
          "CHEMBL389483",
          "CHEMBL389484",
          "CHEMBL389517",
          "CHEMBL389518",
          "CHEMBL389608",
          "CHEMBL389618",
          "CHEMBL389808",
          "CHEMBL389809",
          "CHEMBL389810",
          "CHEMBL389811",
          "CHEMBL389812",
          "CHEMBL390288",
          "CHEMBL390289",
          "CHEMBL390290",
          "CHEMBL391203",
          "CHEMBL391275",
          "CHEMBL391496",
          "CHEMBL391618",
          "CHEMBL391920",
          "CHEMBL392012",
          "CHEMBL392013",
          "CHEMBL392015",
          "CHEMBL392156",
          "CHEMBL392214",
          "CHEMBL392402",
          "CHEMBL392403",
          "CHEMBL393078",
          "CHEMBL393959",
          "CHEMBL394310",
          "CHEMBL394311",
          "CHEMBL394502",
          "CHEMBL394560",
          "CHEMBL394639",
          "CHEMBL394822",
          "CHEMBL394823",
          "CHEMBL395699",
          "CHEMBL395763",
          "CHEMBL395957",
          "CHEMBL395979",
          "CHEMBL395986",
          "CHEMBL396008",
          "CHEMBL396174",
          "CHEMBL396193",
          "CHEMBL396221",
          "CHEMBL396447",
          "CHEMBL396448",
          "CHEMBL396957",
          "CHEMBL397064",
          "CHEMBL397421",
          "CHEMBL398184",
          "CHEMBL398186",
          "CHEMBL398187",
          "CHEMBL398687",
          "CHEMBL398748",
          "CHEMBL398864",
          "CHEMBL398964",
          "CHEMBL399004",
          "CHEMBL399210",
          "CHEMBL399244",
          "CHEMBL399302",
          "CHEMBL399303",
          "CHEMBL399312",
          "CHEMBL399367",
          "CHEMBL399712",
          "CHEMBL399721",
          "CHEMBL399734",
          "CHEMBL400297",
          "CHEMBL400298",
          "CHEMBL400321",
          "CHEMBL400679",
          "CHEMBL400799",
          "CHEMBL400883",
          "CHEMBL402868",
          "CHEMBL403730",
          "CHEMBL408198",
          "CHEMBL408332",
          "CHEMBL410566",
          "CHEMBL410641",
          "CHEMBL412005",
          "CHEMBL412006",
          "CHEMBL412007",
          "CHEMBL412135",
          "CHEMBL412611",
          "CHEMBL412801",
          "CHEMBL412831",
          "CHEMBL413051",
          "CHEMBL413578",
          "CHEMBL424697",
          "CHEMBL424720",
          "CHEMBL424721",
          "CHEMBL424728",
          "CHEMBL424739",
          "CHEMBL424784",
          "CHEMBL424865",
          "CHEMBL424895",
          "CHEMBL424961",
          "CHEMBL425012",
          "CHEMBL425082",
          "CHEMBL425084",
          "CHEMBL425098",
          "CHEMBL425257",
          "CHEMBL425263",
          "CHEMBL425269",
          "CHEMBL425359",
          "CHEMBL425407",
          "CHEMBL425410",
          "CHEMBL425434",
          "CHEMBL425435",
          "CHEMBL425445",
          "CHEMBL425448",
          "CHEMBL425518",
          "CHEMBL425521",
          "CHEMBL425654",
          "CHEMBL425664",
          "CHEMBL425669",
          "CHEMBL425791",
          "CHEMBL425801",
          "CHEMBL425979",
          "CHEMBL426147",
          "CHEMBL426252",
          "CHEMBL426292",
          "CHEMBL426339",
          "CHEMBL426364",
          "CHEMBL426366",
          "CHEMBL426369",
          "CHEMBL426481",
          "CHEMBL426648",
          "CHEMBL426666",
          "CHEMBL426777",
          "CHEMBL426971",
          "CHEMBL427006",
          "CHEMBL427107",
          "CHEMBL427147",
          "CHEMBL427153",
          "CHEMBL427187",
          "CHEMBL427262",
          "CHEMBL427367",
          "CHEMBL427484",
          "CHEMBL427539",
          "CHEMBL427540",
          "CHEMBL427542",
          "CHEMBL428049",
          "CHEMBL429293",
          "CHEMBL429301",
          "CHEMBL429393",
          "CHEMBL429895",
          "CHEMBL430162",
          "CHEMBL430208",
          "CHEMBL433591",
          "CHEMBL433596",
          "CHEMBL433608",
          "CHEMBL433961",
          "CHEMBL434156",
          "CHEMBL434162",
          "CHEMBL434571",
          "CHEMBL434747",
          "CHEMBL434934",
          "CHEMBL435329",
          "CHEMBL435494",
          "CHEMBL435708",
          "CHEMBL436081",
          "CHEMBL436320",
          "CHEMBL436953",
          "CHEMBL437130",
          "CHEMBL437544",
          "CHEMBL437728",
          "CHEMBL437914",
          "CHEMBL438615",
          "CHEMBL438637",
          "CHEMBL438792",
          "CHEMBL438966",
          "CHEMBL439013",
          "CHEMBL439358",
          "CHEMBL440229",
          "CHEMBL441148",
          "CHEMBL441542",
          "CHEMBL441696",
          "CHEMBL441726",
          "CHEMBL441855",
          "CHEMBL441886",
          "CHEMBL442064",
          "CHEMBL442084",
          "CHEMBL442223",
          "CHEMBL442244",
          "CHEMBL442700",
          "CHEMBL442794",
          "CHEMBL445407",
          "CHEMBL447835",
          "CHEMBL448110",
          "CHEMBL450942",
          "CHEMBL452087",
          "CHEMBL452335",
          "CHEMBL453885",
          "CHEMBL453886",
          "CHEMBL454424",
          "CHEMBL455143",
          "CHEMBL455144",
          "CHEMBL459897",
          "CHEMBL462347",
          "CHEMBL462351",
          "CHEMBL462352",
          "CHEMBL466425",
          "CHEMBL467668",
          "CHEMBL468099",
          "CHEMBL468298",
          "CHEMBL468299",
          "CHEMBL468509",
          "CHEMBL469343",
          "CHEMBL469789",
          "CHEMBL469790",
          "CHEMBL470633",
          "CHEMBL470840",
          "CHEMBL471514",
          "CHEMBL471651",
          "CHEMBL472083",
          "CHEMBL472195",
          "CHEMBL472196",
          "CHEMBL472363",
          "CHEMBL472378",
          "CHEMBL472379",
          "CHEMBL472380",
          "CHEMBL472554",
          "CHEMBL482636",
          "CHEMBL483673",
          "CHEMBL483674",
          "CHEMBL486878",
          "CHEMBL487022",
          "CHEMBL487040",
          "CHEMBL487041",
          "CHEMBL488711",
          "CHEMBL488720",
          "CHEMBL488721",
          "CHEMBL488886",
          "CHEMBL488887",
          "CHEMBL488890",
          "CHEMBL493962",
          "CHEMBL493967",
          "CHEMBL494009",
          "CHEMBL494016",
          "CHEMBL494155",
          "CHEMBL494156",
          "CHEMBL495789",
          "CHEMBL496815",
          "CHEMBL497005",
          "CHEMBL497220",
          "CHEMBL497221",
          "CHEMBL497619",
          "CHEMBL497637",
          "CHEMBL497638",
          "CHEMBL497646",
          "CHEMBL497647",
          "CHEMBL497830",
          "CHEMBL497831",
          "CHEMBL506480",
          "CHEMBL507549",
          "CHEMBL510193",
          "CHEMBL510667",
          "CHEMBL511480",
          "CHEMBL511542",
          "CHEMBL511747",
          "CHEMBL511974",
          "CHEMBL512180",
          "CHEMBL512185",
          "CHEMBL512657",
          "CHEMBL512873",
          "CHEMBL516489",
          "CHEMBL518514",
          "CHEMBL518515",
          "CHEMBL520296",
          "CHEMBL520714",
          "CHEMBL521903",
          "CHEMBL522037",
          "CHEMBL522242",
          "CHEMBL523697",
          "CHEMBL523751",
          "CHEMBL523882",
          "CHEMBL526083",
          "CHEMBL526647",
          "CHEMBL529450",
          "CHEMBL534717",
          "CHEMBL537846",
          "CHEMBL538211",
          "CHEMBL538215",
          "CHEMBL538424",
          "CHEMBL538425",
          "CHEMBL538652",
          "CHEMBL538711",
          "CHEMBL538936",
          "CHEMBL538968",
          "CHEMBL538993",
          "CHEMBL539227",
          "CHEMBL539475",
          "CHEMBL539737",
          "CHEMBL540930",
          "CHEMBL541944",
          "CHEMBL549395",
          "CHEMBL549512",
          "CHEMBL549583",
          "CHEMBL549595",
          "CHEMBL549635",
          "CHEMBL549636",
          "CHEMBL549930",
          "CHEMBL549984",
          "CHEMBL550068",
          "CHEMBL550308",
          "CHEMBL550410",
          "CHEMBL550455",
          "CHEMBL550513",
          "CHEMBL550535",
          "CHEMBL550545",
          "CHEMBL550683",
          "CHEMBL550744",
          "CHEMBL550816",
          "CHEMBL550876",
          "CHEMBL550943",
          "CHEMBL551149",
          "CHEMBL551281",
          "CHEMBL551332",
          "CHEMBL551408",
          "CHEMBL551470",
          "CHEMBL551543",
          "CHEMBL551684",
          "CHEMBL551826",
          "CHEMBL551886",
          "CHEMBL551924",
          "CHEMBL551934",
          "CHEMBL552010",
          "CHEMBL552143",
          "CHEMBL552144",
          "CHEMBL552224",
          "CHEMBL552229",
          "CHEMBL552292",
          "CHEMBL552432",
          "CHEMBL552498",
          "CHEMBL553196",
          "CHEMBL554287",
          "CHEMBL554332",
          "CHEMBL554511",
          "CHEMBL555055",
          "CHEMBL555135",
          "CHEMBL555349",
          "CHEMBL555875",
          "CHEMBL556296",
          "CHEMBL556432",
          "CHEMBL556661",
          "CHEMBL556697",
          "CHEMBL556868",
          "CHEMBL556927",
          "CHEMBL557070",
          "CHEMBL557071",
          "CHEMBL557262",
          "CHEMBL557263",
          "CHEMBL557306",
          "CHEMBL557317",
          "CHEMBL557329",
          "CHEMBL557473",
          "CHEMBL557629",
          "CHEMBL557664",
          "CHEMBL557715",
          "CHEMBL557730",
          "CHEMBL557731",
          "CHEMBL557873",
          "CHEMBL558052",
          "CHEMBL558277",
          "CHEMBL558305",
          "CHEMBL558326",
          "CHEMBL558442",
          "CHEMBL558532",
          "CHEMBL558533",
          "CHEMBL558726",
          "CHEMBL558826",
          "CHEMBL558863",
          "CHEMBL558928",
          "CHEMBL559237",
          "CHEMBL559329",
          "CHEMBL559535",
          "CHEMBL559680",
          "CHEMBL559691",
          "CHEMBL559801",
          "CHEMBL560063",
          "CHEMBL560283",
          "CHEMBL560290",
          "CHEMBL560334",
          "CHEMBL560474",
          "CHEMBL560584",
          "CHEMBL560677",
          "CHEMBL560689",
          "CHEMBL560888",
          "CHEMBL560953",
          "CHEMBL561011",
          "CHEMBL561083",
          "CHEMBL561092",
          "CHEMBL561133",
          "CHEMBL561134",
          "CHEMBL561148",
          "CHEMBL561344",
          "CHEMBL561463",
          "CHEMBL561546",
          "CHEMBL561584",
          "CHEMBL561585",
          "CHEMBL561694",
          "CHEMBL562016",
          "CHEMBL562073",
          "CHEMBL562074",
          "CHEMBL562136",
          "CHEMBL562285",
          "CHEMBL562537",
          "CHEMBL562788",
          "CHEMBL562847",
          "CHEMBL562905",
          "CHEMBL563005",
          "CHEMBL563096",
          "CHEMBL563147",
          "CHEMBL563156",
          "CHEMBL563223",
          "CHEMBL563412",
          "CHEMBL563725",
          "CHEMBL563728",
          "CHEMBL563791",
          "CHEMBL563836",
          "CHEMBL563884",
          "CHEMBL563984",
          "CHEMBL564032",
          "CHEMBL564106",
          "CHEMBL564243",
          "CHEMBL564286",
          "CHEMBL564409",
          "CHEMBL564413",
          "CHEMBL564501",
          "CHEMBL564674",
          "CHEMBL564788",
          "CHEMBL565073",
          "CHEMBL565105",
          "CHEMBL565119",
          "CHEMBL565551",
          "CHEMBL565614",
          "CHEMBL565833",
          "CHEMBL565834",
          "CHEMBL566029",
          "CHEMBL566075",
          "CHEMBL566232",
          "CHEMBL566257",
          "CHEMBL566662",
          "CHEMBL566674",
          "CHEMBL566880",
          "CHEMBL567514",
          "CHEMBL567791",
          "CHEMBL567950",
          "CHEMBL567993",
          "CHEMBL568162",
          "CHEMBL568183",
          "CHEMBL568208",
          "CHEMBL568209",
          "CHEMBL568345",
          "CHEMBL568361",
          "CHEMBL568400",
          "CHEMBL568458",
          "CHEMBL568571",
          "CHEMBL568572",
          "CHEMBL568604",
          "CHEMBL568649",
          "CHEMBL568663",
          "CHEMBL568664",
          "CHEMBL569204",
          "CHEMBL569458",
          "CHEMBL569852",
          "CHEMBL570296",
          "CHEMBL570987",
          "CHEMBL571614",
          "CHEMBL571830",
          "CHEMBL572090",
          "CHEMBL572300",
          "CHEMBL576665",
          "CHEMBL577259",
          "CHEMBL577714",
          "CHEMBL577904",
          "CHEMBL577912",
          "CHEMBL577913",
          "CHEMBL578049",
          "CHEMBL578166",
          "CHEMBL578170",
          "CHEMBL578784",
          "CHEMBL579232",
          "CHEMBL582792",
          "CHEMBL582978",
          "CHEMBL583014",
          "CHEMBL583348",
          "CHEMBL584538",
          "CHEMBL585509",
          "CHEMBL585664",
          "CHEMBL585856",
          "CHEMBL585879",
          "CHEMBL585880",
          "CHEMBL593521",
          "CHEMBL607120",
          "CHEMBL607121",
          "CHEMBL77072",
          "CHEMBL87370"
        ],
        "number_of_missing_values": "0"
      },
      {
        "data_type": "numeric",
        "index": "1",
        "is_ignore": "false",
        "is_row_identifier": "false",
        "is_target": "false",
        "name": "AMW",
        "number_of_missing_values": "0"
      },
      {
        "data_type": "numeric",
        "index": "2",
        "is_ignore": "false",
        "is_row_identifier": "false",
        "is_target": "false",
        "name": "C.",
        "number_of_missing_values": "0"
      },
      {
        "data_type": "numeric",
        "index": "3",
        "is_ignore": "false",
        "is_row_identifier": "false",
        "is_target": "false",
        "name": "H.",
        "number_of_missing_values": "0"
      },
      {
        "data_type": "numeric",
        "index": "4",
        "is_ignore": "false",
        "is_row_identifier": "false",
        "is_target": "false",
        "name": "Me",
        "number_of_missing_values": "0"
      },
      {
        "data_type": "numeric",
        "index": "5",
        "is_ignore": "false",
        "is_row_identifier": "false",
        "is_target": "false",
        "name": "Mi",
        "number_of_missing_values": "0"
      },
      {
        "data_type": "numeric",
        "index": "6",
        "is_ignore": "false",
        "is_row_identifier": "false",
        "is_target": "false",
        "name": "Mp",
        "number_of_missing_values": "0"
      },
      {
        "data_type": "numeric",
        "index": "7",
        "is_ignore": "false",
        "is_row_identifier": "false",
        "is_target": "false",
        "name": "Mv",
        "number_of_missing_values": "0"
      },
      {
        "data_type": "numeric",
        "index": "8",
        "is_ignore": "false",
        "is_row_identifier": "false",
        "is_target": "false",
        "name": "MW",
        "number_of_missing_values": "0"
      },
      {
        "data_type": "numeric",
        "index": "9",
        "is_ignore": "false",
        "is_row_identifier": "false",
        "is_target": "false",
        "name": "N.",
        "number_of_missing_values": "0"
      },
      {
        "data_type": "numeric",
        "index": "10",
        "is_ignore": "false",
        "is_row_identifier": "false",
        "is_target": "false",
        "name": "nAB",
        "number_of_missing_values": "0"
      },
      {
        "data_type": "numeric",
        "index": "11",
        "is_ignore": "false",
        "is_row_identifier": "false",
        "is_target": "false",
        "name": "nAT",
        "number_of_missing_values": "0"
      },
      {
        "data_type": "numeric",
        "index": "12",
        "is_ignore": "false",
        "is_row_identifier": "false",
        "is_target": "false",
        "name": "nB",
        "number_of_missing_values": "0"
      },
      {
        "data_type": "numeric",
        "index": "13",
        "is_ignore": "false",
        "is_row_identifier": "false",
        "is_target": "false",
        "name": "nBM",
        "number_of_missing_values": "0"
      },
      {
        "data_type": "numeric",
        "index": "14",
        "is_ignore": "false",
        "is_row_identifier": "false",
        "is_target": "false",
        "name": "nBO",
        "number_of_missing_values": "0"
      },
      {
        "data_type": "numeric",
        "index": "15",
        "is_ignore": "false",
        "is_row_identifier": "false",
        "is_target": "false",
        "name": "nBR",
        "number_of_missing_values": "0"
      },
      {
        "data_type": "numeric",
        "index": "16",
        "is_ignore": "false",
        "is_row_identifier": "false",
        "is_target": "false",
        "name": "nBT",
        "number_of_missing_values": "0"
      },
      {
        "data_type": "numeric",
        "index": "17",
        "is_ignore": "false",
        "is_row_identifier": "false",
        "is_target": "false",
        "name": "nC",
        "number_of_missing_values": "0"
      },
      {
        "data_type": "numeric",
        "index": "18",
        "is_ignore": "false",
        "is_row_identifier": "false",
        "is_target": "false",
        "name": "nCL",
        "number_of_missing_values": "0"
      },
      {
        "data_type": "numeric",
        "index": "19",
        "is_ignore": "false",
        "is_row_identifier": "false",
        "is_target": "false",
        "name": "nCsp",
        "number_of_missing_values": "0"
      },
      {
        "data_type": "numeric",
        "index": "20",
        "is_ignore": "false",
        "is_row_identifier": "false",
        "is_target": "false",
        "name": "nCsp2",
        "number_of_missing_values": "0"
      },
      {
        "data_type": "numeric",
        "index": "21",
        "is_ignore": "false",
        "is_row_identifier": "false",
        "is_target": "false",
        "name": "nCsp3",
        "number_of_missing_values": "0"
      },
      {
        "data_type": "numeric",
        "index": "22",
        "is_ignore": "false",
        "is_row_identifier": "false",
        "is_target": "false",
        "name": "nDB",
        "number_of_missing_values": "0"
      },
      {
        "data_type": "numeric",
        "index": "23",
        "is_ignore": "false",
        "is_row_identifier": "false",
        "is_target": "false",
        "name": "nF",
        "number_of_missing_values": "0"
      },
      {
        "data_type": "numeric",
        "index": "24",
        "is_ignore": "false",
        "is_row_identifier": "false",
        "is_target": "false",
        "name": "nH",
        "number_of_missing_values": "0"
      },
      {
        "data_type": "numeric",
        "index": "25",
        "is_ignore": "false",
        "is_row_identifier": "false",
        "is_target": "false",
        "name": "nHet",
        "number_of_missing_values": "0"
      },
      {
        "data_type": "numeric",
        "index": "26",
        "is_ignore": "false",
        "is_row_identifier": "false",
        "is_target": "false",
        "name": "nHM",
        "number_of_missing_values": "0"
      },
      {
        "data_type": "numeric",
        "index": "27",
        "is_ignore": "false",
        "is_row_identifier": "false",
        "is_target": "false",
        "name": "nI",
        "number_of_missing_values": "0"
      },
      {
        "data_type": "numeric",
        "index": "28",
        "is_ignore": "false",
        "is_row_identifier": "false",
        "is_target": "false",
        "name": "nN",
        "number_of_missing_values": "0"
      },
      {
        "data_type": "numeric",
        "index": "29",
        "is_ignore": "false",
        "is_row_identifier": "false",
        "is_target": "false",
        "name": "nO",
        "number_of_missing_values": "0"
      },
      {
        "data_type": "numeric",
        "index": "30",
        "is_ignore": "false",
        "is_row_identifier": "false",
        "is_target": "false",
        "name": "nP",
        "number_of_missing_values": "0"
      },
      {
        "data_type": "numeric",
        "index": "31",
        "is_ignore": "false",
        "is_row_identifier": "false",
        "is_target": "false",
        "name": "nS",
        "number_of_missing_values": "0"
      },
      {
        "data_type": "numeric",
        "index": "32",
        "is_ignore": "false",
        "is_row_identifier": "false",
        "is_target": "false",
        "name": "nSK",
        "number_of_missing_values": "0"
      },
      {
        "data_type": "numeric",
        "index": "33",
        "is_ignore": "false",
        "is_row_identifier": "false",
        "is_target": "false",
        "name": "nTB",
        "number_of_missing_values": "0"
      },
      {
        "data_type": "numeric",
        "index": "34",
        "is_ignore": "false",
        "is_row_identifier": "false",
        "is_target": "false",
        "name": "nX",
        "number_of_missing_values": "0"
      },
      {
        "data_type": "numeric",
        "index": "35",
        "is_ignore": "false",
        "is_row_identifier": "false",
        "is_target": "false",
        "name": "O.",
        "number_of_missing_values": "0"
      },
      {
        "data_type": "numeric",
        "index": "36",
        "is_ignore": "false",
        "is_row_identifier": "false",
        "is_target": "false",
        "name": "RBF",
        "number_of_missing_values": "0"
      },
      {
        "data_type": "numeric",
        "index": "37",
        "is_ignore": "false",
        "is_row_identifier": "false",
        "is_target": "false",
        "name": "RBN",
        "number_of_missing_values": "0"
      },
      {
        "data_type": "numeric",
        "index": "38",
        "is_ignore": "false",
        "is_row_identifier": "false",
        "is_target": "false",
        "name": "SCBO",
        "number_of_missing_values": "0"
      },
      {
        "data_type": "numeric",
        "index": "39",
        "is_ignore": "false",
        "is_row_identifier": "false",
        "is_target": "false",
        "name": "Se",
        "number_of_missing_values": "0"
      },
      {
        "data_type": "numeric",
        "index": "40",
        "is_ignore": "false",
        "is_row_identifier": "false",
        "is_target": "false",
        "name": "Si",
        "number_of_missing_values": "0"
      },
      {
        "data_type": "numeric",
        "index": "41",
        "is_ignore": "false",
        "is_row_identifier": "false",
        "is_target": "false",
        "name": "Sp",
        "number_of_missing_values": "0"
      },
      {
        "data_type": "numeric",
        "index": "42",
        "is_ignore": "false",
        "is_row_identifier": "false",
        "is_target": "false",
        "name": "Sv",
        "number_of_missing_values": "0"
      },
      {
        "data_type": "numeric",
        "index": "43",
        "is_ignore": "false",
        "is_row_identifier": "false",
        "is_target": "false",
        "name": "X.",
        "number_of_missing_values": "0"
      },
      {
        "data_type": "numeric",
        "index": "44",
        "is_ignore": "false",
        "is_row_identifier": "false",
        "is_target": "true",
        "name": "pXC50",
        "number_of_missing_values": "0"
      }
    ]
  }
}