"molecule_id","nDB","nC","nCsp2","nAB","nBM","AMW","C.","H.","Me","Mi","Mp","Mv","MW","N.","nAT","nB","nBO","nBR","nBT","pXC50"
{1 2,2 15,3 8,4 6,5 8,6 7.793,7 32.6,8 47.8,9 1.023,10 1.138,11 0.63,12 0.604,13 358.46,14 4.3,15 46,17 24,19 46,20 4.143}
{0 CHEMBL1161542,1 2,2 15,3 8,4 6,5 8,6 7.61,7 33.3,8 48.9,9 1.017,10 1.136,11 0.634,12 0.602,13 342.46,14 4.4,15 45,17 23,19 45,20 4.108}
{0 CHEMBL1161543,1 1,2 24,3 12,4 16,5 17,6 7.598,7 35.3,8 47.1,9 1.012,10 1.138,11 0.645,12 0.614,13 516.69,14 8.8,15 68,17 39,19 71,20 4.479}
{0 CHEMBL1161547,1 1,2 17,3 6,4 10,5 11,6 7.756,7 30.9,8 47.3,9 1.021,10 1.147,11 0.629,12 0.603,13 426.56,14 10.9,15 55,17 31,19 57,20 5.081}
{0 CHEMBL1161552,1 2,2 16,3 8,4 6,5 8,6 7.706,7 34.8,8 47.8,9 1.016,10 1.133,11 0.642,12 0.61,13 354.47,14 4.3,15 46,17 25,19 47,20 4.475}
{0 CHEMBL1161554,1 2,2 16,3 8,4 6,5 8,6 7.706,7 34.8,8 47.8,9 1.016,10 1.133,11 0.642,12 0.61,13 354.47,14 4.3,15 46,17 25,19 47,20 4.409}
{0 CHEMBL1161556,1 2,2 16,3 8,4 6,5 8,6 7.706,7 34.8,8 47.8,9 1.016,10 1.133,11 0.642,12 0.61,13 354.47,14 4.3,15 46,17 25,19 47,20 4.328}
{0 CHEMBL1161558,1 2,2 16,3 8,4 6,5 8,6 7.427,7 33.3,8 50,9 1.013,10 1.136,11 0.631,12 0.596,13 356.49,14 4.2,15 48,17 24,19 48,20 4.027}
{0 CHEMBL1161559,1 1,2 16,3 6,4 10,5 11,6 7.918,7 29.6,8 46.3,9 1.026,10 1.152,11 0.626,12 0.605,13 427.55,14 13,15 54,17 31,19 56,20 4.585}
{0 CHEMBL1161563,1 1,2 23,3 12,4 16,5 17,6 7.727,7 34.3,8 46.3,9 1.015,10 1.141,11 0.643,12 0.615,13 517.68,14 10.4,15 67,17 39,19 70,20 4.201}
{0 CHEMBL1161564,1 1,2 19,3 8,4 11,5 12,6 7.671,7 32.2,8 47.5,9 1.018,10 1.144,11 0.633,12 0.605,13 452.6,14 10.2,15 59,17 33,19 61,20 4.469}
{0 CHEMBL1161565,1 1,2 17,3 6,4 10,5 11,6 7.747,7 29.8,8 47.4,9 1.022,10 1.151,11 0.624,12 0.6,13 441.58,14 12.3,15 57,17 32,19 59,20 4.252}
{0 CHEMBL1161566,1 2,2 15,3 8,4 6,5 8,6 7.61,7 33.3,8 48.9,9 1.017,10 1.136,11 0.634,12 0.602,13 342.46,14 4.4,15 45,17 23,19 45,20 4.222}
{0 CHEMBL1161567,1 2,2 15,3 8,4 6,5 8,6 7.793,7 32.6,8 47.8,9 1.023,10 1.138,11 0.63,12 0.604,13 358.46,14 4.3,15 46,17 24,19 46,20 4.488}
{0 CHEMBL1161571,1 2,2 16,3 8,4 6,5 8,6 7.706,7 34.8,8 47.8,9 1.016,10 1.133,11 0.642,12 0.61,13 354.47,14 4.3,15 46,17 25,19 47,20 4.237}
{0 CHEMBL1161573,1 1,2 15,3 6,4 10,5 11,6 8.133,7 30.6,8 44.9,9 1.028,10 1.149,11 0.634,12 0.614,13 398.5,14 12.2,15 49,17 29,19 51,20 5.301}
{0 CHEMBL1161575,1 1,2 15,3 6,4 10,5 11,6 8.108,7 29.4,8 45.1,9 1.029,10 1.152,11 0.628,12 0.61,13 413.52,14 13.7,15 51,17 30,19 53,20 4.569}
{0 CHEMBL1161576,1 2,2 16,3 8,4 6,5 8,6 7.602,7 32.7,8 49,9 1.02,10 1.138,11 0.628,12 0.598,13 372.49,14 4.1,15 49,17 25,19 49,20 4.06}
{0 CHEMBL1161578,1 1,2 18,3 8,4 11,5 12,6 7.832,7 32.1,8 46.4,9 1.021,10 1.145,11 0.635,12 0.61,13 438.57,14 10.7,15 56,17 32,19 58,20 4.77}
{0 CHEMBL1161583,1 1,2 18,3 8,4 11,5 12,6 7.844,7 33.3,8 46.3,9 1.02,10 1.141,11 0.64,12 0.614,13 423.55,14 9.3,15 54,17 31,19 56,20 4.914}
{0 CHEMBL1161584,1 1,2 23,3 12,4 16,5 17,6 7.733,7 35.4,8 46.2,9 1.014,10 1.138,11 0.648,12 0.619,13 502.66,14 9.2,15 65,17 38,19 68,20 4.783}
{0 CHEMBL1161585,1 1,2 16,3 6,4 10,5 11,6 7.933,7 30.8,8 46.2,9 1.025,10 1.148,11 0.631,12 0.608,13 412.53,14 11.5,15 52,17 30,19 54,20 5.444}
{0 CHEMBL1161586,1 1,2 24,3 12,4 16,5 17,6 7.596,7 34.3,8 47.1,9 1.013,10 1.141,11 0.641,12 0.611,13 531.71,14 10,15 70,17 40,19 73,20 4.638}
{0 CHEMBL2159512,1 1,2 17,3 13,4 12,5 13,6 8.388,7 40.5,8 45.2,9 1.006,10 1.127,11 0.691,12 0.647,13 352.29,14 7.1,15 42,17 24,19 43,20 5}
{0 CHEMBL2159513,1 1,2 18,3 13,4 12,5 13,6 7.563,7 39.1,8 47.8,9 1.003,10 1.131,11 0.661,12 0.622,13 347.88,14 6.5,15 46,17 25,19 47,20 5.078}
{0 CHEMBL2159525,1 1,2 17,3 13,4 12,5 13,6 8.565,7 39.5,8 44.2,9 1.013,10 1.129,11 0.686,12 0.649,13 368.29,14 7,15 43,17 25,19 44,20 5.429}
{0 CHEMBL2159526,1 1,2 17,3 13,4 12,5 13,6 8.565,7 39.5,8 44.2,9 1.013,10 1.129,11 0.686,12 0.649,13 368.29,14 7,15 43,17 25,19 44,20 5.265}
{0 CHEMBL2159527,1 1,2 17,3 13,4 12,5 13,6 8.816,7 40.5,8 42.9,9 1.018,10 1.135,11 0.69,12 0.656,13 370.28,14 7.1,15 42,17 25,19 43,20 5.372}
{0 CHEMBL2159535,1 1,2 15,3 11,4 11,5 12,6 9.188,7 38.5,8 43.6,9 1.011,10 1.124,11 0.716,12 0.662,13 358.32,14 7.7,15 39,17 23,19 40,20 5.362}
{0 CHEMBL2159536,1 1,2 16,3 11,4 11,5 12,6 8.23,7 37.2,8 46.5,9 1.007,10 1.128,11 0.681,12 0.634,13 353.91,14 7,15 43,17 24,19 44,20 5.181}
{0 CHEMBL2159537,1 1,2 15,3 11,4 11,5 12,6 9.188,7 38.5,8 43.6,9 1.011,10 1.124,11 0.716,12 0.662,13 358.32,14 7.7,15 39,17 23,19 40,20 5.515}
{0 CHEMBL292003,1 5,2 23,3 18,4 12,5 17,6 9.507,7 42.6,8 38.9,9 1.023,10 1.123,11 0.694,12 0.675,13 513.38,14 7.4,15 54,17 36,18 1,19 57,20 4}
{0 CHEMBL292230,1 5,2 27,3 18,4 12,5 17,6 8.629,7 40.9,8 43.9,9 1.012,10 1.125,11 0.675,12 0.644,13 569.5,14 6.1,15 66,17 40,18 1,19 69,20 4}
{0 CHEMBL293288,1 5,2 25,3 18,4 12,5 17,6 8.857,7 41.7,8 40,9 1.024,10 1.125,11 0.69,12 0.668,13 531.43,14 6.7,15 60,17 39,19 63,20 4}
{0 CHEMBL299272,1 5,2 24,3 18,4 12,5 17,6 9.253,7 42.1,8 40.4,9 1.019,10 1.123,11 0.689,12 0.666,13 527.41,14 7,15 57,17 37,18 1,19 60,20 4.319}
{0 CHEMBL302471,1 1,2 21,3 21,4 23,5 24,6 10.007,7 51.2,8 31.7,9 1.022,10 1.105,11 0.761,12 0.739,13 410.27,14 7.3,15 41,17 31,19 44,20 4}
{0 CHEMBL303469,1 1,2 23,3 22,4 23,5 24,6 10.606,7 51.1,8 28.9,9 1.047,10 1.125,11 0.745,12 0.744,13 477.28,14 4.4,15 45,17 35,19 48,20 4.473}
{0 CHEMBL304044,1 1,2 23,3 22,4 23,5 24,6 9.407,7 51.1,8 35.6,9 1.013,10 1.103,11 0.749,12 0.719,13 423.31,14 4.4,15 45,17 32,19 48,20 4.524}
{0 CHEMBL304237,2 21,3 15,4 17,5 17,6 10.125,7 42,8 44,9 1.001,10 1.121,11 0.716,12 0.662,13 506.27,14 8,15 50,17 31,18 2,19 53,20 9}
{0 CHEMBL304562,2 23,3 22,4 28,5 28,6 9.653,7 47.9,8 33.3,9 1.018,10 1.116,11 0.745,12 0.722,13 463.35,14 12.5,15 48,17 36,19 52,20 4.699}
{0 CHEMBL304618,1 1,2 22,3 21,4 23,5 24,6 9.643,7 50,8 34.1,9 1.018,10 1.107,11 0.749,12 0.724,13 424.3,14 6.8,15 44,17 32,19 47,20 4}
{0 CHEMBL304623,1 1,2 22,3 22,4 23,5 24,6 10.173,7 52.4,8 31,9 1.029,10 1.108,11 0.76,12 0.743,13 427.27,14 4.8,15 42,17 32,19 45,20 4.375}
{0 CHEMBL306353,1 1,2 22,3 22,4 23,5 24,6 9.745,7 52.4,8 33.3,9 1.016,10 1.1,11 0.761,12 0.734,13 409.28,14 4.8,15 42,17 31,19 45,20 4.371}
{0 CHEMBL306896,1 2,2 23,3 23,4 23,5 25,6 10.073,7 51.1,8 31.1,9 1.03,10 1.103,11 0.753,12 0.739,13 453.29,14 4.4,15 45,17 34,19 48,20 4.386}
{0 CHEMBL307342,1 1,2 23,3 22,4 28,5 29,6 9.827,7 46,8 32,9 1.024,10 1.123,11 0.74,12 0.723,13 491.37,14 16,15 50,17 38,19 54,20 4.86}
{0 CHEMBL307466,1 1,2 23,3 22,4 23,5 24,6 9.55,7 50,8 34.8,9 1.02,10 1.105,11 0.743,12 0.719,13 439.31,14 4.3,15 46,17 33,19 49,20 4.75}
{0 CHEMBL307660,1 1,2 21,3 21,4 23,5 24,6 10.007,7 51.2,8 31.7,9 1.022,10 1.105,11 0.761,12 0.739,13 410.27,14 7.3,15 41,17 31,19 44,20 4.328}
{0 CHEMBL308309,1 1,2 22,3 21,4 23,5 24,6 9.643,7 50,8 34.1,9 1.018,10 1.107,11 0.749,12 0.724,13 424.3,14 6.8,15 44,17 32,19 47,20 4.582}
{0 CHEMBL308349,2 21,3 21,4 28,5 28,6 10.1,7 48.8,8 30.2,9 1.021,10 1.117,11 0.763,12 0.742,13 434.31,14 16.3,15 43,17 34,19 47,20 4.602}
{0 CHEMBL410312,1 5,2 30,3 24,4 18,5 23,6 8.858,7 44.8,8 38.8,9 1.019,10 1.118,11 0.704,12 0.681,13 593.5,14 6,15 67,17 45,19 71,20 4.281}
{0 CHEMBL431521,1 5,2 27,3 18,4 12,5 17,6 8.477,7 40.9,8 42.4,9 1.018,10 1.126,11 0.68,12 0.654,13 559.49,14 6.1,15 66,17 41,19 69,20 4.002}
{0 CHEMBL442177,1 1,2 16,3 16,4 17,5 18,6 10.412,7 50,8 31.3,9 1.029,10 1.106,11 0.764,12 0.743,13 333.18,14 6.3,15 32,17 24,19 34,20 5.484}
{0 CHEMBL55652,1 5,2 25,3 18,4 12,5 17,6 8.857,7 41.7,8 40,9 1.024,10 1.125,11 0.69,12 0.668,13 531.43,14 6.7,15 60,17 39,19 63,20 4}
{0 CHEMBL55894,1 5,2 26,3 18,4 12,5 17,6 8.817,7 41.3,8 42.9,9 1.014,10 1.125,11 0.679,12 0.651,13 555.47,14 6.3,15 63,17 39,18 1,19 66,20 4}
{0 CHEMBL56024,1 5,2 24,3 18,4 12,5 17,6 9.077,7 42.1,8 38.6,9 1.027,10 1.124,11 0.695,12 0.677,13 517.4,14 7,15 57,17 38,19 60,20 4.427}
{0 CHEMBL56185,1 5,2 30,3 24,4 18,5 23,6 9.008,7 44.8,8 40.3,9 1.013,10 1.117,11 0.698,12 0.672,13 603.51,14 6,15 67,17 44,18 1,19 71,20 4}
{0 CHEMBL56463,1 5,2 25,3 18,4 12,5 17,6 9.024,7 41.7,8 41.7,9 1.017,10 1.124,11 0.684,12 0.658,13 541.44,14 6.7,15 60,17 38,18 1,19 63,20 4}
{0 CHEMBL56582,1 5,2 26,3 18,4 12,5 17,6 8.658,7 41.3,8 41.3,9 1.021,10 1.126,11 0.685,12 0.661,13 545.46,14 6.3,15 63,17 40,19 66,20 4}
{0 CHEMBL57382,1 5,2 23,3 18,4 12,5 17,6 9.322,7 42.6,8 37,9 1.03,10 1.123,11 0.701,12 0.686,13 503.37,14 7.4,15 54,17 37,19 57,20 4}
{0 CHEMBL57816,1 5,2 26,3 18,4 12,5 17,6 8.658,7 41.3,8 41.3,9 1.021,10 1.126,11 0.685,12 0.661,13 545.46,14 6.3,15 63,17 40,19 66,20 4}
{0 CHEMBL58615,2 23,3 15,4 17,5 17,6 8.972,7 41.1,8 48.2,9 0.989,10 1.123,11 0.701,12 0.633,13 502.44,14 7.1,15 56,17 32,19 59,20 7.921}
{0 CHEMBL59204,1 5,2 26,3 18,4 12,5 17,6 8.817,7 41.3,8 42.9,9 1.014,10 1.125,11 0.679,12 0.651,13 555.47,14 6.3,15 63,17 39,18 1,19 66,20 4}
{0 CHEMBL59259,1 5,2 25,3 18,4 12,5 17,6 9.024,7 41.7,8 41.7,9 1.017,10 1.124,11 0.684,12 0.658,13 541.44,14 6.7,15 60,17 38,18 1,19 63,20 4.002}
{0 CHEMBL603509,1 3,2 15,3 6,4 10,5 13,6 8.844,7 27.8,8 42.6,9 1.041,10 1.15,11 0.641,12 0.625,13 477.59,14 13,15 54,17 33,19 56,20 8.155}
{0 CHEMBL603514,1 3,2 15,3 6,4 10,5 13,6 8.797,7 26.8,8 42.9,9 1.042,10 1.154,11 0.636,12 0.621,13 492.61,14 14.3,15 56,17 34,19 58,20 4.706}
{0 CHEMBL60402,2 19,3 15,4 17,5 17,6 8.552,7 43.2,8 43.2,9 1.005,10 1.121,11 0.705,12 0.663,13 376.31,14 6.8,15 44,17 27,19 46,20 6.301}
{0 CHEMBL605589,1 3,2 15,3 6,4 10,5 13,6 11.176,7 27.8,8 40.7,9 1.042,10 1.145,11 0.69,12 0.649,13 603.48,14 13,15 54,17 34,19 56,20 5.921}
{0 CHEMBL605595,1 3,2 17,3 6,4 10,5 14,6 8.957,7 30.4,8 41.1,9 1.04,10 1.145,11 0.654,12 0.638,13 501.61,14 12.5,15 56,17 35,19 58,20 5.959}
{0 CHEMBL605806,1 3,2 21,3 6,4 10,5 14,6 8.202,7 30.9,8 45.6,9 1.026,10 1.144,11 0.642,12 0.615,13 557.73,14 10.3,15 68,17 39,19 70,20 5.721}
{0 CHEMBL605812,1 3,2 15,3 6,4 10,5 13,6 9.482,7 27.8,8 40.7,9 1.047,10 1.149,11 0.657,12 0.64,13 512.03,14 13,15 54,17 34,19 56,20 5.131}
{0 CHEMBL69993,1 1,2 18,3 16,4 17,5 18,6 9.506,7 47.4,8 36.8,9 1.018,10 1.111,11 0.736,12 0.706,13 361.24,14 5.3,15 38,17 26,19 40,20 4.333}
{0 CHEMBL70475,1 1,2 22,3 21,4 23,5 24,6 9.643,7 50,8 34.1,9 1.018,10 1.107,11 0.749,12 0.724,13 424.3,14 6.8,15 44,17 32,19 47,20 4.372}
{0 CHEMBL70536,1 1,2 22,3 22,4 23,5 24,6 10.993,7 52.4,8 28.6,9 1.036,10 1.107,11 0.78,12 0.763,13 461.71,14 4.8,15 42,17 33,19 45,20 4.722}
{0 CHEMBL70567,1 1,2 22,3 22,4 23,5 24,6 11.385,7 52.4,8 28.6,9 1.032,10 1.098,11 0.802,12 0.773,13 478.16,14 4.8,15 42,17 33,19 45,20 5.179}
{0 CHEMBL70982,1 1,2 22,3 22,4 23,5 24,6 9.745,7 52.4,8 33.3,9 1.016,10 1.1,11 0.761,12 0.734,13 409.28,14 4.8,15 42,17 31,19 45,20 5.262}
{0 CHEMBL71727,1 2,2 18,3 17,4 17,5 19,6 10.295,7 47.4,8 31.6,9 1.038,10 1.111,11 0.74,12 0.729,13 391.22,14 5.3,15 38,17 28,19 40,20 4}
{0 CHEMBL71729,1 1,2 22,3 21,4 23,5 24,6 9.643,7 50,8 34.1,9 1.018,10 1.107,11 0.749,12 0.724,13 424.3,14 6.8,15 44,17 32,19 47,20 4.701}
{0 CHEMBL71745,1 1,2 23,3 22,4 23,5 24,6 9.55,7 50,8 34.8,9 1.02,10 1.105,11 0.743,12 0.719,13 439.31,14 4.3,15 46,17 33,19 49,20 4.49}
{0 CHEMBL72005,2 21,3 21,4 28,5 28,6 10.1,7 48.8,8 30.2,9 1.021,10 1.117,11 0.763,12 0.742,13 434.31,14 16.3,15 43,17 34,19 47,20 4.975}
{0 CHEMBL72038,1 1,2 22,3 21,4 23,5 24,6 9.643,7 50,8 34.1,9 1.018,10 1.107,11 0.749,12 0.724,13 424.3,14 6.8,15 44,17 32,19 47,20 4.652}
{0 CHEMBL72421,1 1,2 23,3 22,4 23,5 24,6 10.723,7 50,8 28.3,9 1.053,10 1.127,11 0.739,12 0.744,13 493.28,14 4.3,15 46,17 36,19 49,20 4}
{0 CHEMBL72460,1 1,2 21,3 21,4 23,5 24,6 9.745,7 50,8 33.3,9 1.016,10 1.109,11 0.756,12 0.729,13 409.29,14 9.5,15 42,17 31,19 45,20 4}
{0 CHEMBL73305,1 1,2 22,3 21,4 23,5 24,6 9.643,7 50,8 34.1,9 1.018,10 1.107,11 0.749,12 0.724,13 424.3,14 6.8,15 44,17 32,19 47,20 4.762}
{0 CHEMBL73462,1 2,2 23,3 23,4 23,5 25,6 10.073,7 51.1,8 31.1,9 1.03,10 1.103,11 0.753,12 0.739,13 453.29,14 4.4,15 45,17 34,19 48,20 5.561}
{0 CHEMBL74009,1 1,2 18,3 16,4 17,5 18,6 9.673,7 46.2,8 35.9,9 1.026,10 1.113,11 0.729,12 0.706,13 377.24,14 5.1,15 39,17 27,19 41,20 4.472}
{0 CHEMBL74224,1 2,2 23,3 22,4 23,5 25,6 9.736,7 47.9,8 33.3,9 1.025,10 1.113,11 0.738,12 0.72,13 467.33,14 8.3,15 48,17 35,19 51,20 4.699}
