{
  "data_set_description": {
    "collection_date": "November 2013",
    "creator": "Dr Jeremy Besnard, Dr Ivan Olier, Dr Noureddin Sadawi, Dr Larisa Soldatova, Dr Crina Grosan, Prof Ross King, Dr Richard Bickerton, Prof Andrew Hopkins and Dr Willem van Hoorn",
    "default_target_attribute": "pXC50",
    "description": "This dataset contains QSAR data (from ChEMBL version 17) showing activity values (unit is pseudo-pCI50) of several compounds on drug target ChEMBL_ID: CHEMBL4098 (TID: 100671), and it has 25 rows and 43 features (not including molecule IDs and class feature: molecule_id and pXC50). The features represent Basic Molecular Descriptors which were generated from SMILES strings.  Missing value imputation was applied to this dataset (By choosing the Median).",
    "description_version": "1",
    "file_id": "3299600",
    "format": "ARFF",
    "id": "26321",
    "licence": "Public",
    "md5_checksum": "a4a0ede98b050722d7fc5828bf76a2b0",
    "minio_url": "https://data.openml.org/datasets/0002/26321/dataset_26321.pq",
    "name": "QSAR-DATASET-FOR-DRUG-TARGET-CHEMBL4098",
    "original_data_url": "https://www.ebi.ac.uk/chembl/target/inspect/CHEMBL4098",
    "parquet_url": "https://data.openml.org/datasets/0002/26321/dataset_26321.pq",
    "processing_date": "2018-10-03 23:51:23",
    "row_id_attribute": "molecule_id",
    "status": "deactivated",
    "tag": [
      "MetaQSAR",
      "study_13"
    ],
    "upload_date": "2016-07-14T18:58:40",
    "url": "https://api.openml.org/data/v1/download/3299600/QSAR-DATASET-FOR-DRUG-TARGET-CHEMBL4098.arff",
    "version": "8",
    "visibility": "public"
  }
}