{
  "data_set_description": {
    "collection_date": "November 2013",
    "creator": "Dr Jeremy Besnard, Dr Ivan Olier, Dr Noureddin Sadawi, Dr Larisa Soldatova, Dr Crina Grosan, Prof Ross King, Dr Richard Bickerton, Prof Andrew Hopkins and Dr Willem van Hoorn",
    "default_target_attribute": "pXC50",
    "description": "This dataset contains QSAR data (from ChEMBL version 17) showing activity values (unit is pseudo-pCI50) of several compounds on drug target ChEMBL_ID: CHEMBL4542 (TID: 100602), and it has 84 rows and 1267 features (not including molecule IDs and class feature: molecule_id and pXC50). The features represent Molecular Descriptors which were generated from SMILES strings. Missing value imputation was applied to this dataset (By choosing the Median).",
    "description_version": "1",
    "file_id": "3299397",
    "format": "ARFF",
    "id": "26316",
    "licence": "Public",
    "md5_checksum": "beac3752add75c28c03ee80e8a344872",
    "minio_url": "https://data.openml.org/datasets/0002/26316/dataset_26316.pq",
    "name": "QSAR-DATASET-FOR-DRUG-TARGET-CHEMBL4542",
    "original_data_url": "https://www.ebi.ac.uk/chembl/target/inspect/CHEMBL4542",
    "parquet_url": "https://data.openml.org/datasets/0002/26316/dataset_26316.pq",
    "processing_date": "2018-10-03 23:40:28",
    "row_id_attribute": "molecule_id",
    "status": "deactivated",
    "tag": [
      "MetaQSAR",
      "study_13"
    ],
    "upload_date": "2016-07-14T18:57:57",
    "url": "https://api.openml.org/data/v1/download/3299397/QSAR-DATASET-FOR-DRUG-TARGET-CHEMBL4542.arff",
    "version": "7",
    "visibility": "public"
  }
}