{
  "data_set_description": {
    "collection_date": "November 2013",
    "creator": "Dr Jeremy Besnard, Dr Ivan Olier, Dr Noureddin Sadawi, Dr Larisa Soldatova, Dr Crina Grosan, Prof Ross King, Dr Richard Bickerton, Prof Andrew Hopkins and Dr Willem van Hoorn",
    "default_target_attribute": "pXC50",
    "description": "This dataset contains QSAR data (from ChEMBL version 17) showing activity values (unit is pseudo-pCI50) of several compounds on drug target ChEMBL_ID: CHEMBL1641348 (TID: 103830), and it has 37 rows and 1317 features (not including molecule IDs and class feature: molecule_id and pXC50). The features represent Molecular Descriptors which were generated from SMILES strings. Missing value imputation was applied to this dataset (By choosing the Median).",
    "description_version": "1",
    "file_id": "3298369",
    "format": "ARFF",
    "id": "26288",
    "licence": "Public",
    "md5_checksum": "841a3b0bccacc49e2ca1bc4c9b53e164",
    "minio_url": "https://data.openml.org/datasets/0002/26288/dataset_26288.pq",
    "name": "QSAR-DATASET-FOR-DRUG-TARGET-CHEMBL1641348",
    "original_data_url": "https://www.ebi.ac.uk/chembl/target/inspect/CHEMBL1641348",
    "parquet_url": "https://data.openml.org/datasets/0002/26288/dataset_26288.pq",
    "processing_date": "2018-10-03 23:36:45",
    "row_id_attribute": "molecule_id",
    "status": "deactivated",
    "tag": [
      "MetaQSAR",
      "study_13"
    ],
    "upload_date": "2016-07-14T18:53:55",
    "url": "https://api.openml.org/data/v1/download/3298369/QSAR-DATASET-FOR-DRUG-TARGET-CHEMBL1641348.arff",
    "version": "9",
    "visibility": "public"
  }
}