"molecule_id","AMW","H.","pXC50"
{1 8.882,2 34.5,3 5.252}
{0 CHEMBL2037209,1 8.748,2 35.4,3 5.208}
{0 CHEMBL2037211,1 8.148,2 40.3,3 5.244}
{0 CHEMBL2037220,1 8.409,2 38.7,3 5}
{0 CHEMBL2037224,1 8.834,2 35.1,3 5.824}
{0 CHEMBL2037226,1 8.926,2 35,3 5.119}
{0 CHEMBL401930,1 8,2 43.3,3 6.959}
{0 CHEMBL450610,1 7.464,2 47.2,3 6.939}
{0 CHEMBL451331,1 7.294,2 48.1,3 7.056}
{0 CHEMBL454467,1 7.253,2 48.8,3 7.097}
{0 CHEMBL454515,1 7.246,2 48.4,3 6.821}
{0 CHEMBL459118,1 7.421,2 47.3,3 7.004}
{0 CHEMBL474469,1 7.568,2 46.1,3 7.066}
{0 CHEMBL480965,1 7.394,2 47.3,3 6.971}
{0 CHEMBL480966,1 7.687,2 45.2,3 7.18}
{0 CHEMBL482088,1 7.563,2 46.6,3 7.004}
{0 CHEMBL482089,1 7.687,2 45.7,3 7.26}
{0 CHEMBL482101,1 7.884,2 44.1,3 6.917}
{0 CHEMBL482102,1 7.569,2 46.3,3 6.967}
{0 CHEMBL482126,1 7.509,2 46.7,3 6.967}
{0 CHEMBL499344,1 9.617,2 39,3 5.215}
{0 CHEMBL499345,1 10.457,2 36.6,3 5.131}
{0 CHEMBL499584,1 7.462,2 47.1,3 6.839}
{0 CHEMBL502092,1 7.299,2 48.1,3 7.081}
{0 CHEMBL502778,1 7.373,2 47.8,3 6.714}
{0 CHEMBL505652,1 7.561,2 46.5,3 6.886}
{0 CHEMBL505919,1 7.564,2 46.3,3 7.114}
{0 CHEMBL506169,1 7.46,2 46.9,3 6.979}
{0 CHEMBL510298,1 7.415,2 47.1,3 6.857}
{0 CHEMBL519132,1 7.698,2 45.5,3 6.81}
{0 CHEMBL519300,1 7.445,2 47.1,3 7.036}
{0 CHEMBL520419,1 7.842,2 44.4,3 7.102}
{0 CHEMBL521271,1 7.873,2 44.3,3 7.409}
{0 CHEMBL551064,1 7.213,2 45.8,3 6.824}
{0 CHEMBL575448,1 7.958,2 41.4,3 7.886}
