"molecule_id","Mi","N.","pXC50"
{1 1.154,2 5,3 4.485}
{0 CHEMBL1082833,1 1.154,2 5,3 4.682}
{0 CHEMBL1428,1 1.133,2 3.6,3 6.097}
{0 CHEMBL1484,1 1.127,2 4.7,3 6.301}
{0 CHEMBL193,1 1.13,2 4.7,3 6.398}
{0 CHEMBL256087,1 1.141,3 4.252}
{0 CHEMBL359965,1 1.112,3 5.879}
{0 CHEMBL475534,1 1.13,2 4.3,3 5.42}
{0 CHEMBL513599,1 1.154,2 5,3 4.382}
{0 CHEMBL518292,1 1.124,3 5.588}
{0 CHEMBL593902,1 1.121,2 3.8,3 5.347}
