"molecule_id","AMW","C.","H.","Me","Mi","Mp","Mv","MW","N.","nAB","nAT","nB","nBM","nBO","nBR","nBT","nC","nCL","nCsp","nCsp2","nCsp3","nDB","nF","nH","nHet","nHM","nI","nN","nO","nP","nS","nSK","nTB","nX","O.","RBF","RBN","SCBO","Se","Si","Sp","Sv","X.","pXC50"
{1 7.067,2 38.5,3 48.1,4 1,5 1.136,6 0.645,7 0.612,8 367.5,9 9.6,10 16,11 52,13 16,14 30,16 55,17 20,20 11,21 9,24 25,25 7,28 5,29 2,32 27,35 3.8,36 0.073,37 4,38 38,39 52,40 59.062,41 33.552,42 31.805,44 6.4}
{0 CHEMBL1801177,1 7.05,2 38,3 48,4 0.998,5 1.139,6 0.647,7 0.612,8 352.49,9 12,10 16,11 50,13 16,14 29,16 53,17 19,20 11,21 8,24 24,25 7,28 6,29 1,32 26,35 2,36 0.075,37 4,38 37,39 49.891,40 56.936,41 32.341,42 30.584,44 8}
{0 CHEMBL1801178,1 7.214,2 38.8,3 46.9,4 1.002,5 1.136,6 0.649,7 0.618,8 353.47,9 10.2,10 16,11 49,13 16,14 29,16 52,17 19,20 11,21 8,24 23,25 7,28 5,29 2,32 26,35 4.1,36 0.077,37 4,38 37,39 49.116,40 55.647,41 31.79,42 30.278,44 5.8}
{0 CHEMBL1801179,1 7.067,2 38.5,3 48.1,4 1,5 1.136,6 0.645,7 0.612,8 367.5,9 9.6,10 16,11 52,13 16,14 30,16 55,17 20,20 11,21 9,24 25,25 7,28 5,29 2,32 27,35 3.8,36 0.091,37 5,38 38,39 52,40 59.062,41 33.552,42 31.805,44 7.102}
{0 CHEMBL1801180,1 7.214,2 38.8,3 46.9,4 1.002,5 1.136,6 0.649,7 0.618,8 353.47,9 10.2,10 16,11 49,13 16,14 29,16 52,17 19,20 11,21 8,24 23,25 7,28 5,29 2,32 26,35 4.1,36 0.096,37 5,38 37,39 49.116,40 55.647,41 31.79,42 30.278,44 6.9}
{0 CHEMBL1801181,1 8.387,2 40,3 40,4 1.032,5 1.156,6 0.653,7 0.649,8 377.41,9 11.1,10 16,11 45,13 16,14 30,16 48,17 18,20 11,21 7,23 3,24 18,25 9,28 5,29 1,32 27,34 3,35 2.2,36 0.063,37 3,38 38,39 46.443,40 52.042,41 29.387,42 29.186,43 6.7,44 5.7}
{0 CHEMBL1801182,1 8.155,2 39.6,3 41.7,4 1.028,5 1.155,6 0.649,7 0.64,8 391.44,9 10.4,10 16,11 48,13 16,14 31,16 51,17 19,20 11,21 8,23 3,24 20,25 9,28 5,29 1,32 28,34 3,35 2.1,36 0.078,37 4,38 39,39 49.327,40 55.457,41 31.148,42 30.713,43 6.3,44 6.4}
{0 CHEMBL1801183,1 6.892,2 39.2,3 49,4 0.994,5 1.134,6 0.649,7 0.61,8 351.5,9 9.8,10 16,11 51,13 16,14 29,16 54,17 20,20 11,21 9,24 25,25 6,28 5,29 1,32 26,35 2,36 0.074,37 4,38 37,39 50.672,40 57.853,41 33.097,42 31.09,44 6.5}
{0 CHEMBL1801184,1 8.836,2 41.5,3 41.5,4 1.008,5 1.129,6 0.709,7 0.67,8 362.29,9 12.2,10 16,11 41,13 16,14 27,16 44,17 17,18 2,20 11,21 6,24 17,25 7,26 2,28 5,32 24,34 2,36 0.045,37 2,38 35,39 41.342,40 46.286,41 29.074,42 27.45,43 4.9,44 6.2}
{0 CHEMBL1801185,1 9.152,2 40,3 37.8,4 1.039,5 1.155,6 0.672,7 0.667,8 411.85,9 11.1,10 16,11 45,13 16,14 31,16 48,17 18,18 1,20 11,21 7,23 3,24 17,25 10,26 1,28 5,29 1,32 28,34 4,35 2.2,36 0.063,37 3,38 39,39 46.767,40 51.986,41 30.245,42 30.014,43 8.9,44 6.1}
{0 CHEMBL1801186,1 7.405,2 39.6,3 45.8,4 1.006,5 1.141,6 0.652,7 0.624,8 355.46,9 10.4,10 16,11 48,13 16,14 29,16 51,17 19,20 11,21 8,23 1,24 22,25 7,28 5,29 1,32 26,34 1,35 2.1,36 0.078,37 4,38 37,39 48.301,40 54.777,41 31.273,42 29.946,43 2.1,44 7.071}
{0 CHEMBL1801187,1 7.78,2 39.6,3 43.8,4 1.017,5 1.148,6 0.65,7 0.632,8 373.45,9 10.4,10 16,11 48,13 16,14 30,16 51,17 19,20 11,21 8,23 2,24 21,25 8,28 5,29 1,32 27,34 2,35 2.1,36 0.078,37 4,38 38,39 48.814,40 55.117,41 31.211,42 30.33,43 4.2,44 6.1}
{0 CHEMBL1801188,1 8.53,2 39.6,3 39.6,4 1.038,5 1.162,6 0.648,7 0.648,8 409.43,9 10.4,10 16,11 48,13 16,14 32,16 51,17 19,20 11,21 8,23 4,24 19,25 10,28 5,29 1,32 29,34 4,35 2.1,36 0.078,37 4,38 40,39 49.84,40 55.797,41 31.086,42 31.096,43 8.3,44 6.2}
{0 CHEMBL1801189,1 8.315,2 38.8,3 40.8,4 1.034,5 1.156,6 0.645,7 0.641,8 407.44,9 10.2,10 16,11 49,13 16,14 32,16 52,17 19,20 11,21 8,23 3,24 20,25 10,28 5,29 2,32 29,34 3,35 4.1,36 0.096,37 5,38 40,39 50.654,40 56.666,41 31.603,42 31.428,43 6.1,44 5.7}
{0 CHEMBL1801190,1 9.007,2 40.5,3 40.5,4 1.016,5 1.131,6 0.703,7 0.671,8 378.29,9 11.9,10 16,11 42,13 16,14 28,16 45,17 17,18 2,20 11,21 6,24 17,25 8,26 2,28 5,29 1,32 25,34 2,35 2.4,36 0.067,37 3,38 36,39 42.669,40 47.495,41 29.529,42 28.164,43 4.8,44 5.2}
{0 CHEMBL1801191,1 9.301,2 39.1,3 37,4 1.046,5 1.156,6 0.667,7 0.668,8 427.85,9 10.9,10 16,11 46,13 16,14 32,16 49,17 18,18 1,20 11,21 7,23 3,24 17,25 11,26 1,28 5,29 2,32 29,34 4,35 4.3,36 0.082,37 4,38 40,39 48.094,40 53.195,41 30.699,42 30.728,43 8.7,44 5.4}
{0 CHEMBL1801192,1 7.581,2 38.8,3 44.9,4 1.013,5 1.143,6 0.648,7 0.626,8 371.46,9 10.2,10 16,11 49,13 16,14 30,16 52,17 19,20 11,21 8,23 1,24 22,25 8,28 5,29 2,32 27,34 1,35 4.1,36 0.096,37 5,38 38,39 49.629,40 55.987,41 31.728,42 30.661,43 2,44 6.699}
{0 CHEMBL1801205,1 7.078,2 38.6,3 47.7,4 0.998,5 1.137,6 0.649,7 0.614,8 311.43,9 11.4,10 16,11 44,13 16,14 25,16 46,17 17,20 11,21 6,24 21,25 6,28 5,29 1,32 23,35 2.3,36 0.087,37 4,38 33,39 43.905,40 50.023,41 28.574,42 27.036,44 6.801}
{0 CHEMBL1801206,1 7.031,2 39.6,3 47.9,4 0.996,5 1.134,6 0.653,7 0.616,8 337.47,9 10.4,10 16,11 48,13 16,14 28,16 51,17 19,20 11,21 8,24 23,25 6,28 5,29 1,32 25,35 2.1,36 0.078,37 4,38 36,39 47.789,40 54.438,41 31.336,42 29.563,44 7.658}
{0 CHEMBL1801207,1 7.188,2 40,3 46.7,4 0.998,5 1.134,6 0.657,7 0.623,8 323.44,9 11.1,10 16,11 45,13 16,14 27,16 48,17 18,20 11,21 7,24 21,25 6,28 5,29 1,32 24,35 2.2,36 0.083,37 4,38 35,39 44.905,40 51.023,41 29.574,42 28.036,44 7.229}
{0 CHEMBL1801208,1 7.254,2 39,3 46.3,4 1.001,5 1.137,6 0.654,7 0.622,8 297.4,9 12.2,10 16,11 41,13 16,14 24,16 43,17 16,20 11,21 5,24 19,25 6,28 5,29 1,32 22,35 2.4,36 0.093,37 4,38 32,39 41.022,40 46.607,41 26.813,42 25.509,44 6.27}
{0 CHEMBL1801209,1 6.892,2 39.2,3 49,4 0.994,5 1.134,6 0.649,7 0.61,8 351.5,9 9.8,10 16,11 51,13 16,14 29,16 54,17 20,20 11,21 9,24 25,25 6,28 5,29 1,32 26,35 2,36 0.074,37 4,38 37,39 50.672,40 57.853,41 33.097,42 31.09,44 6}
{0 CHEMBL1801210,1 6.769,2 38.9,3 50,4 0.992,5 1.135,6 0.646,7 0.604,8 365.53,9 9.3,10 16,11 54,13 16,14 30,16 57,17 21,20 11,21 10,24 27,25 6,28 5,29 1,32 27,35 1.9,36 0.07,37 4,38 38,39 53.556,40 61.268,41 34.858,42 32.617,44 5.671}
{0 CHEMBL1801211,1 7.05,2 38,3 48,4 0.998,5 1.139,6 0.647,7 0.612,8 352.49,9 12,10 16,11 50,13 16,14 29,16 53,17 19,20 11,21 8,24 24,25 7,28 6,29 1,32 26,35 2,36 0.075,37 4,38 37,39 49.891,40 56.936,41 32.341,42 30.584,44 6}
{0 CHEMBL1801212,1 6.915,2 37.7,3 49.1,4 0.996,5 1.139,6 0.643,7 0.606,8 366.52,9 11.3,10 16,11 53,13 16,14 30,16 56,17 20,20 11,21 9,24 26,25 7,28 6,29 1,32 27,35 1.9,36 0.071,37 4,38 38,39 52.774,40 60.351,41 34.103,42 32.111,44 5.97}
{0 CHEMBL1801213,1 6.915,2 37.7,3 49.1,4 0.996,5 1.139,6 0.643,7 0.606,8 366.52,9 11.3,10 16,11 53,13 16,14 30,16 56,17 20,20 11,21 9,24 26,25 7,28 6,29 1,32 27,35 1.9,36 0.071,37 4,38 38,39 52.774,40 60.351,41 34.103,42 32.111,44 6}
