{
  "data_features": {
    "feature": [
      {
        "data_type": "nominal",
        "index": "0",
        "is_ignore": "false",
        "is_row_identifier": "true",
        "is_target": "false",
        "name": "molecule_id",
        "nominal_value": [
          "CHEMBL114388",
          "CHEMBL207591",
          "CHEMBL207990",
          "CHEMBL2141296",
          "CHEMBL2326260",
          "CHEMBL2326261",
          "CHEMBL2326272",
          "CHEMBL2326533",
          "CHEMBL2326539",
          "CHEMBL2326541",
          "CHEMBL2337841",
          "CHEMBL2337842",
          "CHEMBL2337843",
          "CHEMBL2337844",
          "CHEMBL2337845",
          "CHEMBL2337846",
          "CHEMBL2337847",
          "CHEMBL2337848",
          "CHEMBL2337849",
          "CHEMBL2337850",
          "CHEMBL2337877",
          "CHEMBL2337881",
          "CHEMBL2337886",
          "CHEMBL2338308",
          "CHEMBL2338312",
          "CHEMBL2338319",
          "CHEMBL325041",
          "CHEMBL371405",
          "CHEMBL577867",
          "CHEMBL578478",
          "CHEMBL578486",
          "CHEMBL578518",
          "CHEMBL578885",
          "CHEMBL579296",
          "CHEMBL591777",
          "CHEMBL592161",
          "CHEMBL64925"
        ],
        "number_of_missing_values": "0"
      },
      {
        "data_type": "numeric",
        "index": "1",
        "is_ignore": "false",
        "is_row_identifier": "false",
        "is_target": "false",
        "name": "Sv",
        "number_of_missing_values": "0"
      },
      {
        "data_type": "numeric",
        "index": "2",
        "is_ignore": "false",
        "is_row_identifier": "false",
        "is_target": "false",
        "name": "AMW",
        "number_of_missing_values": "0"
      },
      {
        "data_type": "numeric",
        "index": "3",
        "is_ignore": "false",
        "is_row_identifier": "false",
        "is_target": "true",
        "name": "pXC50",
        "number_of_missing_values": "0"
      }
    ]
  }
}