"molecule_id","FCFP4_1024b114","FCFP4_1024b671","FCFP4_1024b733","FCFP4_1024b270","FCFP4_1024b378","FCFP4_1024b403","FCFP4_1024b514","FCFP4_1024b691","FCFP4_1024b805","FCFP4_1024b908","FCFP4_1024b539","FCFP4_1024b124","FCFP4_1024b589","FCFP4_1024b17","FCFP4_1024b170","FCFP4_1024b986","FCFP4_1024b868","FCFP4_1024b490","FCFP4_1024b695","FCFP4_1024b524","FCFP4_1024b804","FCFP4_1024b723","FCFP4_1024b771","FCFP4_1024b166","FCFP4_1024b294","FCFP4_1024b775","FCFP4_1024b958","FCFP4_1024b557","FCFP4_1024b469","FCFP4_1024b754","FCFP4_1024b612","FCFP4_1024b60","FCFP4_1024b641","FCFP4_1024b4","FCFP4_1024b879","FCFP4_1024b541","FCFP4_1024b821","FCFP4_1024b998","FCFP4_1024b420","FCFP4_1024b1","FCFP4_1024b10","FCFP4_1024b100","FCFP4_1024b1000","FCFP4_1024b1001","FCFP4_1024b1002","FCFP4_1024b1003","FCFP4_1024b1004","FCFP4_1024b1005","FCFP4_1024b1006","FCFP4_1024b1007","FCFP4_1024b1008","pXC50"
{14 1,15 1,16 1,40 1,52 7}
{0 CHEMBL1545798,14 1,15 1,34 1,40 1,52 5.6}
{0 CHEMBL160,1 1,2 1,3 1,4 1,5 1,6 1,7 1,8 1,9 1,10 1,11 1,12 1,13 1,16 1,17 1,20 1,22 1,23 1,28 1,30 1,34 1,40 1,52 5}
{0 CHEMBL162488,14 1,15 1,21 1,34 1,36 1,37 1,38 1,40 1,52 6.301}
{0 CHEMBL1770153,14 1,15 1,21 1,34 1,40 1,52 5.9}
{0 CHEMBL1770295,10 1,14 1,15 1,16 1,20 1,21 1,40 1,52 5.3}
{0 CHEMBL1770296,14 1,15 1,21 1,34 1,36 1,40 1,52 5.6}
{0 CHEMBL1770297,14 1,15 1,34 1,40 1,52 6.3}
{0 CHEMBL1770298,14 1,15 1,21 1,34 1,40 1,52 6.4}
{0 CHEMBL1770299,14 1,15 1,21 1,34 1,40 1,52 6.1}
{0 CHEMBL1770300,14 1,15 1,21 1,34 1,40 1,52 7.1}
{0 CHEMBL1770301,14 1,15 1,21 1,25 1,34 1,40 1,52 5.8}
{0 CHEMBL1770302,14 1,15 1,21 1,34 1,40 1,52 6.1}
{0 CHEMBL1770303,14 1,15 1,21 1,34 1,40 1,52 5.3}
{0 CHEMBL1770304,14 1,15 1,21 1,34 1,40 1,52 5.6}
{0 CHEMBL1770307,14 1,15 1,21 1,34 1,40 1,51 1,52 5.6}
{0 CHEMBL1770308,10 1,14 1,15 1,18 1,21 1,34 1,40 1,52 5}
{0 CHEMBL1770309,14 1,15 1,34 1,40 1,52 5.4}
{0 CHEMBL1770310,14 1,15 1,34 1,40 1,52 5.4}
{0 CHEMBL1770466,14 1,15 1,21 1,34 1,40 1,52 5.3}
{0 CHEMBL1770468,14 1,15 1,21 1,34 1,40 1,52 5.4}
{0 CHEMBL1770469,14 1,15 1,34 1,40 1,52 5}
{0 CHEMBL1770470,14 1,15 1,34 1,40 1,52 5}
{0 CHEMBL1770471,14 1,15 1,34 1,40 1,52 5.7}
{0 CHEMBL1770472,14 1,15 1,21 1,34 1,40 1,52 5}
{0 CHEMBL1770474,14 1,15 1,20 1,21 1,34 1,40 1,52 5.6}
{0 CHEMBL1770475,14 1,15 1,20 1,21 1,34 1,40 1,41 1,52 6.5}
{0 CHEMBL1770476,14 1,15 1,34 1,40 1,52 5.8}
{0 CHEMBL1770477,14 1,15 1,34 1,40 1,52 5.5}
{0 CHEMBL1770478,14 1,15 1,34 1,35 1,40 1,52 5.3}
{0 CHEMBL1770479,14 1,15 1,34 1,40 1,52 5.2}
{0 CHEMBL1770480,14 1,15 1,34 1,40 1,52 4.6}
{0 CHEMBL1770481,14 1,15 1,34 1,40 1,52 6.2}
{0 CHEMBL1770482,14 1,15 1,34 1,40 1,52 5}
{0 CHEMBL1770484,14 1,15 1,34 1,40 1,52 6}
{0 CHEMBL1791446,1 1,2 1,3 1,4 1,5 1,6 1,7 1,8 1,9 1,10 1,11 1,12 1,13 1,16 1,17 1,20 1,22 1,23 1,28 1,30 1,34 1,40 1,52 5.804}
{0 CHEMBL1916082,14 1,15 1,21 1,34 1,40 1,52 5.7}
{0 CHEMBL1916084,14 1,15 1,21 1,34 1,40 1,52 5.4}
{0 CHEMBL1916085,10 1,14 1,15 1,18 1,20 1,21 1,34 1,40 1,47 1,52 5.8}
{0 CHEMBL1916086,14 1,15 1,21 1,34 1,40 1,52 5}
{0 CHEMBL1916087,14 1,15 1,21 1,34 1,40 1,52 6.1}
{0 CHEMBL1916255,14 1,15 1,21 1,34 1,40 1,52 6.5}
{0 CHEMBL1916257,14 1,15 1,21 1,34 1,40 1,52 5}
{0 CHEMBL1916258,14 1,15 1,21 1,34 1,40 1,52 5.2}
{0 CHEMBL1916259,14 1,15 1,21 1,34 1,40 1,52 5.3}
{0 CHEMBL1916260,14 1,15 1,34 1,40 1,52 5.3}
{0 CHEMBL1916261,14 1,15 1,21 1,34 1,40 1,52 5.4}
{0 CHEMBL1916262,14 1,15 1,21 1,34 1,40 1,52 5.8}
{0 CHEMBL1916263,14 1,15 1,21 1,34 1,40 1,52 5}
{0 CHEMBL1916264,14 1,15 1,21 1,34 1,40 1,52 5}
{0 CHEMBL1916265,14 1,15 1,21 1,34 1,40 1,41 1,52 4.8}
{0 CHEMBL1916266,14 1,15 1,21 1,34 1,40 1,52 4.7}
{0 CHEMBL1916267,14 1,15 1,21 1,24 1,34 1,40 1,52 5.3}
{0 CHEMBL1916268,14 1,15 1,21 1,24 1,34 1,40 1,52 5}
{0 CHEMBL1916270,14 1,15 1,21 1,34 1,40 1,52 5.3}
{0 CHEMBL1916271,10 1,14 1,15 1,18 1,20 1,21 1,34 1,40 1,52 7.1}
{0 CHEMBL1916272,14 1,15 1,21 1,34 1,40 1,52 6.3}
{0 CHEMBL1916273,14 1,15 1,21 1,34 1,40 1,52 5.2}
{0 CHEMBL1916274,14 1,15 1,21 1,34 1,40 1,52 6.1}
{0 CHEMBL1916275,10 1,14 1,15 1,18 1,20 1,21 1,34 1,40 1,47 1,52 5.5}
{0 CHEMBL1916276,14 1,15 1,21 1,30 1,34 1,40 1,52 6}
{0 CHEMBL1916277,14 1,15 1,21 1,30 1,34 1,40 1,52 6.8}
{0 CHEMBL1916278,14 1,15 1,21 1,34 1,40 1,52 5.3}
{0 CHEMBL1916279,14 1,15 1,21 1,34 1,40 1,47 1,52 5.7}
{0 CHEMBL1916280,14 1,15 1,21 1,34 1,40 1,52 6.8}
{0 CHEMBL1916281,14 1,15 1,21 1,34 1,40 1,52 6.9}
{0 CHEMBL1916282,14 1,15 1,21 1,34 1,40 1,52 6.4}
{0 CHEMBL1916283,14 1,15 1,21 1,34 1,40 1,52 6.3}
{0 CHEMBL1916284,14 1,15 1,21 1,34 1,40 1,52 7.6}
{0 CHEMBL1916286,14 1,15 1,34 1,40 1,52 6}
{0 CHEMBL1916287,14 1,15 1,21 1,34 1,40 1,52 6}
{0 CHEMBL1916288,14 1,15 1,21 1,34 1,40 1,41 1,52 6.9}
{0 CHEMBL1916289,14 1,15 1,21 1,34 1,40 1,52 7.9}
{0 CHEMBL1934266,14 1,15 1,21 1,34 1,40 1,52 4.6}
{0 CHEMBL1934267,14 1,15 1,21 1,34 1,40 1,52 6}
{0 CHEMBL1934268,14 1,15 1,21 1,34 1,40 1,52 5.2}
{0 CHEMBL1934269,14 1,15 1,21 1,34 1,40 1,52 5.5}
{0 CHEMBL1934270,14 1,15 1,21 1,34 1,40 1,52 5.8}
{0 CHEMBL1934271,14 1,15 1,21 1,34 1,40 1,52 6.4}
{0 CHEMBL1934413,14 1,15 1,21 1,34 1,40 1,52 6.7}
{0 CHEMBL1934414,14 1,15 1,21 1,34 1,40 1,52 7.1}
{0 CHEMBL1934415,14 1,15 1,21 1,34 1,40 1,52 7.5}
{0 CHEMBL1934416,14 1,15 1,21 1,34 1,40 1,52 5.6}
{0 CHEMBL1934417,14 1,15 1,21 1,34 1,40 1,52 6.5}
{0 CHEMBL1934418,14 1,15 1,21 1,34 1,40 1,52 7.4}
{0 CHEMBL1934419,14 1,15 1,21 1,34 1,40 1,52 5}
{0 CHEMBL1934421,14 1,15 1,21 1,34 1,40 1,41 1,52 5.5}
{0 CHEMBL1934422,14 1,15 1,21 1,34 1,40 1,52 6.5}
{0 CHEMBL1934423,14 1,15 1,21 1,34 1,40 1,52 6}
{0 CHEMBL1934424,14 1,15 1,20 1,21 1,34 1,40 1,52 7.7}
{0 CHEMBL1934426,14 1,15 1,21 1,34 1,40 1,52 6.45}
{0 CHEMBL2021596,1 1,2 1,3 1,4 1,5 1,6 1,7 1,8 1,9 1,10 1,11 1,12 1,13 1,16 1,17 1,20 1,22 1,23 1,28 1,34 1,40 1,52 6.824}
{0 CHEMBL230049,14 1,15 1,21 1,24 1,25 1,26 1,27 1,34 1,40 1,52 5}
{0 CHEMBL230051,14 1,15 1,21 1,24 1,25 1,26 1,27 1,34 1,40 1,52 5}
{0 CHEMBL231329,14 1,15 1,21 1,24 1,25 1,26 1,27 1,34 1,40 1,52 5}
{0 CHEMBL231427,14 1,15 1,21 1,24 1,25 1,26 1,27 1,34 1,40 1,52 5}
{0 CHEMBL231432,10 1,14 1,15 1,18 1,19 1,21 1,24 1,25 1,26 1,27 1,34 1,40 1,52 5}
{0 CHEMBL231529,10 1,14 1,15 1,18 1,21 1,24 1,25 1,26 1,27 1,34 1,40 1,52 5}
{0 CHEMBL231618,14 1,15 1,21 1,24 1,25 1,26 1,27 1,34 1,40 1,52 5}
{0 CHEMBL248928,10 1,14 1,15 1,18 1,19 1,31 1,32 1,33 1,35 1,39 1,40 1,52 5}
{0 CHEMBL249132,10 1,14 1,15 1,18 1,19 1,31 1,32 1,33 1,35 1,39 1,40 1,52 5}
{0 CHEMBL249338,10 1,14 1,15 1,18 1,19 1,31 1,32 1,33 1,35 1,39 1,40 1,52 5}
{0 CHEMBL249339,10 1,14 1,15 1,18 1,19 1,31 1,32 1,33 1,35 1,39 1,40 1,52 5}
{0 CHEMBL249537,10 1,14 1,15 1,18 1,19 1,31 1,32 1,33 1,35 1,39 1,40 1,52 5}
{0 CHEMBL249742,10 1,14 1,15 1,18 1,19 1,21 1,31 1,32 1,33 1,35 1,39 1,40 1,52 5}
{0 CHEMBL250143,10 1,14 1,15 1,18 1,19 1,25 1,31 1,32 1,33 1,40 1,52 5}
{0 CHEMBL250347,10 1,14 1,15 1,18 1,19 1,31 1,32 1,33 1,35 1,39 1,40 1,52 5}
{0 CHEMBL251772,10 1,14 1,15 1,18 1,19 1,31 1,32 1,33 1,35 1,40 1,52 5}
{0 CHEMBL265408,14 1,15 1,21 1,34 1,36 1,37 1,38 1,40 1,52 6.523}
{0 CHEMBL266089,14 1,15 1,21 1,34 1,36 1,37 1,38 1,40 1,52 6.523}
{0 CHEMBL266448,14 1,15 1,21 1,34 1,36 1,37 1,38 1,40 1,52 5.611}
{0 CHEMBL266802,14 1,15 1,21 1,34 1,36 1,37 1,38 1,40 1,52 8.699}
{0 CHEMBL267179,14 1,15 1,21 1,34 1,36 1,40 1,52 7.699}
{0 CHEMBL267388,14 1,15 1,21 1,34 1,36 1,37 1,38 1,40 1,52 8.699}
{0 CHEMBL268823,14 1,15 1,21 1,34 1,36 1,37 1,38 1,40 1,52 5.398}
{0 CHEMBL384358,1 1,2 1,3 1,4 1,5 1,6 1,7 1,8 1,9 1,10 1,11 1,12 1,13 1,16 1,17 1,20 1,22 1,23 1,28 1,30 1,34 1,40 1,52 5.26}
{0 CHEMBL388455,10 1,14 1,15 1,18 1,19 1,21 1,24 1,25 1,26 1,27 1,34 1,40 1,52 5}
{0 CHEMBL390200,10 1,14 1,15 1,18 1,21 1,24 1,25 1,26 1,27 1,34 1,40 1,41 1,45 1,52 5}
{0 CHEMBL390476,14 1,15 1,18 1,21 1,24 1,25 1,26 1,27 1,34 1,40 1,52 5}
{0 CHEMBL395493,1 1,5 1,10 1,12 1,13 1,14 1,15 1,16 1,17 1,19 1,20 1,21 1,31 1,34 1,40 1,52 4}
{0 CHEMBL400089,10 1,14 1,15 1,18 1,19 1,31 1,32 1,33 1,35 1,39 1,40 1,52 5}
{0 CHEMBL400723,10 1,14 1,15 1,18 1,19 1,35 1,39 1,40 1,52 5}
{0 CHEMBL401313,10 1,14 1,15 1,18 1,19 1,31 1,32 1,33 1,40 1,52 5}
{0 CHEMBL401314,10 1,14 1,15 1,18 1,19 1,31 1,32 1,33 1,35 1,39 1,40 1,52 5}
{0 CHEMBL404003,10 1,14 1,15 1,18 1,19 1,31 1,32 1,33 1,35 1,40 1,52 5}
{0 CHEMBL410614,1 1,2 1,3 1,4 1,5 1,6 1,7 1,8 1,9 1,10 1,11 1,12 1,13 1,16 1,17 1,20 1,22 1,23 1,28 1,30 1,34 1,40 1,52 5}
{0 CHEMBL411623,1 1,2 1,3 1,4 1,5 1,6 1,7 1,8 1,9 1,10 1,11 1,12 1,13 1,16 1,17 1,20 1,22 1,23 1,28 1,30 1,34 1,40 1,52 5.19}
{0 CHEMBL415296,14 1,15 1,17 1,21 1,34 1,36 1,37 1,38 1,40 1,52 6.523}
{0 CHEMBL415299,14 1,15 1,21 1,34 1,36 1,37 1,38 1,40 1,52 5.611}
{0 CHEMBL430016,10 1,14 1,15 1,18 1,19 1,31 1,32 1,33 1,35 1,39 1,40 1,52 5}
{0 CHEMBL433815,14 1,15 1,21 1,24 1,25 1,26 1,27 1,34 1,40 1,52 5}
{0 CHEMBL438108,10 1,14 1,15 1,18 1,19 1,21 1,24 1,25 1,26 1,27 1,34 1,40 1,52 5}
{0 CHEMBL539401,14 1,15 1,16 1,21 1,28 1,34 1,40 1,46 1,52 5.796}
{0 CHEMBL549570,14 1,15 1,16 1,21 1,28 1,34 1,40 1,46 1,52 4.664}
{0 CHEMBL551589,14 1,15 1,16 1,21 1,28 1,34 1,40 1,46 1,52 5.585}
{0 CHEMBL551590,14 1,15 1,16 1,21 1,28 1,34 1,40 1,46 1,52 4.947}
{0 CHEMBL552396,14 1,15 1,16 1,21 1,28 1,34 1,40 1,46 1,52 5.409}
{0 CHEMBL552527,1 1,5 1,14 1,15 1,21 1,31 1,34 1,36 1,40 1,52 6.301}
{0 CHEMBL554291,14 1,15 1,16 1,21 1,28 1,34 1,40 1,46 1,52 5.444}
{0 CHEMBL556485,14 1,15 1,16 1,21 1,28 1,34 1,40 1,46 1,52 5.444}
{0 CHEMBL556625,14 1,15 1,16 1,21 1,28 1,34 1,40 1,46 1,52 5.174}
{0 CHEMBL560780,14 1,15 1,16 1,21 1,28 1,34 1,40 1,46 1,52 5.495}
{0 CHEMBL561375,14 1,15 1,16 1,21 1,28 1,34 1,40 1,46 1,52 5.495}
{0 CHEMBL562380,14 1,15 1,16 1,21 1,28 1,34 1,40 1,46 1,52 5.367}
{0 CHEMBL562456,14 1,15 1,16 1,21 1,28 1,34 1,40 1,46 1,52 4.979}
{0 CHEMBL562910,14 1,15 1,16 1,21 1,28 1,34 1,40 1,46 1,52 5.959}
{0 CHEMBL564392,14 1,15 1,16 1,20 1,21 1,28 1,34 1,40 1,46 1,52 6.097}
{0 CHEMBL606577,1 1,2 1,3 1,4 1,5 1,6 1,7 1,8 1,9 1,10 1,11 1,12 1,13 1,14 1,15 1,16 1,17 1,20 1,21 1,22 1,23 1,28 1,29 1,30 1,34 1,40 1,52 5}
{0 CHEMBL606579,2 1,3 1,4 1,5 1,6 1,7 1,8 1,9 1,10 1,11 1,12 1,13 1,16 1,17 1,20 1,22 1,23 1,28 1,30 1,34 1,40 1,52 5.036}
{0 CHEMBL606580,4 1,6 1,7 1,8 1,9 1,10 1,12 1,13 1,16 1,17 1,20 1,22 1,23 1,28 1,30 1,34 1,36 1,40 1,52 6.252}
{0 CHEMBL606581,2 1,3 1,4 1,6 1,7 1,8 1,9 1,10 1,12 1,13 1,16 1,17 1,20 1,22 1,23 1,28 1,30 1,34 1,40 1,52 6.125}
{0 CHEMBL606582,6 1,7 1,8 1,9 1,10 1,12 1,13 1,16 1,17 1,20 1,22 1,23 1,28 1,30 1,34 1,40 1,52 6.523}
{0 CHEMBL606583,1 1,4 1,5 1,6 1,7 1,8 1,9 1,10 1,11 1,12 1,13 1,16 1,17 1,20 1,22 1,23 1,28 1,30 1,34 1,40 1,52 5.301}
{0 CHEMBL606585,1 1,2 1,3 1,4 1,5 1,6 1,7 1,8 1,9 1,10 1,12 1,13 1,16 1,17 1,20 1,22 1,23 1,28 1,29 1,30 1,34 1,40 1,52 5}
{0 CHEMBL606586,2 1,3 1,4 1,5 1,6 1,7 1,8 1,9 1,10 1,11 1,12 1,13 1,16 1,17 1,20 1,22 1,23 1,28 1,30 1,34 1,40 1,52 5.523}
{0 CHEMBL606588,1 1,2 1,3 1,4 1,5 1,6 1,7 1,8 1,9 1,10 1,11 1,12 1,13 1,16 1,17 1,20 1,22 1,23 1,28 1,30 1,34 1,40 1,52 5}
{0 CHEMBL606589,1 1,2 1,3 1,4 1,5 1,6 1,7 1,8 1,9 1,10 1,12 1,13 1,16 1,17 1,20 1,22 1,23 1,28 1,30 1,34 1,40 1,52 5.523}
{0 CHEMBL606594,2 1,3 1,4 1,6 1,7 1,8 1,9 1,10 1,12 1,13 1,16 1,17 1,20 1,22 1,23 1,28 1,30 1,34 1,40 1,52 5.83}
{0 CHEMBL606595,1 1,2 1,3 1,4 1,5 1,6 1,7 1,8 1,9 1,10 1,11 1,12 1,13 1,16 1,17 1,20 1,22 1,23 1,28 1,30 1,34 1,40 1,52 5}
{0 CHEMBL606596,1 1,2 1,3 1,4 1,5 1,6 1,7 1,8 1,9 1,10 1,11 1,12 1,13 1,16 1,17 1,20 1,34 1,40 1,52 5}
{0 CHEMBL606598,1 1,2 1,3 1,4 1,5 1,6 1,7 1,8 1,9 1,10 1,11 1,12 1,13 1,16 1,17 1,20 1,22 1,23 1,28 1,29 1,30 1,34 1,40 1,52 5}
{0 CHEMBL606599,1 1,2 1,3 1,4 1,5 1,6 1,7 1,8 1,9 1,10 1,11 1,12 1,13 1,16 1,17 1,20 1,22 1,23 1,28 1,29 1,30 1,34 1,40 1,52 5}
{0 CHEMBL606600,2 1,3 1,4 1,5 1,6 1,7 1,8 1,9 1,10 1,12 1,13 1,16 1,17 1,20 1,22 1,23 1,28 1,30 1,34 1,40 1,52 5.602}
{0 CHEMBL606660,2 1,3 1,4 1,6 1,7 1,8 1,9 1,10 1,11 1,12 1,13 1,16 1,17 1,20 1,22 1,23 1,28 1,30 1,34 1,40 1,52 6.229}
{0 CHEMBL606661,2 1,3 1,4 1,6 1,7 1,8 1,9 1,10 1,11 1,12 1,13 1,16 1,17 1,20 1,22 1,23 1,28 1,30 1,34 1,40 1,52 5.488}
{0 CHEMBL606662,2 1,3 1,4 1,6 1,7 1,8 1,9 1,10 1,12 1,13 1,16 1,17 1,20 1,22 1,23 1,28 1,30 1,34 1,40 1,52 6.244}
{0 CHEMBL606663,1 1,5 1,6 1,7 1,8 1,9 1,10 1,12 1,13 1,16 1,17 1,20 1,22 1,23 1,28 1,30 1,34 1,36 1,40 1,52 5.301}
{0 CHEMBL607397,1 1,2 1,3 1,4 1,6 1,7 1,8 1,9 1,10 1,11 1,12 1,13 1,16 1,17 1,20 1,22 1,23 1,28 1,30 1,34 1,40 1,52 5.469}
{0 CHEMBL607453,1 1,2 1,3 1,4 1,5 1,6 1,7 1,8 1,9 1,10 1,11 1,12 1,13 1,16 1,17 1,20 1,34 1,40 1,52 5}
{0 CHEMBL607454,1 1,2 1,3 1,4 1,5 1,6 1,7 1,8 1,9 1,10 1,11 1,12 1,13 1,16 1,17 1,20 1,34 1,40 1,52 5}
{0 CHEMBL607456,2 1,3 1,4 1,5 1,6 1,7 1,8 1,9 1,10 1,11 1,12 1,13 1,16 1,17 1,20 1,22 1,23 1,28 1,30 1,34 1,40 1,52 5.523}
{0 CHEMBL607457,1 1,2 1,3 1,4 1,6 1,7 1,8 1,9 1,10 1,11 1,12 1,13 1,16 1,17 1,20 1,22 1,23 1,28 1,30 1,34 1,40 1,52 5.638}
{0 CHEMBL607458,1 1,2 1,3 1,4 1,6 1,7 1,8 1,9 1,10 1,11 1,12 1,13 1,16 1,17 1,20 1,22 1,23 1,28 1,30 1,34 1,40 1,52 5}
{0 CHEMBL607460,1 1,2 1,3 1,4 1,5 1,6 1,7 1,8 1,9 1,10 1,11 1,12 1,13 1,16 1,17 1,20 1,22 1,23 1,28 1,29 1,30 1,34 1,40 1,52 5.301}
{0 CHEMBL607461,1 1,2 1,3 1,4 1,5 1,6 1,7 1,8 1,9 1,10 1,11 1,12 1,13 1,16 1,17 1,20 1,22 1,23 1,28 1,29 1,30 1,34 1,40 1,52 5}
{0 CHEMBL607462,1 1,2 1,3 1,4 1,5 1,6 1,7 1,8 1,9 1,10 1,11 1,12 1,13 1,16 1,17 1,20 1,22 1,23 1,28 1,29 1,30 1,34 1,40 1,52 5.155}
{0 CHEMBL607463,1 1,2 1,3 1,4 1,5 1,6 1,7 1,8 1,9 1,10 1,11 1,12 1,13 1,16 1,17 1,20 1,22 1,23 1,28 1,30 1,34 1,36 1,40 1,52 5}
{0 CHEMBL607464,2 1,3 1,4 1,5 1,6 1,7 1,8 1,9 1,10 1,11 1,12 1,13 1,16 1,17 1,20 1,22 1,23 1,28 1,30 1,34 1,40 1,52 5.523}
{0 CHEMBL607465,1 1,2 1,3 1,4 1,5 1,6 1,7 1,8 1,9 1,10 1,12 1,13 1,16 1,17 1,20 1,22 1,23 1,28 1,30 1,34 1,40 1,52 5}
{0 CHEMBL607466,1 1,2 1,3 1,4 1,5 1,6 1,7 1,8 1,9 1,10 1,11 1,12 1,13 1,16 1,17 1,20 1,22 1,23 1,28 1,29 1,30 1,34 1,40 1,52 5}
{0 CHEMBL607467,1 1,2 1,3 1,4 1,5 1,6 1,7 1,8 1,9 1,10 1,11 1,12 1,13 1,16 1,17 1,20 1,22 1,23 1,28 1,29 1,30 1,34 1,40 1,52 5}
{0 CHEMBL607469,1 1,2 1,3 1,4 1,5 1,6 1,7 1,8 1,9 1,10 1,12 1,13 1,16 1,17 1,20 1,22 1,23 1,28 1,29 1,30 1,34 1,40 1,52 5.201}
{0 CHEMBL607470,2 1,3 1,4 1,5 1,6 1,7 1,8 1,9 1,10 1,11 1,12 1,13 1,16 1,17 1,20 1,22 1,23 1,28 1,30 1,34 1,40 1,52 5.658}
{0 CHEMBL607472,1 1,2 1,3 1,4 1,5 1,6 1,7 1,8 1,9 1,10 1,11 1,12 1,13 1,16 1,17 1,20 1,34 1,40 1,52 5.199}
{0 CHEMBL607473,1 1,2 1,3 1,4 1,5 1,6 1,7 1,8 1,9 1,10 1,11 1,12 1,13 1,16 1,17 1,20 1,22 1,23 1,28 1,30 1,34 1,40 1,52 5.599}
{0 CHEMBL607474,2 1,3 1,4 1,5 1,6 1,7 1,8 1,9 1,10 1,11 1,12 1,13 1,16 1,17 1,20 1,22 1,23 1,28 1,30 1,34 1,36 1,40 1,52 5.745}
{0 CHEMBL607475,1 1,2 1,3 1,4 1,5 1,6 1,7 1,8 1,9 1,10 1,11 1,12 1,13 1,16 1,17 1,20 1,22 1,23 1,28 1,30 1,34 1,40 1,52 5}
{0 CHEMBL607477,1 1,2 1,3 1,4 1,5 1,6 1,7 1,8 1,9 1,10 1,11 1,12 1,13 1,16 1,17 1,20 1,22 1,23 1,28 1,34 1,40 1,52 5}
{0 CHEMBL6450,14 1,15 1,21 1,34 1,36 1,37 1,38 1,40 1,52 6.097}
{0 CHEMBL6779,14 1,15 1,17 1,21 1,34 1,36 1,37 1,38 1,40 1,52 5.699}
{0 CHEMBL6997,14 1,15 1,21 1,34 1,36 1,37 1,38 1,40 1,52 5.796}
{0 CHEMBL7034,14 1,15 1,21 1,34 1,36 1,37 1,38 1,40 1,52 5.5}
{0 CHEMBL7122,14 1,15 1,21 1,34 1,36 1,37 1,38 1,40 1,52 6.5}
{0 CHEMBL7181,14 1,15 1,21 1,34 1,36 1,37 1,38 1,40 1,52 5.611}
{0 CHEMBL7214,14 1,15 1,21 1,34 1,36 1,37 1,38 1,40 1,52 5.523}
{0 CHEMBL7226,14 1,15 1,21 1,34 1,36 1,37 1,38 1,40 1,52 6.16}
{0 CHEMBL7306,14 1,15 1,21 1,34 1,36 1,37 1,38 1,40 1,52 5.611}
{0 CHEMBL7363,14 1,15 1,21 1,34 1,36 1,37 1,38 1,40 1,52 6.373}
{0 CHEMBL7486,14 1,15 1,21 1,34 1,36 1,37 1,38 1,40 1,52 6.699}
{0 CHEMBL7520,14 1,15 1,21 1,34 1,36 1,37 1,38 1,40 1,52 7.461}
{0 CHEMBL7753,14 1,15 1,21 1,34 1,36 1,37 1,38 1,40 1,52 8.699}
{0 CHEMBL832,14 1,15 1,16 1,21 1,40 1,52 5}
