"molecule_id","FCFP4_1024b1","FCFP4_1024b10","FCFP4_1024b100","FCFP4_1024b1000","FCFP4_1024b1001","FCFP4_1024b1002","FCFP4_1024b1003","FCFP4_1024b1004","FCFP4_1024b1005","FCFP4_1024b1006","FCFP4_1024b1007","FCFP4_1024b1008","FCFP4_1024b1009","FCFP4_1024b101","FCFP4_1024b1010","FCFP4_1024b1011","FCFP4_1024b1012","FCFP4_1024b1013","FCFP4_1024b1014","FCFP4_1024b1015","FCFP4_1024b1016","FCFP4_1024b1017","FCFP4_1024b1018","FCFP4_1024b1019","FCFP4_1024b102","FCFP4_1024b1020","FCFP4_1024b1021","FCFP4_1024b1022","FCFP4_1024b1023","FCFP4_1024b1024","FCFP4_1024b103","FCFP4_1024b104","FCFP4_1024b105","FCFP4_1024b106","FCFP4_1024b107","FCFP4_1024b108","FCFP4_1024b109","FCFP4_1024b11","FCFP4_1024b110","FCFP4_1024b111","FCFP4_1024b112","FCFP4_1024b113","FCFP4_1024b114","FCFP4_1024b115","FCFP4_1024b116","FCFP4_1024b117","FCFP4_1024b118","FCFP4_1024b119","FCFP4_1024b12","FCFP4_1024b120","FCFP4_1024b121","FCFP4_1024b122","FCFP4_1024b123","FCFP4_1024b124","FCFP4_1024b125","FCFP4_1024b126","FCFP4_1024b127","FCFP4_1024b128","FCFP4_1024b129","FCFP4_1024b13","FCFP4_1024b130","FCFP4_1024b131","FCFP4_1024b132","FCFP4_1024b133","FCFP4_1024b134","FCFP4_1024b135","FCFP4_1024b136","FCFP4_1024b137","FCFP4_1024b138","FCFP4_1024b139","FCFP4_1024b14","FCFP4_1024b140","FCFP4_1024b141","FCFP4_1024b142","FCFP4_1024b143","FCFP4_1024b144","FCFP4_1024b145","FCFP4_1024b146","FCFP4_1024b147","FCFP4_1024b148","FCFP4_1024b149","FCFP4_1024b15","FCFP4_1024b150","FCFP4_1024b151","FCFP4_1024b152","FCFP4_1024b153","FCFP4_1024b154","FCFP4_1024b155","FCFP4_1024b156","FCFP4_1024b157","FCFP4_1024b158","FCFP4_1024b159","FCFP4_1024b16","FCFP4_1024b160","FCFP4_1024b161","FCFP4_1024b162","FCFP4_1024b163","FCFP4_1024b164","FCFP4_1024b165","FCFP4_1024b166","FCFP4_1024b167","FCFP4_1024b168","pXC50"
{1 1,58 1,75 1,103 5.347}
{0 CHEMBL100765,1 1,58 1,103 5.076}
{0 CHEMBL101389,1 1,58 1,103 6.252}
{0 CHEMBL101581,1 1,58 1,70 1,103 5.076}
{0 CHEMBL101733,1 1,58 1,103 5.26}
{0 CHEMBL102191,1 1,58 1,70 1,103 5.824}
{0 CHEMBL29197,1 1,58 1,70 1,75 1,103 4.66}
{0 CHEMBL316662,1 1,58 1,103 4.159}
{0 CHEMBL321572,1 1,26 1,58 1,103 5.77}
{0 CHEMBL327300,1 1,58 1,103 6.886}
{0 CHEMBL327534,1 1,58 1,103 6.119}
{0 CHEMBL415501,1 1,58 1,103 6.222}
{0 CHEMBL431818,1 1,58 1,65 1,86 1,103 6.244}
{0 CHEMBL98137,1 1,58 1,103 5.585}
{0 CHEMBL98155,1 1,20 1,58 1,103 5.357}
{0 CHEMBL98169,1 1,58 1,103 4.889}
{0 CHEMBL98248,1 1,58 1,70 1,103 4.668}
{0 CHEMBL98583,1 1,58 1,103 6.357}
{0 CHEMBL98584,1 1,58 1,103 5.721}
{0 CHEMBL98798,1 1,58 1,65 1,70 1,86 1,103 4.83}
{0 CHEMBL98839,1 1,58 1,103 5.161}
{0 CHEMBL99272,1 1,58 1,103 6.155}
