{
  "data_set_description": {
    "collection_date": "November 2013",
    "creator": "Dr Jeremy Besnard, Dr Ivan Olier, Dr Noureddin Sadawi, Dr Larisa Soldatova, Dr Crina Grosan, Prof Ross King, Dr Richard Bickerton, Prof Andrew Hopkins and Dr Willem van Hoorn",
    "default_target_attribute": "pXC50",
    "description": "This dataset contains QSAR data (from ChEMBL version 17) showing activity values (unit is pseudo-pCI50) of several compounds on drug target ChEMBL_ID: CHEMBL4078 (TID: 17018), and it has 1468 rows and 1402 features (not including molecule IDs and class feature: molecule_id and pXC50). The features represent Molecular Descriptors which were generated from SMILES strings. Missing value imputation was applied to this dataset (By choosing the Median).",
    "description_version": "1",
    "file_id": "3290621",
    "format": "ARFF",
    "id": "25994",
    "licence": "Public",
    "md5_checksum": "5709363ff5e098ad43cfa63c87b5a880",
    "minio_url": "https://data.openml.org/datasets/0002/25994/dataset_25994.pq",
    "name": "QSAR-DATASET-FOR-DRUG-TARGET-CHEMBL4078",
    "original_data_url": "https://www.ebi.ac.uk/chembl/target/inspect/CHEMBL4078",
    "parquet_url": "https://data.openml.org/datasets/0002/25994/dataset_25994.pq",
    "processing_date": "2018-10-03 23:20:45",
    "row_id_attribute": "molecule_id",
    "status": "deactivated",
    "tag": [
      "MetaQSAR",
      "study_13"
    ],
    "upload_date": "2016-07-14T18:13:26",
    "url": "https://api.openml.org/data/v1/download/3290621/QSAR-DATASET-FOR-DRUG-TARGET-CHEMBL4078.arff",
    "version": "8",
    "visibility": "public"
  }
}