{
  "data_features": {
    "feature": [
      {
        "data_type": "nominal",
        "index": "0",
        "is_ignore": "false",
        "is_row_identifier": "true",
        "is_target": "false",
        "name": "molecule_id",
        "nominal_value": [
          "CHEMBL1161032",
          "CHEMBL1161033",
          "CHEMBL1161034",
          "CHEMBL1161035",
          "CHEMBL1427",
          "CHEMBL158599",
          "CHEMBL159471",
          "CHEMBL159640",
          "CHEMBL159758",
          "CHEMBL159908",
          "CHEMBL159960",
          "CHEMBL160043",
          "CHEMBL161609",
          "CHEMBL162255",
          "CHEMBL162751",
          "CHEMBL2159649",
          "CHEMBL2159650",
          "CHEMBL218291",
          "CHEMBL219568",
          "CHEMBL2311112",
          "CHEMBL236708",
          "CHEMBL236709",
          "CHEMBL236711",
          "CHEMBL262145",
          "CHEMBL269864",
          "CHEMBL269866",
          "CHEMBL270904",
          "CHEMBL271387",
          "CHEMBL285627",
          "CHEMBL288187",
          "CHEMBL292132",
          "CHEMBL297891",
          "CHEMBL298954",
          "CHEMBL299952",
          "CHEMBL301203",
          "CHEMBL309679",
          "CHEMBL309907",
          "CHEMBL310202",
          "CHEMBL310364",
          "CHEMBL311300",
          "CHEMBL311528",
          "CHEMBL315260",
          "CHEMBL345655",
          "CHEMBL349615",
          "CHEMBL351205",
          "CHEMBL351815",
          "CHEMBL352454",
          "CHEMBL354926",
          "CHEMBL367746",
          "CHEMBL405926",
          "CHEMBL407776",
          "CHEMBL415041",
          "CHEMBL41949",
          "CHEMBL473922",
          "CHEMBL51900",
          "CHEMBL54489",
          "CHEMBL55454",
          "CHEMBL55675",
          "CHEMBL56540",
          "CHEMBL56593",
          "CHEMBL57218",
          "CHEMBL591019",
          "CHEMBL600664",
          "CHEMBL601619",
          "CHEMBL78808",
          "CHEMBL79132",
          "CHEMBL79410",
          "CHEMBL79460",
          "CHEMBL79495",
          "CHEMBL79784",
          "CHEMBL79865",
          "CHEMBL8040",
          "CHEMBL81055",
          "CHEMBL81557",
          "CHEMBL81731",
          "CHEMBL81839",
          "CHEMBL81966",
          "CHEMBL82087",
          "CHEMBL82551",
          "CHEMBL83158",
          "CHEMBL83329"
        ],
        "number_of_missing_values": "0"
      },
      {
        "data_type": "numeric",
        "index": "1",
        "is_ignore": "false",
        "is_row_identifier": "false",
        "is_target": "false",
        "name": "O.",
        "number_of_missing_values": "0"
      },
      {
        "data_type": "numeric",
        "index": "2",
        "is_ignore": "false",
        "is_row_identifier": "false",
        "is_target": "false",
        "name": "Mp",
        "number_of_missing_values": "0"
      },
      {
        "data_type": "numeric",
        "index": "3",
        "is_ignore": "false",
        "is_row_identifier": "false",
        "is_target": "false",
        "name": "nO",
        "number_of_missing_values": "0"
      },
      {
        "data_type": "numeric",
        "index": "4",
        "is_ignore": "false",
        "is_row_identifier": "false",
        "is_target": "false",
        "name": "nHet",
        "number_of_missing_values": "0"
      },
      {
        "data_type": "numeric",
        "index": "5",
        "is_ignore": "false",
        "is_row_identifier": "false",
        "is_target": "false",
        "name": "AMW",
        "number_of_missing_values": "0"
      },
      {
        "data_type": "numeric",
        "index": "6",
        "is_ignore": "false",
        "is_row_identifier": "false",
        "is_target": "false",
        "name": "C.",
        "number_of_missing_values": "0"
      },
      {
        "data_type": "numeric",
        "index": "7",
        "is_ignore": "false",
        "is_row_identifier": "false",
        "is_target": "true",
        "name": "pXC50",
        "number_of_missing_values": "0"
      }
    ]
  }
}